harmony-alerts mailing list archives

Site index · List index
Message view « Date » · « Thread »
Top « Date » · « Thread »
From nom...@intel.com
Subject [build-test alert] FAILED Linux x86_64: reliability
Date Mon, 03 Dec 2007 23:10:14 GMT
svn.revision=600034
BUILD FAILED:
	Ant Error Message:
/export/users/cc/cc-reliability/scripts/cc-exec-adaptor.xml:104: The following error occurred
while executing this line: /export/users/cc/cc-reliability/adaptors/reliability/adaptor.xml:98:
Some reliability tests failed on /export/users/cc/cc-reliability/build/checkouts/snapshot/hdk/jdk/jre/bin/java

Date of build:	2007-12-03 12:58:27 +0600
Time to build:	971 minutes 38 seconds
Last changed:	12/03/2007 12:58:20
Last log entry:	snapshot

***********************************************************
Errors/Warnings:	(59)
            
[java] Java Result: 104
[java] Java Result: 104
[java] Java Result: 104
[java] Java Result: 104
[java] Java Result: 104
[java] Java Result: 104
[java] Java Result: 104
[java] Java Result: 104
[java] Java Result: 104
[java] Java Result: 104
[java] Java Result: 104
[java] Java Result: 104
[java] Java Result: 104
[java] Java Result: 104
[java] Java Result: 104
[java] Java Result: 104
[java] Java Result: 104
[java] Java Result: 104
[java] Java Result: 104
[java] Java Result: 104
[java] Java Result: 104
[java] Java Result: 104
[java] Java Result: 104
[java] Java Result: 104
[java] Java Result: 104
[java] Java Result: 104
[java] Java Result: 104
[java] Java Result: 134
[java] Java Result: 104
[java] Java Result: 104
[java] Java Result: 104
[java] Java Result: 104
[java] Java Result: 104
[java] Java Result: 104
[java] Java Result: 104
[java] Java Result: 104
[java] Java Result: 104
[java] Java Result: 104
[java] Java Result: 104
[java] Java Result: 104
[java] Java Result: 104
[java] Java Result: 104
[java] Java Result: 104
[java] Java Result: 104
[java] Java Result: 104
[java] Java Result: 104
[java] Java Result: 104
[java] Java Result: 104
[java] Java Result: 104
[java] Java Result: 104
[java] Java Result: 104
[java] Java Result: 134
[java] Java Result: 104
[java] Java Result: 104
[java] Java Result: 104
[java] Java Result: 104
[java] Java Result: 104
[java] Java Result: 134
The execution FAILED with the following exception:
The following error occurred while executing this line:
/export/users/cc/cc-reliability/adaptors/reliability/adaptor.xml:98: Some reliability tests
failed on /export/users/cc/cc-reliability/build/checkouts/snapshot/hdk/jdk/jre/bin/java

***********************************************************
Unit Tests: (58)
        
error: test api.kernel.compiler.JitCompilerTest
error: test api.security.SecurityClassRelatedTest
error: test vm.classloading.ClassCastTest
Unit Test Error Details:	(3)
                
Test: testClass: api.kernel.compiler.JitCompilerTestInternal error:/export/users/cc/cc-spec/build/checkouts/make-snapshot/working_vm/vm/vmcore/include/hashtable.h:269:
Element was inserted second time in MapEx!SIGABRT in VM code.
Stack trace:
  0: raise (??:-1)
  1: ?? (??:-1)
  2: java/lang/ClassLoader.registerInitiatedClass(Ljava/lang/Class;)V (ClassLoader.java:-2)
  3: java/lang/Class.forName(Ljava/lang/String;ZLjava/lang/ClassLoader;)Ljava/lang/Class;
(Class.java:156)
  4: org/apache/harmony/test/reliability/share/ClassMultiTestBase.run()V (ClassMultiTestBase.java:91)
  5: java/lang/Thread.run()V (Thread.java:657)
  6: java/lang/Thread.runImpl()V (Thread.java:668)
LTend of stack traceGT
Test: testClass: api.security.SecurityClassRelatedTestInternal error:/export/users/cc/cc-spec/build/checkouts/make-snapshot/working_vm/vm/vmcore/include/hashtable.h:269:
Element was inserted second time in MapEx!SIGABRT in VM code.
Stack trace:
  0: raise (??:-1)
  1: ?? (??:-1)
  2: java/lang/ClassLoader.registerInitiatedClass(Ljava/lang/Class;)V (ClassLoader.java:-2)
  3: java/lang/Class.forName(Ljava/lang/String;ZLjava/lang/ClassLoader;)Ljava/lang/Class;
(Class.java:156)
  4: org/apache/harmony/test/reliability/share/ClassMultiTestBase.run()V (ClassMultiTestBase.java:91)
  5: java/lang/Thread.run()V (Thread.java:657)
  6: java/lang/Thread.runImpl()V (Thread.java:668)
LTend of stack traceGT
Test: testClass: vm.classloading.ClassCastTestInternal error:/export/users/cc/cc-spec/build/checkouts/make-snapshot/working_vm/vm/vmcore/include/hashtable.h:269:
Element was inserted second time in MapEx!SIGABRT in VM code.
Stack trace:
  0: raise (??:-1)
  1: abort (??:-1)
  2: ?? (??:-1)
  3: log4cxx::Logger::getEffectiveLevel() const (apr_strtok.c:-1)
  4: ?? (??:-1)
  5: __write_nocancel (??:-1)
  6: ?? (??:-1)
  7: ?? (??:-1)
  8: _IO_file_write@@GLIBC_2.2.5 (??:-1)
  9: ?? (??:-1)
 10: ?? (??:-1)
 11: new_do_write (??:-1)
 12: ?? (??:-1)
 13: ?? (??:-1)
 14: __default_morecore (??:-1)
 15: ?? (??:-1)
 16: __gcc_personality_v0 (??:-1)
 17: ?? (??:-1)
 18: java/lang/ClassLoader.registerInitiatedClass(Ljava/lang/Class;)V (ClassLoader.java:-2)
 19: java/lang/Class.forName(Ljava/lang/String;ZLjava/lang/ClassLoader;)Ljava/lang/Class;
(Class.java:156)
 20: org/apache/harmony/test/reliability/share/ClassMultiTestBase.run()V (ClassMultiTestBase.java:91)
 21: java/lang/Thread.run()V (Thread.java:657)
 22: java/lang/Thread.runImpl()V (Thread.java:668)
LTend of stack traceGT

***********************************************************
Modifications since last successful build:	(2)
            
add cc-snapshot log20071203125820Lbuild.28 12/03/2007 12:58:20snapshot
add cc-snapshot log20071130105935Lbuild.27 11/30/2007 10:59:35snapshot

begin 644 execution_log.zip
M4$L#! H    ( $,IA#?RY[$(%@4  &(B   2    97AE8W5T:6]N7VQO9RYH
M=&ULQ5IM3^,X$/[.K_"7TWXBX>7NENWUD"!MV:[*LFI@D18AY#K3QM2Q(]LI
ME%^_XZ1P+11H2I.KVL:./7[FS?:,DV9L$W'8'*AH>MA,-1PV*3%V*N#?3T,E
M[;;A#] @!SM__//I<"M+(VIAVTQD8VM+9_A/W.?JED[H-3G.N(B&7&!_;//N
M$['0G!>3<<3U-0DTX$ 1P4J#^'"?*FW]S( V/F/XW=8@.!UPP>W4'[AQ?18#
M&ZO,&G^^S4*2;A)%@\G$,XR]G9W/V[M[VSO[-[M[?QTLP"U4G-0TY=X#3QLO
MF")7P&)U3?J9E%R.B 5C&V36W3N*!.B@'^SOG>/])<1%^1O^DW[.8X/L[OQ9
M$N7D%T^[\BRSH475)%5"=>50M& H3L#B(&"KQ*I/JE^"#YQ4Z%:Z!AS46XLS
MRY6D>EHUGAL?-8BBC:8]F,#+V;MAL)]4XQP3T ,YLO%Z:$OGWQBT!.%1/3)E
MYN$<F7>4IC]/@]X/JJMSJ'F\]CVPMIS4 97+I54*VG(PZR.^I7I <1HK]XZ5
M&J]CJ9P.E\ZHGX2QC>[D5W>C&HG4X!:878/)@M [RR^!4!(J-O("8(=+*G +
MKQ,3EWPFJ#%?J8F9BCZ _99!4C8>K>YBQFID? WS%82XG1F0AEL^J5J53X"X
MQ<A:L6+</2.LUP,:YI>/BOF6S6TNT!HV+PB10\K&YYJRW.3/JA4JJ( ?:96E
M7EMF";@]N19,K_"!,#,IR,@-F,"R>]4S$E#!,@RS,/3)R_6('TXEB[62_*% 
MGM7_=_"]ZM$O@8[[, 0-D@&546'UW/%?;ZIDSJH[%Q2NOK0G5-(1)"#7V9W_
M(T9]&\PFD6F5:09GFN--J$A,II(4$V6]!L>/I-XW;H-9N023^RLSN8(%+-R7
M4KKK[QVC]XR[UJUJ2M\<"=%3C HP5?AX#M@"QA,J.DHGU-Y4C38">S2A7.29
M38%U$RBQ9C:U5.V2*X_%5&-Z6$;[<V1>H*2E7'X@6%X=JRT9FJ F).4BF%.,
M.FL1[1+7ZU%05+[39-.A[@Q*XFPLE1_-TWGN1&Y6\8+BVNF>A16K9PFV2J<=
MK%=MF)?(#G4F^2E-*[#1(!OB]EC:1#,R[WAJX3@O4R%PR;#0XAH3J2H5]1+;
M;2:T;M ?F2T*=<"ZB5J@A8)7%\8OA[S4-#VI[AST== Z$%LJP^VN=D$[0E%;
M.RKFK+5C]G"?J1TTC)7>E*BOK9TK1)G/.[TM /+?/=LTGR4#+8P,OH,-A$LA
M-L3&)/&,.X!X1U_8+3][PXD1E3CP>D;F!:X24%/&X.]E%H@Q+$XC\_RV!&OS
M9-[CB6:%B1I"PCV#U.&MO*DO$'GMI^)F^1JQ$OR,V&/N7DG,52"<!!N5<(7U
M(+-<E)F.KK]+>%BF-;K*AM<& S@NM],R'#W2>.&LD,^W/KCGBF4<>95DWH#F
MKTRZY_W?:#V^Z/9:)+P(@G88=BYZ"XWGRE)!+$^@0;Y\WB4)EQD*2_;W"4JJ
M9)1GVU<1"+!P35KNZA2RN_N9N#C=D*%6R0>>T*/V'E7&,,NX)B[7*!#^GB%8
M]='QM\YC(.[!5N8T23I'W5Z[1>ZXC8G%EB'F^.K.@3XM XV<9*Y!:Z6)8KDC
M1N0N1LX>1W3^$7-#!)?0V'J/51K1U"J]R.7LIGOQHO'EH$%"E0"9ZY [(.J:
M(FQ$4(2R+UX825,3*^O'T=B_=3\-_H!+W[G!5M.GATT_?X7$+UXG\?-W2WX#
M4$L! A0#"@    @ 0RF$-_+GL0@6!0  8B(  !(              *2!    
I &5X96-U=&EO;E]L;V<N:'1M;%!+!08      0 ! $    !&!0     ! 
end

Mime
View raw message