harmony-alerts mailing list archives

Site index · List index
Message view « Date » · « Thread »
Top « Date » · « Thread »
From nom...@intel.com
Subject [build-test alert] FAILED Windows 2003 x86: ehwa
Date Sun, 02 Dec 2007 15:18:02 GMT
svn.revision=600034
BUILD FAILED:
	Ant Error Message:
C:\cc\cc-suites\scripts\cc-exec-adaptor.xml:104: The following error occurred while executing
this line: C:\cc\cc-suites\adaptors\ehwa\adaptor.xml:85: The following error occurred while
executing this line: C:\cc\cc-suites\scripts\framework.xml:1070: Java returned: 1

Date of build:	2007-12-02 05:41:53 +0600
Time to build:	936 minutes 3 seconds
Last changed:	12/01/2007 19:04:44
Last log entry:	snapshot

***********************************************************
Errors/Warnings:	(47)
            
[exec] Result: 1
[echo]
[echo]
[echo] ========================== EHWA.log =======================
[echo]
[echo] --- Automated Eclipse EHWA scenario for Eclipse 3.2.1 ---
[echo]
[echo] Eclipse Home = C:\cc\cc-suites/build/libs/eclipse-3.2.1-win-x86/eclipse
[echo] Tested JRE = C:\cc\cc-suites/build/checkouts/snapshot/hdk/jdk/jre
[echo] Tested JRE options for Eclipse launching =
[echo] Delay factor = 2
[echo]
[echo] Start:
[echo] 	Run Eclipse
[echo] 	Wait Eclipse 'Workspace Launcher' window to appear
[echo] 	WARNING! Window 'Workspace Launcher' didn't become active during 30c. Add extra delay
for 120c.
[echo] 	ERROR! Window 'Workspace Launcher' didn't become active during additional 120c. STOP.
[echo]
[echo] An ERROR has ocurred!
[echo]
[echo] Exit Eclipse:
[echo] 	Eclipse wasn't found
[echo]
[echo] EHWA FAILED!
[echo]
[echo] ======================= eclipse.log =======================
[echo] Install location:
[echo]     file:/C:/cc/cc-suites/build/libs/eclipse-3.2.1-win-x86/eclipse/
[echo] Configuration file:
[echo]     file:/C:/cc/cc-suites/build/libs/eclipse-3.2.1-win-x86/eclipse/configuration/config.ini
loaded
[echo] Configuration location:
[echo]     file:/C:/cc/cc-suites/build/libs/eclipse-3.2.1-win-x86/eclipse/configuration/
[echo] Framework located:
[echo]     file:/C:/cc/cc-suites/build/libs/eclipse-3.2.1-win-x86/eclipse/plugins/org.eclipse.osgi_3.2.1.R32x_v20060919.jar
[echo] Framework classpath:
[echo]     file:/C:/cc/cc-suites/build/libs/eclipse-3.2.1-win-x86/eclipse/plugins/org.eclipse.osgi_3.2.1.R32x_v20060919.jar
[echo] Debug options:
[echo]     file:/C:/cc/cc-suites/tests/ehwa/.options not found
[echo] Time to load bundles: 234
[echo] Starting application: 8937
[echo] Application Started: 56152795
[echo]
[echo] ===========================================================
BUILD FAILED
C:\cc\cc-suites\tests\ehwa\ehwa_run.xml:210: EHWA FAILED!
Total time: 935 minutes 58 seconds
The execution FAILED with the following exception:
The following error occurred while executing this line:
C:\cc\cc-suites\adaptors\ehwa\adaptor.xml:85: The following error occurred while executing
this line:
C:\cc\cc-suites\scripts\framework.xml:1070: Java returned: 1

***********************************************************
Unit Tests: (0)
        
No Tests Run: This project doesn't have any tests

***********************************************************
Modifications since last successful build:	(1)
            
add cc-snapshot log20071201190444Lbuild.44 12/01/2007 19:04:44snapshot

begin 644 execution_log.zip
M4$L#! H    ( #VJ@C>O8JW_IP0  +04   2    97AE8W5T:6]N7VQO9RYH
M=&ULU5C?3]M($'XF$O_#].'$R\5.0L,/7T!**6VI4%NEG'@@%=JL)_&"X[5V
MUR'<7W^SZR2-:>SD(@HZ"P+.SLY\.[,S\^UV(C..3SL#&3Z>=E*%IQT&VCS&
M>+(WE(FI:_$/!G#4^..OO=/=6I:&S&!=3Y)@M[9;4YG]"_:YN6,3]@/>92(.
MAR*F.1@]L%N2\*;CN"A4?/M52?X_\DC^@'J]#KTL@?-/UUW0'!.FA 29@(D0
MAC*.Y8-(1L!E,A2C3#$C:(PFE6N\0FTPA,^]<SB!LZ#/.?W4=28,:G]@\?L\
M0GXO,Z-]G;!41]+X47COW]E?A1NIEJE%HLE$N?@YCT6J$3[),99BB<5 ^YA+
MUO>]EM>LTXKKTZ.#^;?E!MYCS!YAR+B1B@RT*MV\W5,56>=&CV5&"A.L%S3.
M>QYY> /AV=HWE_0FJ#2%I&*OG<7($KN;YH$I[BK/\\KG?F<3!$8STD>0PQ(-
M1FX=9+^@R1LP?I^EJ^!8!+04^K0K.3@$FXUZA>F^,]VWIOLK3<^_[6]D^B;$
M& VZ38?&V@Z%0KOS'I_)<E^JT2*:4H_$:V/@4J%'Y<N(\:])^,)8\LK\&B@\
MC<9JUN7)T<.QG"PGUH-4]SIE'%<FU7\!;8L&X:5>TU\H79/AD*6N.8&=:U57
M9_:90N9 *-19;/02F)7S;L;W)#&;1]V 7H(27\\TYO!;C<9AL]5HW3;:;YL5
MA<8P98KML%SX&ZU7XY^@$4LJSPR";R'X!0B^M>'%<D1M5D&(AHEX=8RGR&V,
MK:( FE45.54B,=Z0-'ECU)J-GA;P9?#E(Q5#)Z4/+-93)K -%,M/NM3AQB[6
M\_U=9"O6?_,1EU'5!.45"</+<J-EO\0L2WADTZPJ#IL3FC4)5+'M=AS=7.>I
MG6LFS +]WO6BH%VZA:#: _)Z*!]LYV5IBDQ58-JY[O:^7'SY^ :N\TDK%88B
M3/8,#)#;^),3!'&.,%/6:_L-[D$W# &G1C%*5^<H\A+E,Z^H;COGO=[7WO9V
M61@*&TT6YY;@^]77;Q7VRD>ZY'6+!2*F0?),*0S?;)4ETY^1":J<ONA&3-OU
M#666A%L9M-G^H7MQ>?Z^ O 650OFW7V[JG61:,/B&&+)7:NNV/3V<<<V_RSP
M.?>W(*@5';1 @IV9WXJDP$]F;YY(!#F"A5@1XB+0EW%;$6RYJ0^*C=%2G!P7
MAK\75AIG(Y%H_RGGOG7B7F^_-;V=$%\X:!PWC[T[IC9!SF.FJ;B8Z'^ O7B.
M:CI,Y:>H9297U;X&V6C>_K;R@:.[.5GSYFTTD6MKUQ6=4"QXFP P(%$Z$@;0
MVG^[IDVZ"I^FL9AE AP=[Q]6E/"?HOE\VJ70/FBV6X?'[6>F<VN?*A[Z[N^+
MR_>SDET<J3A?+%]H!:UF(Z@H_,6W*TEU&.PQ,8#C_3:,19*18F@?$3.G A 2
MKZY=10B62F?.?;E6XA F>G+5A5..+O*!F[(TH!3U>\GSU@D/D=VQ,XTT;"*A
M(1:)+;Y/5\E"EA*EFBUT]N;6>=0.X-G,:*Y$2NX<SBN",]%L')(O/Y.GZ(AE
M,I787=.L[=8Z/COM^.Y2TL\O*'UW6_DO4$L! A0#"@    @ /:J"-Z]BK?^G
M!   M!0  !(              *2!     &5X96-U=&EO;E]L;V<N:'1M;%!+
4!08      0 ! $    #7!      ! 
end

Mime
View raw message