harmony-alerts mailing list archives

Site index · List index
Message view « Date » · « Thread »
Top « Date » · « Thread »
From nom...@intel.com
Subject [build-test alert] FAILED Linux x86: ehwa
Date Sat, 01 Dec 2007 18:31:32 GMT
svn.revision=600034
BUILD FAILED:
	Ant Error Message:
/export/users.2/cc/cc-suites/scripts/cc-exec-adaptor.xml:104: The following error occurred
while executing this line: /export/users.2/cc/cc-suites/adaptors/ehwa/adaptor.xml:85: The
following error occurred while executing this line: /export/users.2/cc/cc-suites/scripts/framework.xml:1070:
Java returned: 1

Date of build:	2007-12-02 00:21:26 +0600
Time to build:	10 minutes 0 seconds
Last changed:	12/01/2007 19:53:22
Last log entry:	snapshot

***********************************************************
Errors/Warnings:	(91)
            
[exec] Result: 25
[echo]
[echo]
[echo] ========================== EHWA.log =======================
[echo]
[echo] Eclipse Home = /export/users.2/cc/cc-suites/build/libs/eclipse-3.2.l-lnx-x86/eclipse
[echo] Tested JRE = /export/users.2/cc/cc-suites/build/checkouts/snapshot/hdk/jdk/jre
[echo] Tested JRE options for Eclipse launching =
[echo] Delay factor = 2
[echo]
[echo] --- Automated EHWA scenario for Eclipse 3.2.1 ---
[echo]
[echo] Start:
[echo]
[echo] Run Eclipse
[echo] Select workspace
[echo]  wait window 'Workspace Launcher' to appear ...
[echo]  window 'Workspace Launcher' appeared
[echo] Press 'OK' button
[echo]  wait window '' to close ...
[echo]  window '' successfully closed
[echo] Close Welcome page
[echo]  wait window 'Java - Eclipse SDK' to appear ...
[echo]  window 'Java - Eclipse SDK' appeared
[echo] Create new project
[echo]  wait window 'New' to appear ...
[echo]  window 'New' appeared
[echo] Select new Java project
[echo]  wait window 'New Java Project' to appear ...
[echo]  window 'New Java Project' appeared
[echo] Type 'EHWA' as project name
[echo] Press 'Finish' button
[echo]  wait window 'New Java Project ' to close ...
[echo]  window 'New Java Project ' successfully closed
[echo] Create new Java class
[echo]  wait window 'Java - Eclipse SDK' to appear ...
[echo]  window 'Java - Eclipse SDK' appeared
[echo]  wait window 'New' to appear ...
[echo]  window 'New' appeared
[echo] Select new Java class for 'EHWA' project
[echo]  wait window 'Java Class' to appear ...
[echo]  window 'Java Class' appeared
[echo] Type 'EHWA' as class name, press 'Finish' button
[echo] Select the 'public static void main(String[] args)' checkbox
[echo] Press 'Finish' button
[echo]  wait window 'New Java Class ' to close ...
[echo]  window 'New Java Class ' successfully closed
[echo] Put System.out.println("Hello, world"); into EHWA class
[echo]  wait window 'Java - EHWA.java - Eclipse SDK' to appear ...
[echo]  window 'Java - EHWA.java - Eclipse SDK' appeared
[echo] Save EHWA class
[echo] Run EHWA class
[echo] Exit Eclipse
[echo]  wait window 'Java - EHWA.java - Eclipse SDK' to appear ...
[echo]  window 'Java - EHWA.java - Eclipse SDK' appeared
[echo]  wait window 'Java - EHWA.java - Eclipse SDK ' to close ...
[echo] ERROR: Failed to close 'Java - EHWA.java - Eclipse SDK ' window during 240 sec!
[echo]
[echo] Print error screen picture:
[echo] 	Picture was saved to /export/users.2/cc/cc-suites/build/results/ehwa/20071202_1221/error.xwd.
Use 'xwud -in error.xwd' to view the saved file.
[echo]
[echo] Kill Eclipse:
[echo] 	Found 1 Eclipse processes
[echo] 	Process 0:
[echo] 	Eclipse process was killed
[echo]
[echo]
[echo] EHWA FAILED!
[echo]
[echo] ======================= eclipse.log =======================
[echo] Install location:
[echo]     file:/export/users.2/cc/cc-suites/build/libs/eclipse-3.2.l-lnx-x86/eclipse/
[echo] Configuration file:
[echo]     file:/export/users.2/cc/cc-suites/build/libs/eclipse-3.2.l-lnx-x86/eclipse/configuration/config.ini
loaded
[echo] Configuration location:
[echo]     file:/export/users.2/cc/cc-suites/build/libs/eclipse-3.2.l-lnx-x86/eclipse/configuration/
[echo] Framework located:
[echo]     file:/export/users.2/cc/cc-suites/build/libs/eclipse-3.2.l-lnx-x86/eclipse/plugins/org.eclipse.osgi_3.2.1.R32x_v20060919.jar
[echo] Framework classpath:
[echo]     file:/export/users.2/cc/cc-suites/build/libs/eclipse-3.2.l-lnx-x86/eclipse/plugins/org.eclipse.osgi_3.2.1.R32x_v20060919.jar
[echo] Debug options:
[echo]     file:/export/users.2/cc/cc-suites/tests/ehwa/.options not found
[echo] Time to load bundles: 114
[echo] Starting application: 5334
[echo] Application Started: 63882
[echo]
[echo] ===========================================================
BUILD FAILED
/export/users.2/cc/cc-suites/tests/ehwa/ehwa_run.xml:210: EHWA FAILED!
Total time: 9 minutes 59 seconds
The execution FAILED with the following exception:
The following error occurred while executing this line:
/export/users.2/cc/cc-suites/adaptors/ehwa/adaptor.xml:85: The following error occurred while
executing this line:
/export/users.2/cc/cc-suites/scripts/framework.xml:1070: Java returned: 1

***********************************************************
Unit Tests: (0)
        
No Tests Run: This project doesn't have any tests

***********************************************************
Modifications since last successful build:	(1)
            
add cc-snapshot log20071201195322Lbuild.57 12/01/2007 19:53:22snapshot

begin 644 execution_log.zip
M4$L#! H    ( .X#@C<'R\+"(08  #4@   2    97AE8W5T:6]N7VQO9RYH
M=&ULU5IM3]M($/Y<?L5<I5-:J;&34"BD%(D64-]T18&J'U"%-NM)LK#Q6MYU
M7N[7W^S:H0EDG3AMH6>UB.#9V6=FY^7Q. <#,Y2'!UT530\/DA0/#QAH,Y7X
MIM93L:EK\2^V8:_Q]^O:X5:61,Q@78_B]M96FM%/L-?E-1NQ[_ V$S+J"4GR
M.!BS*Q(()D.Y(+/PX9Z&_'?D _4=ZO4Z=+(83MY_.P+-,6:I4*!B, .$GI)2
MC47<!Z[BGNAG*3."[M$BK\(+U 8C^-@Y@3<0XB11J0DSC:D.6B'G]*^N,V%0
MAUUK2,@'R&]49G2H8Y;H@3+A(+H)K^W_%-?91B46E*;MO-(G7(I$([Q70UP/
MEA1='6*^K+X=M )9E_&D/MG;G?W5N]DQ2C:%'N-&I;19J\SWFUW^LW;>#%AF
ME##M56+&^3 @-Z\4+6Q>5RX8D6/I4/QQ]TXBBVUDS8YF,<*"(/ N/6<C!$8+
MDBFHGD>!4;_FE,,%M4&7\9LL60+-HB&KZ*<U:O<5V S5#POC,D*)!ET$HK$X
M(I&B#</I[T 1JK1_>^!*]\6?A(>K% .J?$8,[V7J8^+*:_MC(PHT&KN-]B99
M!X=J-)^?8Y7>Z(1Q7):;&^.W)8B@4Q\+;S<HKQF0):[O@5UJMRFM%>]29 Y/
MBCJ31L_A6K;L<GA# L4R:B_TH;W. 13:<T-:C<:K9JO1NFJV6DU_%3,L-8MM
MURM[1H9K? $:\>?0A':_0*H^M?84(C1,R*4Q,$%.7;/3^=)IPRD)D2^HE'&I
M*!)J'TD2Z@Y[<%W\7D3)^?$GJ %1ADB-(<I2Z_K6RP8AYW\!,Q X4%=%5%[9
M6&T&B00I8B3![:4GZ<!TG%%M:.WX>U!"^YF@1WB#(6K-^NAO0-X;_CMOO!?<
M^M4G4!W'@W*6QV-M-A!GIDJ6Q7Q@8Z;$87?IU0:NM:3WB#C2T"7Y(O6=Q^/"
MTTE7W\/E=WN#A8Z-%P#\VJG.<C-7E/WA/&;"S#*R]NUVP6?G:TQK-K%9DB K
MKZ2E*O+U&*TD1DW'B]:D1?-US%\;24I#[<NG&G0S8XCZK>F*VH^*MI;=-= 9
MY[19+Y-RFJ^,_)N]<YJ_H>0V?Q.J1>L"^WBOI%8^HV4J2LYHKE<BQ#BF0JJN
M;7RMB?@?'%>&Z-:LQ%3$N<7D;*H.+%]WEJ_;!.4=!2LA7TP3ZI&VJ)"POD4<
MLV%)!!11?"IBH0=5(_DN2*@:VDL45(OU'Y'CU'#)R)H_/-P?*X1SY]@V4P1)
MQ9AV2MY9)9OYJ5A:-8YSV#:*7Q#B2M%:>,!.E&I)UI6"@S9$RSF,E(A@R$3\
M[-Q8KGCY'5C:U\]K^3BAJR:_.V6<-S9/F-GR2NEREADXGQ(3&@9$H0+'6F7\
M[.E[E%*]L$U=1D^?OP;ZL\K9R48)M9R>;YQ</G6K$\#.:]8QXW8.N4+N9$+6
MKJ1(?[93JJ!;-SQ_]?-:=>YZ9D,9,$VINFF>(L:0"&ZR%$N8\).S7(1<HD%3
ML$0;\,,[S[D.0C 91P%\M2Z8C+,(ZB*&VQO.IR-!B6SK4KZMY:;!!F9_$E+.
M7%IFZ*G*XH@X\,S[5/EMU<"26']RELM HTSQ'87.DS<$JJP*;?!$:G/S].C#
MYY/CDN"H_@ -L^'81@_0'V)J)N1_J;@;;OD?^>WE7IS\FI&:GPXM3*+=C@^%
M:7',EW\*J$.2=UA4QOT7(#^X*Q=A>W<]38E^V&?>'"%&#P8PD5E?Q/K>R+N8
M8'6V6Y.K$96@W<9^<Y^*;+J&#:[+)<P,_H=6'&,WZ\]F.#^+?VX(',S&0K$R
MQ)&I7/KYJ1BZ08*-;&)_<211MZ'9?%D^DK$=CKHSD= \Q&%G>]N_Y.B'9+Z<
M8@YVM_?V_&_U-ID?KKS\,\^W7S]\/BZJ\L*-=5T^_Q*YW6I2GYFO\_Z-+Q25
M7;#O5]JP#T,19Z04=O8M=U!QI+>V+JBQVN%MYMR7*R2N809W7B[CA&.2UYN+
MQ1N.2"C.LY2X%(P'=G94:*3;9B"TFQRWMTJ-91%+C$H+>XM/SMR]G3;\EBV)
M_(B$/-R;9;O;KMEX1>YU="Q%HCRQC:;FUD'(#@]"]ZV ,/^&0.B^+O ?4$L!
M A0#"@    @ [@."-P?+PL(A!@  -2   !(              *2!     &5X
F96-U=&EO;E]L;V<N:'1M;%!+!08      0 ! $    !1!@     ! 
end

Mime
View raw message