harmony-alerts mailing list archives

Site index · List index
Message view « Date » · « Thread »
Top « Date » · « Thread »
From nom...@intel.com
Subject [build-test alert] FAILED Linux x86_64: ehwa
Date Sat, 01 Dec 2007 16:26:43 GMT
svn.revision=600034
BUILD FAILED:
	Ant Error Message:
/export/users/cc/cc-suites/scripts/cc-exec-adaptor.xml:104: The following error occurred while
executing this line: /export/users/cc/cc-suites/adaptors/ehwa/adaptor.xml:85: The following
error occurred while executing this line: /export/users/cc/cc-suites/scripts/framework.xml:1070:
Java returned: 1

Date of build:	2007-12-01 22:16:42 +0600
Time to build:	9 minutes 56 seconds
Last changed:	12/01/2007 20:02:27
Last log entry:	snapshot

***********************************************************
Errors/Warnings:	(91)
            
[exec] Result: 25
[echo]
[echo]
[echo] ========================== EHWA.log =======================
[echo]
[echo] Eclipse Home = /export/users/cc/cc-suites/build/libs/eclipse-3.2.1-lnx-x86_64/eclipse
[echo] Tested JRE = /export/users/cc/cc-suites/build/checkouts/snapshot/hdk/jdk/jre
[echo] Tested JRE options for Eclipse launching =
[echo] Delay factor = 2
[echo]
[echo] --- Automated EHWA scenario for Eclipse 3.2.1 ---
[echo]
[echo] Start:
[echo]
[echo] Run Eclipse
[echo] Select workspace
[echo]  wait window 'Workspace Launcher' to appear ...
[echo]  window 'Workspace Launcher' appeared
[echo] Press 'OK' button
[echo]  wait window '' to close ...
[echo]  window '' successfully closed
[echo] Close Welcome page
[echo]  wait window 'Java - Eclipse SDK' to appear ...
[echo]  window 'Java - Eclipse SDK' appeared
[echo] Create new project
[echo]  wait window 'New' to appear ...
[echo]  window 'New' appeared
[echo] Select new Java project
[echo]  wait window 'New Java Project' to appear ...
[echo]  window 'New Java Project' appeared
[echo] Type 'EHWA' as project name
[echo] Press 'Finish' button
[echo]  wait window 'New Java Project ' to close ...
[echo]  window 'New Java Project ' successfully closed
[echo] Create new Java class
[echo]  wait window 'Java - Eclipse SDK' to appear ...
[echo]  window 'Java - Eclipse SDK' appeared
[echo]  wait window 'New' to appear ...
[echo]  window 'New' appeared
[echo] Select new Java class for 'EHWA' project
[echo]  wait window 'Java Class' to appear ...
[echo]  window 'Java Class' appeared
[echo] Type 'EHWA' as class name, press 'Finish' button
[echo] Select the 'public static void main(String[] args)' checkbox
[echo] Press 'Finish' button
[echo]  wait window 'New Java Class ' to close ...
[echo]  window 'New Java Class ' successfully closed
[echo] Put System.out.println("Hello, world"); into EHWA class
[echo]  wait window 'Java - EHWA.java - Eclipse SDK' to appear ...
[echo]  window 'Java - EHWA.java - Eclipse SDK' appeared
[echo] Save EHWA class
[echo] Run EHWA class
[echo] Exit Eclipse
[echo]  wait window 'Java - EHWA.java - Eclipse SDK' to appear ...
[echo]  window 'Java - EHWA.java - Eclipse SDK' appeared
[echo]  wait window 'Java - EHWA.java - Eclipse SDK ' to close ...
[echo] ERROR: Failed to close 'Java - EHWA.java - Eclipse SDK ' window during 240 sec!
[echo]
[echo] Print error screen picture:
[echo] 	Picture was saved to /export/users/cc/cc-suites/build/results/ehwa/20071201_1016/error.xwd.
Use 'xwud -in error.xwd' to view the saved file.
[echo]
[echo] Kill Eclipse:
[echo] 	Found 1 Eclipse processes
[echo] 	Process 0:
[echo] 	Eclipse process was killed
[echo]
[echo]
[echo] EHWA FAILED!
[echo]
[echo] ======================= eclipse.log =======================
[echo] Install location:
[echo]     file:/export/users/cc/cc-suites/build/libs/eclipse-3.2.1-lnx-x86_64/eclipse/
[echo] Configuration file:
[echo]     file:/export/users/cc/cc-suites/build/libs/eclipse-3.2.1-lnx-x86_64/eclipse/configuration/config.ini
loaded
[echo] Configuration location:
[echo]     file:/export/users/cc/cc-suites/build/libs/eclipse-3.2.1-lnx-x86_64/eclipse/configuration/
[echo] Framework located:
[echo]     file:/export/users/cc/cc-suites/build/libs/eclipse-3.2.1-lnx-x86_64/eclipse/plugins/org.eclipse.osgi_3.2.1.R32x_v20060919.jar
[echo] Framework classpath:
[echo]     file:/export/users/cc/cc-suites/build/libs/eclipse-3.2.1-lnx-x86_64/eclipse/plugins/org.eclipse.osgi_3.2.1.R32x_v20060919.jar
[echo] Debug options:
[echo]     file:/export/users/cc/cc-suites/tests/ehwa/.options not found
[echo] Time to load bundles: 120
[echo] Starting application: 4149
[echo] Application Started: 59128
[echo]
[echo] ===========================================================
BUILD FAILED
/export/users/cc/cc-suites/tests/ehwa/ehwa_run.xml:210: EHWA FAILED!
Total time: 9 minutes 54 seconds
The execution FAILED with the following exception:
The following error occurred while executing this line:
/export/users/cc/cc-suites/adaptors/ehwa/adaptor.xml:85: The following error occurred while
executing this line:
/export/users/cc/cc-suites/scripts/framework.xml:1070: Java returned: 1

***********************************************************
Unit Tests: (0)
        
No Tests Run: This project doesn't have any tests

***********************************************************
Modifications since last successful build:	(1)
            
add cc-snapshot log20071201200227Lbuild.48 12/01/2007 20:02:27snapshot

begin 644 execution_log.zip
M4$L#! H    ( %.S@3?8(R)\(@8  "P@   2    97AE8W5T:6]N7VQO9RYH
M=&ULU5I;;]I*$'XNOV).I2-:J=A DS2A::0T%_6FTXBDRD-41<MZ@$T6K^5=
M<SF__LRN#84$&TQSZ;'2*-2SL]_,?G/QF/V^&<B#_8X*)@?[48P'^PRTF4C\
M4.VJT-2T^!=;L%O_^WWUH))$ 3-8T\.P5:G$"?T&>UW=L"'["1\3(8.ND"2/
M_1&[)@%O/) +,@L?[FE(_T;>5S^A5JM!.PGAY-/E(6B.(8N% A6"Z2-TE91J
M),(><!5V12^)F1%TCQ;E*KQ ;3" +^T3^  ^CB,5&S_1&&N?<_JIZ408U'['
MFN'S/O);E1CMZY!%NJ^,WP]N_1O[+\9U-E&1A:1ILUSI$RY%I!$^J0&N TJ*
MCO8Q751[ZS6]1DV&X]IX=^=Z9VMZ(W>W8Y1L EW&C8IIMV:1ZS>[\H_:N=-C
MB5'"M%:)&>=$C_R\4C2S>5TY;TB>I5/)I]V11!9:8DW/9I%@GN?E+CUG0P1&
M"Z()J&Z. J,>Z)C]!;U>A_';)%J"S<(AL^BWM6IG%VR$ZB?&<16@1(..@V@L
MD$#$:(DX>108OHI[LS-7NB?^*$!<Q>A1\C-B<"]:GQ58FM^?'9*GT=A]=&ZH
MM7&@AO-1.E+QK8X8QV41NJ$!-@T1=BIE_DQ]<=Z )'*E#^Q2NTEAOCB*D3DT
M,>I$&CV':MFRJ\$M"63+J,;0A]9J_V>Z4S.:]?J[1K/>N&[4&SOY><RPV"S6
MW5S9,S);XQO0B+^#Q;>[>5+UJ++'$*!A0BX]_3%R*IOM]O=V"TY)B/Q F8Q+
M11RH?B%)J#GDWDWV=\:/\^.O4 7J& (U@B")K=N;6W7"S?\"9L!SH*XS/EX[
MHGJ1!"E"),&W2T_1@6D[HUK0W,ZO0?,>6[@1$1#C=<D0;X!:LQ[F5Z9\E1]R
M+YCY-4]@/9SS-YZV:7FNKLWR<&JI9$G(^Y8R!?ZZVUUMX%G;\AY2BS1P\;W8
M^,[C<4YTTN7W<,'=VF"AZ\4S /G:*<%R,Y>-\]D\8L), [)Z.5OPS?D:XZJ-
M:Q9%R(J3:*&*=#T&^>F+4I*&ZO>O5>@DQE!_MB;@ZJ^TLQ:Z*NB$<]JLFT@Y
M25<&^9L=.<V7*+D-LHCRPKK OMS+>Z4]N4S%2D^F50E"'%%24S>6!6LB_@='
MI2&Z-2LQ96RTF)Q-Y8&EZ\[2=9N@O*-@)>2+242%S(8^">L9XI -"AB0L?A4
MA$+WRS+Y+D@H2^TE"LIQ_1=SG!HN&5GSA]/]N2B<.L<6@XPD)3GME!Q9)9OY
M*5M:EL<I;,OB-X2X%%LS#]BI3S5*.E)PT(;Z9@Y#)0(8,!&^.C>VH;OZ"2SN
MZ=?5])F_H\:/'3+.&YL'S'1YJ7 Y2PR<3ZA?&7C4Z'BN@Y3AJY>?4$KUQI9>
M&;Q\_1[HOU7:0VP44,M[Z(V#*T_=Z@"P0Y5US)C-"E?(G8S)VI6-S)_ME#+H
MUJ7G0S]4E>\PSRR5 >.8LIOF,6((D> FB;&@7WUQEHJ02S1H(DNPUFBKX%'4
M ?#&H\"#']8!XU$20$V$,+OA/#H4%,8V*Z6;VJF:MX'17X644X<6F7FJDC" 
MQLSWE/=MSL "IK\X2V6@7J3XCD+GQUL"592#-GAHM)%Y>OCYV\EQ 37*/^/"
M='2UT3/NYY!*"?E?*NXF3P4/WW2Y5QL/-/#*[X86IL5NRR<#M3B%2S]Y5"')
M/RPHZOT7,#^],Q=QYVY[&E/_81]-4X@8/!W"2"8]$>I[8^ELT-1^VQQ?#RD-
M[=3W&GN49N,UC'!U+F*F_W\TXQ@[26\Z;/D] ^;&M-YT>A,J0TTR9<S\!E70
M$Q6E<4MM:O_"0*)N 56!XLF)+7%4GJD+33D.6XVMO=PEA[\DT^7$.=C>:S1W
M'W3*M_+*GTQ^_/'YVW&6F%>^/&JXLRA=7Q?TKG>0\^^/6\T&%;#Y I)OSH6B
M? [VO4H+]F @PH24PO:6;4E4&.A*Y8(JMAW<)NY04H74PIC^G??*..88I6GL
M8O&&ZT\4YTE,+1J,^M8EF4:Z;?I"NZEQJU)@*@M89%2<69M]<L;N;K?@$3:D
M?DI$Y-WN-'VXS1KU=^1:U^'%2%U4:/G9J.S[[&#?=U\&\-,O!OCN6P+_ 5!+
M 0(4 PH    ( %.S@3?8(R)\(@8  "P@   2              "D@0    !E
G>&5C=71I;VY?;&]G+FAT;6Q02P4&      $  0!     4@8      
end

Mime
View raw message