harmony-alerts mailing list archives

Site index · List index
Message view « Date » · « Thread »
Top « Date » · « Thread »
From nom...@intel.com
Subject [build-test alert] FAILED Windows 2003 x86: jdktools-test debug
Date Fri, 30 Nov 2007 15:05:46 GMT

BUILD FAILED:
	Ant Error Message:
D:\cc\cc-common\scripts\cc-exec-adaptor.xml:104: The following error occurred while executing
this line: D:\cc\cc-common\adaptors\jdktools-test\adaptor.xml:28: The following error occurred
while executing this line: D:\cc\cc-common\build\checkouts\hdk\working_jdktools\build.xml:242:
The following error occurred while executing this line: D:\cc\cc-common\build\checkouts\hdk\working_jdktools\make\build-test.xml:97:
There were test errors.

Date of build:	2007-11-30 20:45:09 +0600
Time to build:	20 minutes 29 seconds
Last changed:	11/30/2007 18:27:39
Last log entry:	hdk

***********************************************************
Errors/Warnings:	(229)
            
Result: 1
[cc-ant]: Test Suite 'jdktools-test' execution. Repository updated: ${repository.updated}
[cc-ant]: Check for 'run' failure of hdk = ${hdk.parameters.run.failed}
[cc-ant]: Result: failed.superiors = '${failed.superiors}'
========================================
Testing jdktools binaries...
========================================
Compiling JPDA tests
Since fork is false, ignoring memoryMaximumSize setting
----------
1. WARNING in D:\cc\cc-common\build\checkouts\hdk\working_jdktools\modules\jpda\test\common\unit\org\apache\harmony\jpda\tests\framework\DebuggeeRegister.java
(at line 58)
registered.add(debuggee);
^^^^^^^^^^^^^^^^^^^^^^^^
Type safety: The method add(Object) belongs to the raw type LinkedList. References to generic
type LinkedList<E> should be parameterized
----------
----------
2. WARNING in D:\cc\cc-common\build\checkouts\hdk\working_jdktools\modules\jpda\test\common\unit\org\apache\harmony\jpda\tests\framework\TestOptions.java
(at line 505)
internalProperties.put(name, value);
^^^^^^^^^^^^^^^^^^^^^^^^^^^^^^^^^^^
Type safety: The method put(Object, Object) belongs to the raw type HashMap. References to
generic type HashMap<K,V> should be parameterized
----------
----------
3. WARNING in D:\cc\cc-common\build\checkouts\hdk\working_jdktools\modules\jpda\test\common\unit\org\apache\harmony\jpda\tests\framework\jdwp\PacketDispatcher.java
(at line 114)
eventQueue.add(eventPacket);
^^^^^^^^^^^^^^^^^^^^^^^^^^^
Type safety: The method add(Object) belongs to the raw type List. References to generic type
List<E> should be parameterized
----------
4. WARNING in D:\cc\cc-common\build\checkouts\hdk\working_jdktools\modules\jpda\test\common\unit\org\apache\harmony\jpda\tests\framework\jdwp\PacketDispatcher.java
(at line 249)
replies.put(new Integer(replyPacket.getId()),
replyPacket);
^^^^^^^^^^^^^^^^^^^^^^^^^^^^^^^^^^^^^^^^^^^^^^^^^^^^^^^^^^^^^^^^^^^^^^^^^^^^^^^^^^^^^^^^^^^
Type safety: The method put(Object, Object) belongs to the raw type Hashtable. References
to generic type Hashtable<K,V> should be parameterized
----------
5. WARNING in D:\cc\cc-common\build\checkouts\hdk\working_jdktools\modules\jpda\test\common\unit\org\apache\harmony\jpda\tests\framework\jdwp\PacketDispatcher.java
(at line 284)
commands.put(Id, command);
^^^^^^^^^^^^^^^^^^^^^^^^^
Type safety: The method put(Object, Object) belongs to the raw type Hashtable. References
to generic type Hashtable<K,V> should be parameterized
----------
6. WARNING in D:\cc\cc-common\build\checkouts\hdk\working_jdktools\modules\jpda\test\common\unit\org\apache\harmony\jpda\tests\framework\jdwp\PacketDispatcher.java
(at line 355)
commands.put(Id, command);
^^^^^^^^^^^^^^^^^^^^^^^^^
Type safety: The method put(Object, Object) belongs to the raw type Hashtable. References
to generic type Hashtable<K,V> should be parameterized
----------
----------
7. WARNING in D:\cc\cc-common\build\checkouts\hdk\working_jdktools\modules\jpda\test\common\unit\org\apache\harmony\jpda\tests\framework\jdwp\VmMirror.java
(at line 1834)
frames.add(frame);
^^^^^^^^^^^^^^^^^
Type safety: The method add(Object) belongs to the raw type ArrayList. References to generic
type ArrayList<E> should be parameterized
----------
8. WARNING in D:\cc\cc-common\build\checkouts\hdk\working_jdktools\modules\jpda\test\common\unit\org\apache\harmony\jpda\tests\framework\jdwp\VmMirror.java
(at line 1902)
vars.add(var);
^^^^^^^^^^^^^
Type safety: The method add(Object) belongs to the raw type ArrayList. References to generic
type ArrayList<E> should be parameterized
----------
9. WARNING in D:\cc\cc-common\build\checkouts\hdk\working_jdktools\modules\jpda\test\common\unit\org\apache\harmony\jpda\tests\framework\jdwp\VmMirror.java
(at line 2122)
fields.add(superClassFields.toArray()[i]);
^^^^^^^^^^^^^^^^^^^^^^^^^^^^^^^^^^^^^^^^^
Type safety: The method add(Object) belongs to the raw type ArrayList. References to generic
type ArrayList<E> should be parameterized
----------
10. WARNING in D:\cc\cc-common\build\checkouts\hdk\working_jdktools\modules\jpda\test\common\unit\org\apache\harmony\jpda\tests\framework\jdwp\VmMirror.java
(at line 2132)
fields.add(field);
^^^^^^^^^^^^^^^^^
Type safety: The method add(Object) belongs to the raw type ArrayList. References to generic
type ArrayList<E> should be parameterized
----------
----------
11. WARNING in D:\cc\cc-common\build\checkouts\hdk\working_jdktools\modules\jpda\test\common\unit\org\apache\harmony\jpda\tests\jdwp\DebuggerOnDemand\OnthowDebuggerLaunchDebuggee.java
(at line 94)
class ExceptionForDebugger extends Exception {
^^^^^^^^^^^^^^^^^^^^
The serializable class ExceptionForDebugger does not declare a static final serialVersionUID
field of type long
----------
----------
12. WARNING in D:\cc\cc-common\build\checkouts\hdk\working_jdktools\modules\jpda\test\common\unit\org\apache\harmony\jpda\tests\jdwp\Events\ClassUnloadDebuggee.java
(at line 32)
import java.util.LinkedList;
^^^^^^^^^^^^^^^^^^^^
The import java.util.LinkedList is never used
----------
13. WARNING in D:\cc\cc-common\build\checkouts\hdk\working_jdktools\modules\jpda\test\common\unit\org\apache\harmony\jpda\tests\jdwp\Events\ClassUnloadDebuggee.java
(at line 97)
boolean isOutOfMemory = false;
^^^^^^^^^^^^^
The local variable isOutOfMemory is never read
----------
14. WARNING in D:\cc\cc-common\build\checkouts\hdk\working_jdktools\modules\jpda\test\common\unit\org\apache\harmony\jpda\tests\jdwp\Events\ClassUnloadDebuggee.java
(at line 171)
public Class loadClass(String name) throws ClassNotFoundException {
^^^^^
Type safety: The return type Class for loadClass(String) from the type ClassUnloadDebuggee.CustomLoader
needs unchecked conversion to conform to Class<?> from the type ClassLoader
----------
15. WARNING in D:\cc\cc-common\build\checkouts\hdk\working_jdktools\modules\jpda\test\common\unit\org\apache\harmony\jpda\tests\jdwp\Events\ClassUnloadDebuggee.java
(at line 179)
public Class findClass(String name) throws ClassNotFoundException {
^^^^^
Type safety: The return type Class for findClass(String) from the type ClassUnloadDebuggee.CustomLoader
needs unchecked conversion to conform to Class<?> from the type ClassLoader
----------
----------
16. WARNING in D:\cc\cc-common\build\checkouts\hdk\working_jdktools\modules\jpda\test\common\unit\org\apache\harmony\jpda\tests\jdwp\Events\CombinedEvents002Test.java
(at line 100)
boolean expectColocatedEvents = (testedMethodStartCodeIndex == testedMethodEndCodeIndex);
^^^^^^^^^^^^^^^^^^^^^
The local variable expectColocatedEvents is never read
----------
----------
17. WARNING in D:\cc\cc-common\build\checkouts\hdk\working_jdktools\modules\jpda\test\common\unit\org\apache\harmony\jpda\tests\jdwp\Events\CombinedEvents003Test.java
(at line 53)
private boolean eventMethodExitReceived = false;
^^^^^^^^^^^^^^^^^^^^^^^
The field CombinedEvents003Test.eventMethodExitReceived is never read locally
----------
18. WARNING in D:\cc\cc-common\build\checkouts\hdk\working_jdktools\modules\jpda\test\common\unit\org\apache\harmony\jpda\tests\jdwp\Events\CombinedEvents003Test.java
(at line 76)
int EXPECTED_EVENTS_COUNT = EXPECTED_EVENTS_ARRAY.length;
^^^^^^^^^^^^^^^^^^^^^
The local variable EXPECTED_EVENTS_COUNT is never read
----------
----------
19. WARNING in D:\cc\cc-common\build\checkouts\hdk\working_jdktools\modules\jpda\test\common\unit\org\apache\harmony\jpda\tests\jdwp\Events\CombinedEventsTest.java
(at line 84)
int EXPECTED_EVENTS_COUNT = EXPECTED_EVENTS_ARRAY.length;
^^^^^^^^^^^^^^^^^^^^^
The local variable EXPECTED_EVENTS_COUNT is never read
----------
20. WARNING in D:\cc\cc-common\build\checkouts\hdk\working_jdktools\modules\jpda\test\common\unit\org\apache\harmony\jpda\tests\jdwp\Events\CombinedEventsTest.java
(at line 212)
int EXPECTED_EVENTS_COUNT = EXPECTED_EVENTS_ARRAY.length;
^^^^^^^^^^^^^^^^^^^^^
The local variable EXPECTED_EVENTS_COUNT is never read
----------
21. WARNING in D:\cc\cc-common\build\checkouts\hdk\working_jdktools\modules\jpda\test\common\unit\org\apache\harmony\jpda\tests\jdwp\Events\CombinedEventsTest.java
(at line 348)
int EXPECTED_EVENTS_COUNT = EXPECTED_EVENTS_ARRAY.length;
^^^^^^^^^^^^^^^^^^^^^
The local variable EXPECTED_EVENTS_COUNT is never read
----------
22. WARNING in D:\cc\cc-common\build\checkouts\hdk\working_jdktools\modules\jpda\test\common\unit\org\apache\harmony\jpda\tests\jdwp\Events\CombinedEventsTest.java
(at line 732)
String failureMessage = "## FAILURE during checking events! !";
^^^^^^^^^^^^^^
The local variable failureMessage is never read
----------
23. WARNING in D:\cc\cc-common\build\checkouts\hdk\working_jdktools\modules\jpda\test\common\unit\org\apache\harmony\jpda\tests\jdwp\Events\CombinedEventsTest.java
(at line 894)
String failureMessage = "## FAILURE during checking events !";
^^^^^^^^^^^^^^
The local variable failureMessage is never read
----------
----------
24. WARNING in D:\cc\cc-common\build\checkouts\hdk\working_jdktools\modules\jpda\test\common\unit\org\apache\harmony\jpda\tests\jdwp\Events\CombinedEventsTestCase.java
(at line 135)
long methodStartCodeIndex = lineTableReply.getNextValueAsLong();
^^^^^^^^^^^^^^^^^^^^
The local variable methodStartCodeIndex is never read
----------
25. WARNING in D:\cc\cc-common\build\checkouts\hdk\working_jdktools\modules\jpda\test\common\unit\org\apache\harmony\jpda\tests\jdwp\Events\CombinedEventsTestCase.java
(at line 187)
long methodStartCodeIndex = reply.getNextValueAsLong();
^^^^^^^^^^^^^^^^^^^^
The local variable methodStartCodeIndex is never read
----------
----------
26. WARNING in D:\cc\cc-common\build\checkouts\hdk\working_jdktools\modules\jpda\test\common\unit\org\apache\harmony\jpda\tests\jdwp\Events\ExceptionTest.java
(at line 188)
long frameID = reply.getNextValueAsFrameID();
^^^^^^^
The local variable frameID is never read
----------
----------
27. WARNING in D:\cc\cc-common\build\checkouts\hdk\working_jdktools\modules\jpda\test\common\unit\org\apache\harmony\jpda\tests\jdwp\ThreadReference\FramesTest.java
(at line 450)
frames.add(new FrameStruct(frameID, loc));
^^^^^^^^^^^^^^^^^^^^^^^^^^^^^^^^^^^^^^^^^
Type safety: The method add(Object) belongs to the raw type Vector. References to generic
type Vector<E> should be parameterized
----------
----------
28. WARNING in D:\cc\cc-common\build\checkouts\hdk\working_jdktools\modules\jpda\test\common\unit\org\apache\harmony\jpda\tests\jdwp\share\JDWPUnitDebuggeeProcessWrapper.java
(at line 233)
argv.add(val);
^^^^^^^^^^^^^
Type safety: The method add(Object) belongs to the raw type Vector. References to generic
type Vector<E> should be parameterized
----------
29. WARNING in D:\cc\cc-common\build\checkouts\hdk\working_jdktools\modules\jpda\test\common\unit\org\apache\harmony\jpda\tests\jdwp\share\JDWPUnitDebuggeeProcessWrapper.java
(at line 253)
return (String[])argv.toArray(args);
^^^^^^^^^^^^^^^^^^
Type safety: The method toArray(Object[]) belongs to the raw type Vector. References to generic
type Vector<E> should be parameterized
----------
29 problems (29 warnings)
JPDA exclude list: D:\cc\cc-common\build\checkouts\hdk\working_classlib\deploy\build\jdktools.jpda.exclude
Running JPDA tests
Debugger JVM=D:\cc\cc-common\build\checkouts\hdk\target\hdk\jdk\jre/bin/java
Debuggee JVM=D:\cc\cc-common\build\checkouts\hdk\target\hdk\jdk\jre/bin/java
SAMSA exclude list: D:\cc\cc-common\build\checkouts\hdk\working_classlib\deploy\build\jdktools.samsa.exclude
Running SAMSA tests
test.jre.home=D:\cc\cc-common\build\checkouts\hdk\target\hdk\jdk\jre
Run jdk/bin/java -version in D:\cc\cc-common\build\checkouts\hdk\working_jdktools\build\test_report
java version "1.5.0"
pre-alpha : not complete or compatible
svn = r599797, (Nov 30 2007), Windows/ia32/msvc 1310, debug build
http://harmony.apache.org
Run jdk/bin/javac -version in D:\cc\cc-common\build\checkouts\hdk\working_jdktools\build\test_report
Run jdk/bin/javah in D:\cc\cc-common\build\checkouts\hdk\working_jdktools\build\test_report
Run jdk/bin/javadoc in D:\cc\cc-common\build\checkouts\hdk\working_jdktools\build\test_report
Run jdk/bin/jarsigner in D:\cc\cc-common\build\checkouts\hdk\working_jdktools\build\test_report
Run jdk/bin/keytool -help in D:\cc\cc-common\build\checkouts\hdk\working_jdktools\build\test_report
Compiling TOOLS tests
Since fork is false, ignoring memoryMaximumSize setting
----------
1. WARNING in D:\cc\cc-common\build\checkouts\hdk\working_jdktools\modules\tools\src\test\java\org\apache\harmony\tests\tools\javah\Test\Test01.java
(at line 24)
private static final long xxx2 = 1;
^^^^
The field Test01.xxx2 is never read locally
----------
1 problem (1 warning)
TOOLS exclude list: D:\cc\cc-common\build\checkouts\hdk\working_classlib\deploy\build\jdktools.tools.exclude
Running TOOLS tests
test.jre.home=D:\cc\cc-common\build\checkouts\hdk\target\hdk\jdk\jre
The test report is in D:\cc\cc-common\build\checkouts\hdk\working_jdktools\build\test_report\html\index.html
The execution FAILED with the following exception:
The following error occurred while executing this line:
D:\cc\cc-common\adaptors\jdktools-test\adaptor.xml:28: The following error occurred while
executing this line:
D:\cc\cc-common\build\checkouts\hdk\working_jdktools\build.xml:242: The following error occurred
while executing this line:
D:\cc\cc-common\build\checkouts\hdk\working_jdktools\make\build-test.xml:97: There were test
errors.

***********************************************************
Unit Tests: (160)
        
error: testOwnedMonitors001 org.apache.harmony.jpda.tests.jdwp.ThreadReference.OwnedMonitorsTest
Unit Test Error Details:	(1)
                
Test: testOwnedMonitors001Class: org.apache.harmony.jpda.tests.jdwp.ThreadReference.OwnedMonitorsTestorg.apache.harmony.jpda.tests.framework.jdwp.exceptions.ReplyErrorCodeException:
Error 20: INVALID_OBJECT
	at org.apache.harmony.jpda.tests.framework.jdwp.VmMirror.checkReply(VmMirror.java:95)
	at org.apache.harmony.jpda.tests.framework.jdwp.VmMirror.getThreadName(VmMirror.java:699)
	at org.apache.harmony.jpda.tests.jdwp.ThreadReference.OwnedMonitorsTest.testOwnedMonitors001(OwnedMonitorsTest.java:114)
	at java.lang.reflect.VMReflection.invokeMethod(VMReflection.java)

***********************************************************
Modifications since last successful build:	(1)
            
add cc-hdk log20071130182739Lbuild.396 11/30/2007 18:27:39hdk

begin 644 execution_log.zip
M4$L#! H    ( +2H?C>B# 8J"!(  )I^   2    97AE8W5T:6]N7VQO9RYH
M=&UL[5W_4]NZLO\99OH_Z)X[;R[,$),OA)#<E#<\H+?T%.@CM.>]:?HZPE82
M@V/Y2C:0VSG_^]N5["2V$R> **%S,RUCR])JM9_=U7HMR^U!./3VVU?<&>VW
M \'VVY3(<.2QMW_K<3\L2?=?K$7VRO_Q][_MOUF/ H>&K"1O_=:;]3?K)<G"
M*"A=.S<AYYXLW4E='%?+EHL(FQU%@>?:<-TA@>#7S Z)3X>,N#YQAP$7H44^
MQ>67/"A]9+?,PYH!$^&(.*SG^F[H<E_J8R#3<X4,L?U1JVO;\*]D\^&0^UUI
M"S<(93=N[3)IW0\]0GV'T#[%#O-MKB+7<[KV@-DW/(*V ^>F>\?%C>OWOR<#
MZ@[I#<M0Q0&&3(8P0H*_K\P>\&]D_>V2O_5+: R=D*03<N7Z5"!URUJ>"K)A
M>XSZ)61&EF ,010J\=L\&)6N!2OU7(]I1.S!D#O9LKA:*QE1">I$^JH:V/#&
M<<4W<BB8 A%.6H^3HJZ$77P7#)%_O@XD#D:=:KED4#KDP\#U4/H?/AT=D+C%
MLS'3M3TJ)4NZN*:WU)YFHMJH$,DC83.B<"$A?Z8^.ZZ/G4 [XDK2HYYD6\3M
M^UP@'T,VY&)T2N_=833L@"<@8/"HI&DBI?$O75ZQR!\'%V<G9_]XO*%IU>M>
M@T=1X^C&K2-P ETN^ET:4*#1'5 !Q:-)1=GM"7 K2+%[Q*ZB?I^Q"]9W9<B$
MA0RF>24;-"0@?$;J>YOI2VLB;L8<BSK.AA-3V_P[R53\OSF_=+7+40""I#T6
MCEKD<L! S.& @TL"VN=7Z/@VR17SN-]7P(=00] [$F*SCZY_PYR/P(Y%+E@/
M> +\5+4^\YEP[6RU]O$^D0,>>0[0) %%F<!0 $MG.1#GE5=7!5STF^>!FA&*
M<2W7L\"Z/HC"I]ZGB2<'9[F!T]$6N:5>!!@O"?&#T<:.--I;9!'J[ZD<G-*@
M$/*X3OOWK2_/A'AM51"_=NZ"[B=JW[#PR)4!#:%%L4U7*CM9["&L\,/_CEC$
ME%&K4TWS(9B;M.R%-FW FG=>+X;5G6;>,4,HF1@MNR,G8,]])C:P?*2)6WT6
MGC@;FYM;&;H+?E,D'N,#'OM['M\1TBN/+?0>JI8!_U%_Q3JVE_,3V#'<,&@E
M.W&V2%RPO%;\"ICNOEY,:_7<O/]O3(O*&RN%]9?AJ2L$7S"_[]5RAJOH2#6Y
MJ\/%X)J;S ^$H*.%,_JXUI.G];U7"%FS7,U"=DN%!@P.BN%ZO5 U7Q]4U4HU
M!U7/99ZCP9(1W#P=8G;AG2X,N1+7QN97]]OC@Z?7"W&E_!HQKA5AK Y_90\Z
M%\L73F(I!./\E3CWCQC&*=US'P1YEQ1_I)%O#Y(D5R',S7Q\BX9+CN]MIG(H
M[[A(R!)V'S*(DB87R8],8WVOM(3U#C!U*%SJN?_"Z(44].IP -KG(7$8U!*,
MX ,)&@+D/=>G7DSG"Q,2&GX^.2)*-PGO:95 =7HBY"^<VE*0'V,^0G:56_WL
M>YPZ2^&;-V+]3(7@J16%KF=-<H-9<R8/@;. +J:2?78+6$9R:9_YPMFEIPB]
MV<@*_0KX8=0'09Q'X7GO5.71R5N=8)\C=K) X!ZW0?LA,G*5!:5)CR4N&%U6
MXB^<"WJ*Q"N-2E;D073E@8]0E @24D<;G5 ]R<"4[B;,,(+?25WGC(?O>.0[
MBYP;669B$RR,A*\=D.:@QT6.BTW2$WRHYKE)S<RH#R,9\N%'* (P?<; _:)S
M!Q28 [>I_JWV>S@3PAGT,L1#1:G]G_NS.M"TEM2)%\[=/$TG<OG!E$[ [+$"
M.I'E8O5U8JZNO'!.**4K?'B%2P'T:;E<Q8="Q=I2+L]SVNP^@-#TD*/##1.:
MX+PWL%_FG*H@MA-2 74<=N([[)Z\?4NFKQX#R,FU7-0\T]\O[?=G<_<(_S\7
MUQ?._Q3A6EN(:[V6<P+"O05)D3&\2"N&Z=X-+YC-W%LPI 6S<R%JLW#38>GL
M$<SC(06C1MX;+0G;"^> G@9;8W?&LUER_#^?C@\OCX^^'W\Y/KOL?#\\_WQV
M"4!ERP\N+@[^U_*8WP\'L_![G*7-[MVDI;UP+F@^9 OQRC\G^87PJKYP_N8)
MN%0K^1O 7PB854C&/ Z8VDYN6=&O!,PJI4P>!DPCGS*)[P]ZU/4BP4Z9E+3/
M )3?_OI7\N[@Y./GBV/B1*J.&A,>J!E=_H7\Y;>ELBH+H<ET_AA,5BFC\L#9
M)9^F?#PF*P3)7*A6*163@^J0R@5WWK7<$W;,PL;I_NR=DFISB1*]P#4VN$#G
MC-V'7W"YW0'<F?K]C=FW3(]R<3-Y>(PUK5)FY!$0[>5RE$40B5>$S%S$5B@_
M,4XH+<Y+[.7B! 64>J9W<C0'FW?Z:C$\BQU<W(=)$%8AF7 YP(&,'R-VE;06
MST([]5R*:&I-":XW5(1@9HKL<",6WA8*=7,5GGI_@:M<%#X^U56>;XGX*J0D
M)%Q@W0]'?WSZ#"V2G.HGP4$@\@]!@V#1FL!:+J5$1?\V7J?B_:QU*C\/SNHJ
MI"6>#EL^$QAGY./,^]=OFPK'9+4*G,BYN=KQ[[$6F_2B88:^5P)H?*\.//]0
MD@TXN:/"!\'(37Q9*H!Y!B HL7O;BQR6>6%*O2857P)YR_!A+T6IQ_^>>]5U
M8#+CH[ANHCT6*H,54X]?')SYVM9%Y/NS7MI*KA,R7E7PX<OIVV4XA' $IE9U
M>(W_!=N&6&M[HFDYVLP<[:_7:!Z3<8&=6-I.K-A.M&C44"VT$^N+*\*(>J=0
M";3>BI=%X-R6)HDEDN ;F*2R1=[I6QG9(N4M<HR+@_3AI3MDA'DTD,QID5VK
M6FD2R>RGD]JQ]G9V3)%J5JMF2-4-D;'*%4.D8'#UFC%2M8:Q =8JA:1JRY*J
M %N[>X6TJDO3*B_DZR$*VOAIZO 0:=5WBD'<6996K6XURH9TJVY5=W=7SC/4
MK1US&E_=*]:LW:7E7K&JM>(1+JWQ3:NQ@-2#Y&Y,&VJF; >XJA9[AX= :$[=
M*XWB*6=I*ZPTK9JI$>Y8C:8A?0>YU\U-]>8&:)*4P0&:4_?& C?S0LI@T"7O
MF7-8KU)%'^#<F[N&!HAB-^>1*X;"[94U9X.W)N75"XM6%L&*L3N=1M.<V'_U
MR<O8W;/1>="@K%:3J5\]4C,X0(,QD4D3-.B/J\;F^?)NL1-=.M50W3&7'C [
MI9H*BHR2,JI8JRCVO94,9!9(O?X ;:\U5]++/#(HJLP@-7. QYW+99XK9)Z9
M6^=W/G-..=" [I ?M>KJ^,A(<J5J:,:N&)P<3=,R%954#-YDU*W&3O$0'W#S
MNFL*19S45C%$;9K+9!A[!+(X(?P04KNF'ELT5C7)^<MSM6?,<HP-L&J5FX8L
MIP9&:.[N;O6")9@+Z\;BKA6](S.9.Y^K[+."D\>OJGC/O:G%MD]GO6GN@=EN
M \(40^ZC84YE&L:R, USRM<P>H=KRFGO-LRE+QOFG@\WS.5G<80U<[3VJN:4
M=$'$\P#';4Y:4^GL-^LAC^Q!*7[U1*IMVEN3<J:(3)6R\7;MK<6+^#H'IYUG
M7,4GZ5!.+>/#?FWNVQ3D<L:A6U?O=Z]W.,<]^7U.?(8OT9.0W8=;Q.%JFP8>
M#M26XXO7 >H!J1KI"EAD70MP^'S('KE6+]<E[M0_7L!'2LDN#(]=,CMG-WSH
M\)[9W\B!FK'(>SUC$;WG$Q.D13;L37+(@Y%P^X.05)I-4+5JN=Q0RT_C9AW>
M"^]P,R6UOP55>UMP05S03L^UF2]!C;8(!1P"]74&W(<RW;\:9#+&WRH6W*7]
M1M)50-M*U L&%)C"#9Q@](''0H8]X3%T"W33;>2MC^\TU)M-F'NVR,89OR6U
MLN)_<XO\X?H.OY/;+JU5MX?RUB:56@4L1FW!3I3$TN0&81BTMK>3>3V>YF'&
M+T;/?G;XCFW/!?LF'U",>J=_ *]L-1J 5LVJ63"J"8@G_W4*9R) .90UFA8Y
M\#RB+H-'89*)6^98Q<,:/-=H/IR=E-170LB J5U)M!&K1<H45R^GJZ?//N/K
M<ZU985B\^A<YMT[Q^QQ?N=[8_1MIZQW#<,\6N5]$?=PD74Q(Z8KS4%$!11R0
M-O[=5S;2=R&V(ZKTS@4AXVIJ&#7S'71%/$MH]@_7<#NL1R,OC'<W0X*%@@">
M<OS@;PY/N.;])[#$21O1W$^10MU#<OIS(F.6!'-<P6QTV:[_$+9DP&RWYZJ/
MM^1<38XEA[1U/UR,QGPE+*4T,&',CC_7 3J4ZFXY#L>=D;N!:P_R5'O@.?5K
M4O@Z A6C12-P?;",;#<GJC#^+L>4ZJEW'* ;&H5\"$Y3[0*RJ ?P7U<<'$P6
M-MS<2,3S(WH N(M9Q&_*UJ:IJ1A![;2'^YM$P!7Y)]PF:2"G&BTG98FQB9+G
MU0@W^0-?D-6$"R9!>2%X*O9S#K>?S=,!^2,DK_<D='%&0QD"UR,6%K$%TTD?
M\7TVQD1'=S!@7F#-<K%K$R9^Q%[Q3_+AX$+%BP1PHQFDIAJ@/KF]T8R&19H3
MMUJ#'XD) +!(T<'V)-^^=,-&$DR-D79R]%UYPC7U=J(.5+3")=<S!%29>BUF
M0@%/@8(J7:)U@)H[W;^4 (<#%,;<)65Y[L>-I]JMD637(2@?MR4;X#@<M]>#
M4$/ORC6CS\TL@TIZ (QVR]_1P+ #]<VL>&S%$H:K"O#9[:W..Q5\6T<0.BLG
MFH=4.98U-2I^Z\*] G4<]0TNZL4S0JY+#VPDW02&S.Z2"03. BYE/AXLV4Q 
M@*,TR'%EX-$1P2+P,;C?E20;$?!RY\*\F*@H<I]PF95>*"EI7W8.OG^^^+B/
M-%-*!?==H !T&*"K'7#AAJ-\>^Q=T\"C[\ILIC5#%21(0+5I=C/40!;W(](>
M<+!I$"%$<7+_1ZN-QKW_IQ(57%:1'5@U5")Q)35$K+5%F-6W=$5+5[3 I[0J
MU=K.K+ZT6>#?,>[3-I'J<./]Y>4G#-4[YX>_=[*"C&$4VLOK&0+)3;P^$K7%
M* AY7]  YDU%&&XN$A40<TBJQNV$OZ14T<Q:FYS-QH.X4-OP#:E/^S@ESG$+
MDY[2W$W\00&;8'"F^,1906L[VC@-,0DPO[<TK^,6A<RBMIKG=MID"SJ<9GBZ
M32''0\<\O\-X4P_'[:>R!]D>TQ).MYK#="XT !W"&9Z4<.)^KO @??9[W&6D
MXH+TM82='Z5V_!D,[2O^G"[140"6M?7A=_5YK/T_+<LBI0]MC,*22H6,^/S.
M3SZW(3.<K"G=$.R?:VO_T'>2+*44<"4:Y]^G&J&@;.&MK1WB47JZ$.PV\?BX
MBW24C7A*>O_,$!KK@XF)AQS\+@\'6ED@$,\V=1AF-V!6N6!#?LL(3'EPRZ F
M]MEN9:W$[A$J:'*L#E+#P_[4#(Q.6(8.STZK:R6XP0;*T+S#X%Y$\8J5=9#A
MBN0&'$:;;8FZ!NTN!Q#(*KU+=)?K )* @&@"3+:QWNL9FI_H39]IBN\->P#W
MZIM(B9+#SH7>H2)+ WBT/>Z#N,8? (7JR+D2VXSJ*B1R$%7J]].15+8V1%M^
M:"L8/^$ARE)+,,.K B<?(ZV5)/-ZFL!8]2!RA<(X $M142YCG, $QG+4DJ@R
MS7]1*+DVB9V_))'S=)]*R$6F]1Y1+#)P[6]^9*P\DZ:"\**UEFFBM2[;=S[;
MO,SW-2_/SS]V4A_8C%]&GU2I__O;EZD]%/29%+;>2 $[F+6#@AZIKJQ2:.K+
MB.I/N;+@RVKS]DQ-;;RO]J&YO[^ODK>DLG"CA/%O]M8S>G?4F#E%]"E[GR;[
M&)"-2K*+P1*;&&A=?+;G'_KOSWS^D3,N\\\_EGB8/AD]?A= QL_5(03IH/O3
M6T]W*"!=^#!]Z75+-6MWP<N9#WEE=,&&!TMS59XL8GOJ0SP=X)3 4978, A'
MNC!.$TX5Y4LP15?2T2&<Z^'H4QB4H+[4>X4#XRVRTZC5AQFU04-%;HANA"9J
M+%SMXH?'NR[N^F7A(?(KX1X\G##\9AUFGNE3+0@E'Z$S@V_6UY%)G),B%>3I
MA1]ZAE992HXI4+4;8+('5TLUF;J \B?<MB,AP/;N!JXWI@B70PR9T$_BM\LS
M0Z<.#7!![-CH%7-),7X6O%7=T_O &.EO>5'KOG>J/[MS]67T22"@V&@V%!<0
M^MSA'Z516NDM +6]3??;V^K3\]OZ,_3;ZIOT_P]02P$"% ,*    " "TJ'XW
MH@P&*@@2  ":?@  $@              I($     97AE8W5T:6]N7VQO9RYH
9=&UL4$L%!@     !  $ 0    #@2      $! 
end

Mime
View raw message