harmony-alerts mailing list archives

Site index · List index
Message view « Date » · « Thread »
Top « Date » · « Thread »
From nom...@intel.com
Subject [build-test alert] FAILED Windows 2003 x86: jdktools-test debug
Date Fri, 30 Nov 2007 06:53:39 GMT

BUILD FAILED:
	Ant Error Message:
D:\cc\cc-common\scripts\cc-exec-adaptor.xml:104: The following error occurred while executing
this line: D:\cc\cc-common\adaptors\jdktools-test\adaptor.xml:28: The following error occurred
while executing this line: D:\cc\cc-common\build\checkouts\hdk\working_jdktools\build.xml:242:
The following error occurred while executing this line: D:\cc\cc-common\build\checkouts\hdk\working_jdktools\make\build-test.xml:60:
The following error occurred while executing this line: D:\cc\cc-common\build\checkouts\hdk\working_jdktools\make\properties.xml:325:
The following error occurred while executing this line: D:\cc\cc-common\build\checkouts\hdk\working_jdktools\modules\samsa\build.xml:144:
exec returned: 3

Date of build:	2007-11-30 12:53:12 +0600
Time to build:	21 seconds
Last changed:	11/29/2007 22:45:15
Last log entry:	hdk

***********************************************************
Errors/Warnings:	(217)
            
Tests FAILED
[cc-ant]: Test Suite 'jdktools-test' execution. Repository updated: ${repository.updated}
[cc-ant]: Check for 'run' failure of hdk = ${hdk.parameters.run.failed}
[cc-ant]: Result: failed.superiors = '${failed.superiors}'
========================================
Testing jdktools binaries...
========================================
Compiling JPDA tests
Since fork is false, ignoring memoryMaximumSize setting
----------
1. WARNING in D:\cc\cc-common\build\checkouts\hdk\working_jdktools\modules\jpda\test\common\unit\org\apache\harmony\jpda\tests\framework\DebuggeeRegister.java
(at line 58)
registered.add(debuggee);
^^^^^^^^^^^^^^^^^^^^^^^^
Type safety: The method add(Object) belongs to the raw type LinkedList. References to generic
type LinkedList<E> should be parameterized
----------
----------
2. WARNING in D:\cc\cc-common\build\checkouts\hdk\working_jdktools\modules\jpda\test\common\unit\org\apache\harmony\jpda\tests\framework\TestOptions.java
(at line 505)
internalProperties.put(name, value);
^^^^^^^^^^^^^^^^^^^^^^^^^^^^^^^^^^^
Type safety: The method put(Object, Object) belongs to the raw type HashMap. References to
generic type HashMap<K,V> should be parameterized
----------
----------
3. WARNING in D:\cc\cc-common\build\checkouts\hdk\working_jdktools\modules\jpda\test\common\unit\org\apache\harmony\jpda\tests\framework\jdwp\PacketDispatcher.java
(at line 114)
eventQueue.add(eventPacket);
^^^^^^^^^^^^^^^^^^^^^^^^^^^
Type safety: The method add(Object) belongs to the raw type List. References to generic type
List<E> should be parameterized
----------
4. WARNING in D:\cc\cc-common\build\checkouts\hdk\working_jdktools\modules\jpda\test\common\unit\org\apache\harmony\jpda\tests\framework\jdwp\PacketDispatcher.java
(at line 249)
replies.put(new Integer(replyPacket.getId()),
replyPacket);
^^^^^^^^^^^^^^^^^^^^^^^^^^^^^^^^^^^^^^^^^^^^^^^^^^^^^^^^^^^^^^^^^^^^^^^^^^^^^^^^^^^^^^^^^^^
Type safety: The method put(Object, Object) belongs to the raw type Hashtable. References
to generic type Hashtable<K,V> should be parameterized
----------
5. WARNING in D:\cc\cc-common\build\checkouts\hdk\working_jdktools\modules\jpda\test\common\unit\org\apache\harmony\jpda\tests\framework\jdwp\PacketDispatcher.java
(at line 284)
commands.put(Id, command);
^^^^^^^^^^^^^^^^^^^^^^^^^
Type safety: The method put(Object, Object) belongs to the raw type Hashtable. References
to generic type Hashtable<K,V> should be parameterized
----------
6. WARNING in D:\cc\cc-common\build\checkouts\hdk\working_jdktools\modules\jpda\test\common\unit\org\apache\harmony\jpda\tests\framework\jdwp\PacketDispatcher.java
(at line 355)
commands.put(Id, command);
^^^^^^^^^^^^^^^^^^^^^^^^^
Type safety: The method put(Object, Object) belongs to the raw type Hashtable. References
to generic type Hashtable<K,V> should be parameterized
----------
----------
7. WARNING in D:\cc\cc-common\build\checkouts\hdk\working_jdktools\modules\jpda\test\common\unit\org\apache\harmony\jpda\tests\framework\jdwp\VmMirror.java
(at line 1834)
frames.add(frame);
^^^^^^^^^^^^^^^^^
Type safety: The method add(Object) belongs to the raw type ArrayList. References to generic
type ArrayList<E> should be parameterized
----------
8. WARNING in D:\cc\cc-common\build\checkouts\hdk\working_jdktools\modules\jpda\test\common\unit\org\apache\harmony\jpda\tests\framework\jdwp\VmMirror.java
(at line 1902)
vars.add(var);
^^^^^^^^^^^^^
Type safety: The method add(Object) belongs to the raw type ArrayList. References to generic
type ArrayList<E> should be parameterized
----------
9. WARNING in D:\cc\cc-common\build\checkouts\hdk\working_jdktools\modules\jpda\test\common\unit\org\apache\harmony\jpda\tests\framework\jdwp\VmMirror.java
(at line 2122)
fields.add(superClassFields.toArray()[i]);
^^^^^^^^^^^^^^^^^^^^^^^^^^^^^^^^^^^^^^^^^
Type safety: The method add(Object) belongs to the raw type ArrayList. References to generic
type ArrayList<E> should be parameterized
----------
10. WARNING in D:\cc\cc-common\build\checkouts\hdk\working_jdktools\modules\jpda\test\common\unit\org\apache\harmony\jpda\tests\framework\jdwp\VmMirror.java
(at line 2132)
fields.add(field);
^^^^^^^^^^^^^^^^^
Type safety: The method add(Object) belongs to the raw type ArrayList. References to generic
type ArrayList<E> should be parameterized
----------
----------
11. WARNING in D:\cc\cc-common\build\checkouts\hdk\working_jdktools\modules\jpda\test\common\unit\org\apache\harmony\jpda\tests\jdwp\DebuggerOnDemand\OnthowDebuggerLaunchDebuggee.java
(at line 94)
class ExceptionForDebugger extends Exception {
^^^^^^^^^^^^^^^^^^^^
The serializable class ExceptionForDebugger does not declare a static final serialVersionUID
field of type long
----------
----------
12. WARNING in D:\cc\cc-common\build\checkouts\hdk\working_jdktools\modules\jpda\test\common\unit\org\apache\harmony\jpda\tests\jdwp\Events\ClassUnloadDebuggee.java
(at line 32)
import java.util.LinkedList;
^^^^^^^^^^^^^^^^^^^^
The import java.util.LinkedList is never used
----------
13. WARNING in D:\cc\cc-common\build\checkouts\hdk\working_jdktools\modules\jpda\test\common\unit\org\apache\harmony\jpda\tests\jdwp\Events\ClassUnloadDebuggee.java
(at line 97)
boolean isOutOfMemory = false;
^^^^^^^^^^^^^
The local variable isOutOfMemory is never read
----------
14. WARNING in D:\cc\cc-common\build\checkouts\hdk\working_jdktools\modules\jpda\test\common\unit\org\apache\harmony\jpda\tests\jdwp\Events\ClassUnloadDebuggee.java
(at line 171)
public Class loadClass(String name) throws ClassNotFoundException {
^^^^^
Type safety: The return type Class for loadClass(String) from the type ClassUnloadDebuggee.CustomLoader
needs unchecked conversion to conform to Class<?> from the type ClassLoader
----------
15. WARNING in D:\cc\cc-common\build\checkouts\hdk\working_jdktools\modules\jpda\test\common\unit\org\apache\harmony\jpda\tests\jdwp\Events\ClassUnloadDebuggee.java
(at line 179)
public Class findClass(String name) throws ClassNotFoundException {
^^^^^
Type safety: The return type Class for findClass(String) from the type ClassUnloadDebuggee.CustomLoader
needs unchecked conversion to conform to Class<?> from the type ClassLoader
----------
----------
16. WARNING in D:\cc\cc-common\build\checkouts\hdk\working_jdktools\modules\jpda\test\common\unit\org\apache\harmony\jpda\tests\jdwp\Events\CombinedEvents002Test.java
(at line 100)
boolean expectColocatedEvents = (testedMethodStartCodeIndex == testedMethodEndCodeIndex);
^^^^^^^^^^^^^^^^^^^^^
The local variable expectColocatedEvents is never read
----------
----------
17. WARNING in D:\cc\cc-common\build\checkouts\hdk\working_jdktools\modules\jpda\test\common\unit\org\apache\harmony\jpda\tests\jdwp\Events\CombinedEvents003Test.java
(at line 53)
private boolean eventMethodExitReceived = false;
^^^^^^^^^^^^^^^^^^^^^^^
The field CombinedEvents003Test.eventMethodExitReceived is never read locally
----------
18. WARNING in D:\cc\cc-common\build\checkouts\hdk\working_jdktools\modules\jpda\test\common\unit\org\apache\harmony\jpda\tests\jdwp\Events\CombinedEvents003Test.java
(at line 76)
int EXPECTED_EVENTS_COUNT = EXPECTED_EVENTS_ARRAY.length;
^^^^^^^^^^^^^^^^^^^^^
The local variable EXPECTED_EVENTS_COUNT is never read
----------
----------
19. WARNING in D:\cc\cc-common\build\checkouts\hdk\working_jdktools\modules\jpda\test\common\unit\org\apache\harmony\jpda\tests\jdwp\Events\CombinedEventsTest.java
(at line 84)
int EXPECTED_EVENTS_COUNT = EXPECTED_EVENTS_ARRAY.length;
^^^^^^^^^^^^^^^^^^^^^
The local variable EXPECTED_EVENTS_COUNT is never read
----------
20. WARNING in D:\cc\cc-common\build\checkouts\hdk\working_jdktools\modules\jpda\test\common\unit\org\apache\harmony\jpda\tests\jdwp\Events\CombinedEventsTest.java
(at line 212)
int EXPECTED_EVENTS_COUNT = EXPECTED_EVENTS_ARRAY.length;
^^^^^^^^^^^^^^^^^^^^^
The local variable EXPECTED_EVENTS_COUNT is never read
----------
21. WARNING in D:\cc\cc-common\build\checkouts\hdk\working_jdktools\modules\jpda\test\common\unit\org\apache\harmony\jpda\tests\jdwp\Events\CombinedEventsTest.java
(at line 348)
int EXPECTED_EVENTS_COUNT = EXPECTED_EVENTS_ARRAY.length;
^^^^^^^^^^^^^^^^^^^^^
The local variable EXPECTED_EVENTS_COUNT is never read
----------
22. WARNING in D:\cc\cc-common\build\checkouts\hdk\working_jdktools\modules\jpda\test\common\unit\org\apache\harmony\jpda\tests\jdwp\Events\CombinedEventsTest.java
(at line 732)
String failureMessage = "## FAILURE during checking events! !";
^^^^^^^^^^^^^^
The local variable failureMessage is never read
----------
23. WARNING in D:\cc\cc-common\build\checkouts\hdk\working_jdktools\modules\jpda\test\common\unit\org\apache\harmony\jpda\tests\jdwp\Events\CombinedEventsTest.java
(at line 894)
String failureMessage = "## FAILURE during checking events !";
^^^^^^^^^^^^^^
The local variable failureMessage is never read
----------
----------
24. WARNING in D:\cc\cc-common\build\checkouts\hdk\working_jdktools\modules\jpda\test\common\unit\org\apache\harmony\jpda\tests\jdwp\Events\CombinedEventsTestCase.java
(at line 135)
long methodStartCodeIndex = lineTableReply.getNextValueAsLong();
^^^^^^^^^^^^^^^^^^^^
The local variable methodStartCodeIndex is never read
----------
25. WARNING in D:\cc\cc-common\build\checkouts\hdk\working_jdktools\modules\jpda\test\common\unit\org\apache\harmony\jpda\tests\jdwp\Events\CombinedEventsTestCase.java
(at line 187)
long methodStartCodeIndex = reply.getNextValueAsLong();
^^^^^^^^^^^^^^^^^^^^
The local variable methodStartCodeIndex is never read
----------
----------
26. WARNING in D:\cc\cc-common\build\checkouts\hdk\working_jdktools\modules\jpda\test\common\unit\org\apache\harmony\jpda\tests\jdwp\Events\ExceptionTest.java
(at line 188)
long frameID = reply.getNextValueAsFrameID();
^^^^^^^
The local variable frameID is never read
----------
----------
27. WARNING in D:\cc\cc-common\build\checkouts\hdk\working_jdktools\modules\jpda\test\common\unit\org\apache\harmony\jpda\tests\jdwp\ThreadReference\FramesTest.java
(at line 450)
frames.add(new FrameStruct(frameID, loc));
^^^^^^^^^^^^^^^^^^^^^^^^^^^^^^^^^^^^^^^^^
Type safety: The method add(Object) belongs to the raw type Vector. References to generic
type Vector<E> should be parameterized
----------
----------
28. WARNING in D:\cc\cc-common\build\checkouts\hdk\working_jdktools\modules\jpda\test\common\unit\org\apache\harmony\jpda\tests\jdwp\share\JDWPUnitDebuggeeProcessWrapper.java
(at line 233)
argv.add(val);
^^^^^^^^^^^^^
Type safety: The method add(Object) belongs to the raw type Vector. References to generic
type Vector<E> should be parameterized
----------
29. WARNING in D:\cc\cc-common\build\checkouts\hdk\working_jdktools\modules\jpda\test\common\unit\org\apache\harmony\jpda\tests\jdwp\share\JDWPUnitDebuggeeProcessWrapper.java
(at line 253)
return (String[])argv.toArray(args);
^^^^^^^^^^^^^^^^^^
Type safety: The method toArray(Object[]) belongs to the raw type Vector. References to generic
type Vector<E> should be parameterized
----------
29 problems (29 warnings)
JPDA exclude list: D:\cc\cc-common\build\checkouts\hdk\working_classlib\deploy\build\jdktools.jpda.exclude
Running JPDA tests
Debugger JVM=D:\cc\cc-common\build\checkouts\hdk\target\hdk\jdk\jre/bin/java
Debuggee JVM=D:\cc\cc-common\build\checkouts\hdk\target\hdk\jdk\jre/bin/java
Assertion failed: method_handle
Method org/apache/harmony/drlvm/gc_gen/GCHelper.alloc(Lorg/vmmagic/unboxed/Address;)Lorg/vmmagic/unboxed/Address;
not found.
Assertion failed: method_handle
Method org/apache/harmony/drlvm/gc_gen/GCHelper.alloc(Lorg/vmmagic/unboxed/Address;)Lorg/vmmagic/unboxed/Address;
not found.
SAMSA exclude list: D:\cc\cc-common\build\checkouts\hdk\working_classlib\deploy\build\jdktools.samsa.exclude
Running SAMSA tests
test.jre.home=D:\cc\cc-common\build\checkouts\hdk\target\hdk\jdk\jre
Run jdk/bin/java -version in D:\cc\cc-common\build\checkouts\hdk\working_jdktools\build\test_report
java version "1.5.0"
pre-alpha : not complete or compatible
svn = r599512, (Nov 29 2007), Windows/ia32/msvc 1310, debug build
http://harmony.apache.org
Run jdk/bin/javac -version in D:\cc\cc-common\build\checkouts\hdk\working_jdktools\build\test_report
Assertion failed: method_handle
Method org/apache/harmony/drlvm/gc_gen/GCHelper.alloc(Lorg/vmmagic/unboxed/Address;)Lorg/vmmagic/unboxed/Address;
not found.
The execution FAILED with the following exception:
The following error occurred while executing this line:
D:\cc\cc-common\adaptors\jdktools-test\adaptor.xml:28: The following error occurred while
executing this line:
D:\cc\cc-common\build\checkouts\hdk\working_jdktools\build.xml:242: The following error occurred
while executing this line:
D:\cc\cc-common\build\checkouts\hdk\working_jdktools\make\build-test.xml:60: The following
error occurred while executing this line:
D:\cc\cc-common\build\checkouts\hdk\working_jdktools\make\properties.xml:325: The following
error occurred while executing this line:
D:\cc\cc-common\build\checkouts\hdk\working_jdktools\modules\samsa\build.xml:144: exec returned:
3

***********************************************************
Unit Tests: (0)
        
No Tests Run: This project doesn't have any tests

***********************************************************
Modifications since last successful build:	(1)
            
add cc-hdk log20071129224515Lbuild.394 11/29/2007 22:45:15hdk

begin 644 execution_log.zip
M4$L#! H    ( +)F?C?B^+B,,PH  "U#   2    97AE8W5T:6]N7VQO9RYH
M=&UL[5Q[3R,Y$O_[D.8[>&>UVD1*.B\8( .<(I+988[7 </L:C*'G&XG;>BV
M6[8[C[TO?V5W=R#IO @P">A:('7[4677KZILE^WLN<KW#O9:W!D<[ 6"'.QA
M)-7 (_N_MSE3>4G_)E6T4_SMX^\'[S;"P,&*Y&675=]MO-O(2Z+"('_KW"G.
M/9GOR2@Y+C:>+D)=K1X&'K4AWT&!X+?$5HAAGR#*$/4#+I2%SN/T*Q[DCTF7
M>+ID0(0:((>T*:.*<B:C=R#3ID(J7;]>;=HV_.5M[ON<-:4M:*!D,ZY-B;3Z
MOH<P<Q#N8,TP7:<54L]IVBZQ[W@(=5WGKMGCXHZRSDW2H::/[\@85=U!1:2"
M'B+]?">VRW^@C?T%GXTKJ Q,4,($M2C#0E.WK,6IZ&;8'L$LKQLC\]"'(%1&
M_#8/!OE;0?)MZI$($=OUN3.>%A>K)CW*0YDPRC4=\^\<*GZ@0T$,B/!174Z*
M42'-XD80C?S+,9"Z,^8SDLL82H?<#ZBGI?_EO%Y#<8T7:TS3]K"4)&%QB[O8
M?MB(\G8)21X*FR"#"U+\A7A>4J:90#U$)6IC3Y(<HAW&A6Z'3WPN!B>X3_W0
MOP1/@,#@M9*.$LD/G]'TDH6^U2Y.CT[_6-[0(M5KWH)',?UHQK5#< )-+CI-
M'&"@T72Q@.3!?4'9; MP*YIBLTY:8:=#R 7I4*F(L'0#1]N*,E@A$#Y!6SO9
MT:Q_B+@:<2SL.!DGII;]B,8*_F?*,UKL:A" ('&;J$$57;D$Q*Q<#BX):)^U
MM./+HA;Q..L8X!64$+B'E*YV3-D=<8ZA.1:Z(&UH$^!GBG4((X+:X\7V&@=(
MNCST'*") JQE ET!+)W%0)R67EX7<+7?/ O,B# ;U^+6.+"4@2@8]L[O/3DX
MRXP>CG*HB[T0,%X0XD>CK1E%:.?0/-0_8^F>X& FY'&9O7_EKE\(\<JZ('[K
M](+F.;;OB*I3&6 %-6;;=*FT.8X]3"N8^G=(0F*,VGQ&-!^#^7-:]ER;?@9K
MWGR]&)8W=]..&::2B=&2'CH">^X0D='I@XBXU2'JR,EDL[DQNG.>!R26\0'+
M/B_C.Q1N>62N]S"EGL%_;+UB'=M)^0G-&!8,D9(=.3D4)RRN%6\!TP^O%]/*
M5FK<_S^FL]*WUPKK:_^$"L'GC.\[E93A&CK2#.[F=3ZXSS>8UX3 @[DC^K#4
MDX?UG5<(V6ZQ/ Y9%XL(,'B9#=?KA6KW]4%5+I534+4I\9P(+!G"XNE01Q<^
M18F*&W%ELM_IC^4G3Z\7XE+Q-6)<F86Q>7W+'G0JEBL.8AD$X_B5.&-UHN<I
MS3,&@NPER<<X9+:;!+EFPKR;GM]JPT6-ODU,#.43%PE91/J*P"SI/A/]=ZQR
MM%9:P'I='3H4%'OT;SU[03.X.AR 9EPAAT I09#>D, *(&]3AKV8SC41$BI^
M/:HCHYN(MR.5T.KT1,A7'-HRD#=T/$(VC5O]RCR.G87P31MQM*>"]*<5*NI9
M]['!<7-&CX%S!ET=2F:D"UB&<F&?N>+HTE.$OKL]+O06M(=@!H(X"]59^\3$
MT=%^%&"?(G8T1^ >MT'[869$C06-DAY*7!"\J,17' MZBL1+VZ5QD0=ARP,?
M82@A3<B\92Z5V<G0(=TLC#""]V14YI2K3SQDSCSGAA89V 11H6"1 XI:T.8B
MU8HL:@ONFW'NON18KP]#J;A_#$D )B,$W*]V[H "<6"9RKJ1W],C(7P!%U^_
M&DI[_SR8Q""BM:!.K#AV\S2=2,4'1W0"1H\UT(GQ5JR_3DS5E17'A$9TA?LM
M?10@^BP6RWI3:+:V%(O3G#;I!S U/>3:X:J$)CCOC.9+G!,SB;U46$ 9AQPQ
MA_31_CYZF-L D).\U*QYHK]?V.]/;MT2_G\JKBN._\S"M3(7UZU*R@D(V@5)
MH2&\FE8,4Y^J"V(3V@5#FC,ZST1M$F[1M'1R#Z:U803&"'EOL"!L*XX!/0VV
M[0\3]F91X\_SQN%5HW[3N&Z<7EW>')Y]/;T"H,;3:Q<7M;\LC[".<B?AMYRE
M3>;^G):VXEC0=,CFXI7>)WE#>)57'+]Y B[E4GH!^(: 68=@S'+ 5#93QXK>
M$C#K%#)Y'##;Z9!)O#YH8^J%@IP0*7&' "CO?_T5?:H='7^]:" G-&5,G_2+
M&='E+^B7]PM%5>9",\9\&4S6*:+RR-$E':9<'I,U@F0J5.L4BDE!=8CEG)5W
M);7#KJ.P<;A_?*5DZEQIB5[H,S;Z@,XIZ:MK?=RN!BM3ULE,7C(MY>(FMF$9
M:UJGR,@2$.VD8I2S(!*O")FIB*U1?&(84)H?E]A)S1,,4&9/[Z@^!9M/4>YL
M>.8[N)C'<X*P#L&$*U=W9+B-V#32FC\*;6ZE0D0/SI3H\X:&$(Q,H:TRL?!R
M6JC9==CUOH9<+F9NGT9%7NZ(^#J$)"1DD.:7^K?SKU CB:F>"PX"D=\$#H)Y
M9P(KJ9 2%IUN?$[%^UGG5'X>G.5U"$L\';9T)#".R,>1]^\_L@;'Y+0*?,BI
ML=KALZS%)EPBF('W6@"M[]6!Y_<ERL!'#PL&@I%9?5DJ@'$&(,B3ONV%#AF[
M,&6N2<59(&^I'G<IRFS_>[35=& PXX.X;*(]EE8&*Z8>7QR<>&WK(F1LTJ6M
M)!^AX:F"+]<G^XNT$*8C,+2:UUO]+T@!YEJ%>TU+T2;/1_O[K3:/^WZ!G5B1
MG5BQG42B,5VUM)U8UU2H$'LG4 BTWHJ/1>BQ;91D34I]PX4SLXPA3C56S!L7
M,\<CHX6CR+1F7XC8%V+V!4=X7;_0L6] 'PM_''XFGK9#[,&@ESG6Y;N^CSO4
M+H2LQ?O$*=0<1X#%?LS.S#7G/=IZZ\T:;8GNB#0+O$;]N63TF7L/ILYO4$SO
M-A0/;3<?+UBEN=Q9O4\G^C38P]3[2Y[5^:9_63NY?$';E]B7#XQ?\[4YLS'T
M\I0#6QK=DHWN1>J;O(S#;%5OO8$'Z*L<<KC9W.7*-1<5YWN/J$,3W(<R,T0!
MBL5]LJ2%IUCJ^[U#LT?Y9.]VV8%VRAU:8-@GX.)K1B_1YT@O4712#-QA%67L
M+#KDP4#0CJM0:7>WE$/E8G';#%IQM4O>5CU]!,OLBF-C%UP@"KKF49LP"6J4
M0QAP",R=;GUZ?92_Z632Q_<E:\LJOD>C14#;\M@+7 R-TOH-O0\\&,@T)_T.
M;%L>&:TCNTROA+9V=[=*Y1S*G/*N'LUT^[,Y](TRA_=D@>)*N>#+KHU*E5(1
M-$,[;&0D-DK.52JH%A+K3=P)6.)L].R7AV\1=Y047JT[VM!ZHQL2FO9&O@CU
MJ'+-]*;-@5O/1.62M7#55'F0H=T2XK8="@'6W'.I-Z0(V6#/TDSM]&\(C,D:
M.SB &9$<NA%C\$FROIY?+>]$\[%GX;<XMA'OS?+/9FY^H>#^PKMIQH?B2EHQ
M^CL)U4IYZZ<W(UZ-F+'E 2ZES<VJX1,?UM$&5H$18Z^ #_8*YM<P"M$O8Q3,
MSV3\#U!+ 0(4 PH    ( +)F?C?B^+B,,PH  "U#   2              "D
M@0    !E>&5C=71I;VY?;&]G+FAT;6Q02P4&      $  0!     8PH     
 
end

Mime
View raw message