harmony-alerts mailing list archives

Site index · List index
Message view « Date » · « Thread »
Top « Date » · « Thread »
From nom...@intel.com
Subject [build-test alert] FAILED Linux x86: jdktools-test debug
Date Thu, 29 Nov 2007 17:48:42 GMT

BUILD FAILED:
	Ant Error Message:
/export/users/cc/cc-common/scripts/cc-exec-adaptor.xml:104: The following error occurred while
executing this line: /export/users/cc/cc-common/adaptors/jdktools-test/adaptor.xml:28: The
following error occurred while executing this line: /export/users/cc/cc-common/build/checkouts/hdk/working_jdktools/build.xml:242:
The following error occurred while executing this line: /export/users/cc/cc-common/build/checkouts/hdk/working_jdktools/make/build-test.xml:60:
The following error occurred while executing this line: /export/users/cc/cc-common/build/checkouts/hdk/working_jdktools/make/properties.xml:325:
The following error occurred while executing this line: /export/users/cc/cc-common/build/checkouts/hdk/working_jdktools/modules/samsa/build.xml:144:
exec returned: 134

Date of build:	2007-11-29 23:48:20 +0600
Time to build:	15 seconds
Last changed:	11/29/2007 23:03:01
Last log entry:	hdk

***********************************************************
Errors/Warnings:	(262)
            
Tests FAILED
========================================
Testing jdktools binaries...
========================================
Compiling JPDA tests
Since fork is false, ignoring memoryMaximumSize setting
----------
1. WARNING in /export/users/cc/cc-common/build/checkouts/hdk/working_jdktools/modules/jpda/test/common/unit/org/apache/harmony/jpda/tests/framework/DebuggeeRegister.java
(at line 58)
registered.add(debuggee);
^^^^^^^^^^^^^^^^^^^^^^^^
Type safety: The method add(Object) belongs to the raw type LinkedList. References to generic
type LinkedList<E> should be parameterized
----------
----------
2. WARNING in /export/users/cc/cc-common/build/checkouts/hdk/working_jdktools/modules/jpda/test/common/unit/org/apache/harmony/jpda/tests/framework/TestOptions.java
(at line 505)
internalProperties.put(name, value);
^^^^^^^^^^^^^^^^^^^^^^^^^^^^^^^^^^^
Type safety: The method put(Object, Object) belongs to the raw type HashMap. References to
generic type HashMap<K,V> should be parameterized
----------
----------
3. WARNING in /export/users/cc/cc-common/build/checkouts/hdk/working_jdktools/modules/jpda/test/common/unit/org/apache/harmony/jpda/tests/framework/jdwp/PacketDispatcher.java
(at line 114)
eventQueue.add(eventPacket);
^^^^^^^^^^^^^^^^^^^^^^^^^^^
Type safety: The method add(Object) belongs to the raw type List. References to generic type
List<E> should be parameterized
----------
4. WARNING in /export/users/cc/cc-common/build/checkouts/hdk/working_jdktools/modules/jpda/test/common/unit/org/apache/harmony/jpda/tests/framework/jdwp/PacketDispatcher.java
(at line 249)
replies.put(new Integer(replyPacket.getId()),
replyPacket);
^^^^^^^^^^^^^^^^^^^^^^^^^^^^^^^^^^^^^^^^^^^^^^^^^^^^^^^^^^^^^^^^^^^^^^^^^^^^^^^^^^^^^^^^^^
Type safety: The method put(Object, Object) belongs to the raw type Hashtable. References
to generic type Hashtable<K,V> should be parameterized
----------
5. WARNING in /export/users/cc/cc-common/build/checkouts/hdk/working_jdktools/modules/jpda/test/common/unit/org/apache/harmony/jpda/tests/framework/jdwp/PacketDispatcher.java
(at line 284)
commands.put(Id, command);
^^^^^^^^^^^^^^^^^^^^^^^^^
Type safety: The method put(Object, Object) belongs to the raw type Hashtable. References
to generic type Hashtable<K,V> should be parameterized
----------
6. WARNING in /export/users/cc/cc-common/build/checkouts/hdk/working_jdktools/modules/jpda/test/common/unit/org/apache/harmony/jpda/tests/framework/jdwp/PacketDispatcher.java
(at line 355)
commands.put(Id, command);
^^^^^^^^^^^^^^^^^^^^^^^^^
Type safety: The method put(Object, Object) belongs to the raw type Hashtable. References
to generic type Hashtable<K,V> should be parameterized
----------
----------
7. WARNING in /export/users/cc/cc-common/build/checkouts/hdk/working_jdktools/modules/jpda/test/common/unit/org/apache/harmony/jpda/tests/framework/jdwp/VmMirror.java
(at line 1834)
frames.add(frame);
^^^^^^^^^^^^^^^^^
Type safety: The method add(Object) belongs to the raw type ArrayList. References to generic
type ArrayList<E> should be parameterized
----------
8. WARNING in /export/users/cc/cc-common/build/checkouts/hdk/working_jdktools/modules/jpda/test/common/unit/org/apache/harmony/jpda/tests/framework/jdwp/VmMirror.java
(at line 1902)
vars.add(var);
^^^^^^^^^^^^^
Type safety: The method add(Object) belongs to the raw type ArrayList. References to generic
type ArrayList<E> should be parameterized
----------
9. WARNING in /export/users/cc/cc-common/build/checkouts/hdk/working_jdktools/modules/jpda/test/common/unit/org/apache/harmony/jpda/tests/framework/jdwp/VmMirror.java
(at line 2122)
fields.add(superClassFields.toArray()[i]);
^^^^^^^^^^^^^^^^^^^^^^^^^^^^^^^^^^^^^^^^^
Type safety: The method add(Object) belongs to the raw type ArrayList. References to generic
type ArrayList<E> should be parameterized
----------
10. WARNING in /export/users/cc/cc-common/build/checkouts/hdk/working_jdktools/modules/jpda/test/common/unit/org/apache/harmony/jpda/tests/framework/jdwp/VmMirror.java
(at line 2132)
fields.add(field);
^^^^^^^^^^^^^^^^^
Type safety: The method add(Object) belongs to the raw type ArrayList. References to generic
type ArrayList<E> should be parameterized
----------
----------
11. WARNING in /export/users/cc/cc-common/build/checkouts/hdk/working_jdktools/modules/jpda/test/common/unit/org/apache/harmony/jpda/tests/jdwp/DebuggerOnDemand/OnthowDebuggerLaunchDebuggee.java
(at line 94)
class ExceptionForDebugger extends Exception {
^^^^^^^^^^^^^^^^^^^^
The serializable class ExceptionForDebugger does not declare a static final serialVersionUID
field of type long
----------
----------
12. WARNING in /export/users/cc/cc-common/build/checkouts/hdk/working_jdktools/modules/jpda/test/common/unit/org/apache/harmony/jpda/tests/jdwp/Events/ClassUnloadDebuggee.java
(at line 32)
import java.util.LinkedList;
^^^^^^^^^^^^^^^^^^^^
The import java.util.LinkedList is never used
----------
13. WARNING in /export/users/cc/cc-common/build/checkouts/hdk/working_jdktools/modules/jpda/test/common/unit/org/apache/harmony/jpda/tests/jdwp/Events/ClassUnloadDebuggee.java
(at line 97)
boolean isOutOfMemory = false;
^^^^^^^^^^^^^
The local variable isOutOfMemory is never read
----------
14. WARNING in /export/users/cc/cc-common/build/checkouts/hdk/working_jdktools/modules/jpda/test/common/unit/org/apache/harmony/jpda/tests/jdwp/Events/ClassUnloadDebuggee.java
(at line 171)
public Class loadClass(String name) throws ClassNotFoundException {
^^^^^
Type safety: The return type Class for loadClass(String) from the type ClassUnloadDebuggee.CustomLoader
needs unchecked conversion to conform to Class<?> from the type ClassLoader
----------
15. WARNING in /export/users/cc/cc-common/build/checkouts/hdk/working_jdktools/modules/jpda/test/common/unit/org/apache/harmony/jpda/tests/jdwp/Events/ClassUnloadDebuggee.java
(at line 179)
public Class findClass(String name) throws ClassNotFoundException {
^^^^^
Type safety: The return type Class for findClass(String) from the type ClassUnloadDebuggee.CustomLoader
needs unchecked conversion to conform to Class<?> from the type ClassLoader
----------
----------
16. WARNING in /export/users/cc/cc-common/build/checkouts/hdk/working_jdktools/modules/jpda/test/common/unit/org/apache/harmony/jpda/tests/jdwp/Events/CombinedEvents002Test.java
(at line 100)
boolean expectColocatedEvents = (testedMethodStartCodeIndex == testedMethodEndCodeIndex);
^^^^^^^^^^^^^^^^^^^^^
The local variable expectColocatedEvents is never read
----------
----------
17. WARNING in /export/users/cc/cc-common/build/checkouts/hdk/working_jdktools/modules/jpda/test/common/unit/org/apache/harmony/jpda/tests/jdwp/Events/CombinedEvents003Test.java
(at line 53)
private boolean eventMethodExitReceived = false;
^^^^^^^^^^^^^^^^^^^^^^^
The field CombinedEvents003Test.eventMethodExitReceived is never read locally
----------
18. WARNING in /export/users/cc/cc-common/build/checkouts/hdk/working_jdktools/modules/jpda/test/common/unit/org/apache/harmony/jpda/tests/jdwp/Events/CombinedEvents003Test.java
(at line 76)
int EXPECTED_EVENTS_COUNT = EXPECTED_EVENTS_ARRAY.length;
^^^^^^^^^^^^^^^^^^^^^
The local variable EXPECTED_EVENTS_COUNT is never read
----------
----------
19. WARNING in /export/users/cc/cc-common/build/checkouts/hdk/working_jdktools/modules/jpda/test/common/unit/org/apache/harmony/jpda/tests/jdwp/Events/CombinedEventsTest.java
(at line 84)
int EXPECTED_EVENTS_COUNT = EXPECTED_EVENTS_ARRAY.length;
^^^^^^^^^^^^^^^^^^^^^
The local variable EXPECTED_EVENTS_COUNT is never read
----------
20. WARNING in /export/users/cc/cc-common/build/checkouts/hdk/working_jdktools/modules/jpda/test/common/unit/org/apache/harmony/jpda/tests/jdwp/Events/CombinedEventsTest.java
(at line 212)
int EXPECTED_EVENTS_COUNT = EXPECTED_EVENTS_ARRAY.length;
^^^^^^^^^^^^^^^^^^^^^
The local variable EXPECTED_EVENTS_COUNT is never read
----------
21. WARNING in /export/users/cc/cc-common/build/checkouts/hdk/working_jdktools/modules/jpda/test/common/unit/org/apache/harmony/jpda/tests/jdwp/Events/CombinedEventsTest.java
(at line 348)
int EXPECTED_EVENTS_COUNT = EXPECTED_EVENTS_ARRAY.length;
^^^^^^^^^^^^^^^^^^^^^
The local variable EXPECTED_EVENTS_COUNT is never read
----------
22. WARNING in /export/users/cc/cc-common/build/checkouts/hdk/working_jdktools/modules/jpda/test/common/unit/org/apache/harmony/jpda/tests/jdwp/Events/CombinedEventsTest.java
(at line 732)
String failureMessage = "## FAILURE during checking events! !";
^^^^^^^^^^^^^^
The local variable failureMessage is never read
----------
23. WARNING in /export/users/cc/cc-common/build/checkouts/hdk/working_jdktools/modules/jpda/test/common/unit/org/apache/harmony/jpda/tests/jdwp/Events/CombinedEventsTest.java
(at line 894)
String failureMessage = "## FAILURE during checking events !";
^^^^^^^^^^^^^^
The local variable failureMessage is never read
----------
----------
24. WARNING in /export/users/cc/cc-common/build/checkouts/hdk/working_jdktools/modules/jpda/test/common/unit/org/apache/harmony/jpda/tests/jdwp/Events/CombinedEventsTestCase.java
(at line 135)
long methodStartCodeIndex = lineTableReply.getNextValueAsLong();
^^^^^^^^^^^^^^^^^^^^
The local variable methodStartCodeIndex is never read
----------
25. WARNING in /export/users/cc/cc-common/build/checkouts/hdk/working_jdktools/modules/jpda/test/common/unit/org/apache/harmony/jpda/tests/jdwp/Events/CombinedEventsTestCase.java
(at line 187)
long methodStartCodeIndex = reply.getNextValueAsLong();
^^^^^^^^^^^^^^^^^^^^
The local variable methodStartCodeIndex is never read
----------
----------
26. WARNING in /export/users/cc/cc-common/build/checkouts/hdk/working_jdktools/modules/jpda/test/common/unit/org/apache/harmony/jpda/tests/jdwp/Events/ExceptionTest.java
(at line 188)
long frameID = reply.getNextValueAsFrameID();
^^^^^^^
The local variable frameID is never read
----------
----------
27. WARNING in /export/users/cc/cc-common/build/checkouts/hdk/working_jdktools/modules/jpda/test/common/unit/org/apache/harmony/jpda/tests/jdwp/ThreadReference/FramesTest.java
(at line 450)
frames.add(new FrameStruct(frameID, loc));
^^^^^^^^^^^^^^^^^^^^^^^^^^^^^^^^^^^^^^^^^
Type safety: The method add(Object) belongs to the raw type Vector. References to generic
type Vector<E> should be parameterized
----------
----------
28. WARNING in /export/users/cc/cc-common/build/checkouts/hdk/working_jdktools/modules/jpda/test/common/unit/org/apache/harmony/jpda/tests/jdwp/share/JDWPUnitDebuggeeProcessWrapper.java
(at line 233)
argv.add(val);
^^^^^^^^^^^^^
Type safety: The method add(Object) belongs to the raw type Vector. References to generic
type Vector<E> should be parameterized
----------
29. WARNING in /export/users/cc/cc-common/build/checkouts/hdk/working_jdktools/modules/jpda/test/common/unit/org/apache/harmony/jpda/tests/jdwp/share/JDWPUnitDebuggeeProcessWrapper.java
(at line 253)
return (String[])argv.toArray(args);
^^^^^^^^^^^^^^^^^^
Type safety: The method toArray(Object[]) belongs to the raw type Vector. References to generic
type Vector<E> should be parameterized
----------
29 problems (29 warnings)
JPDA exclude list: /export/users/cc/cc-common/build/checkouts/hdk/working_classlib/deploy/build/jdktools.jpda.exclude
Running JPDA tests
Debugger JVM=/export/users/cc/cc-common/build/checkouts/hdk/target/hdk/jdk/jre/bin/java
Debuggee JVM=/export/users/cc/cc-common/build/checkouts/hdk/target/hdk/jdk/jre/bin/java
Assertion failed: method_handle
Method org/apache/harmony/drlvm/gc_gen/GCHelper.alloc(Lorg/vmmagic/unboxed/Address;)Lorg/vmmagic/unboxed/Address;
not found.
java: /export/users/cc/cc-common/build/checkouts/hdk/working_vm/vm/vmcore/src/jit/rt_helper_info.cpp:409:
jint helper_magic_init(Global_Env*): Assertion `method_handle' failed.
SIGABRT in VM code.
Stack trace:
addr2line: '[vdso]': No such file
0: ?? (C��:-1)
1: abort (??:-1)
2: __assert_fail (??:-1)
3: helper_magic_init (/export/users/cc/cc-common/build/checkouts/hdk/working_vm/vm/vmcore/src/jit/rt_helper_info.cpp:409)
4: vm_init1(JavaVM_Internal*, JavaVMInitArgs*) (/export/users/cc/cc-common/build/checkouts/hdk/working_vm/vm/vmcore/src/init/vm_init.cpp:902)
5: JNI_CreateJavaVM (/export/users/cc/cc-common/build/checkouts/hdk/working_vm/vm/vmcore/src/jni/jni.cpp:499)
6: invocation (../shared/main.c:672)
7: gpProtectedMain (../shared/main.c:393)
8: main (../shared/cmain.c:146)
9: __libc_start_main (??:-1)
10: _start (??:-1)
<end of stack trace>
Assertion failed: method_handle
Method org/apache/harmony/drlvm/gc_gen/GCHelper.alloc(Lorg/vmmagic/unboxed/Address;)Lorg/vmmagic/unboxed/Address;
not found.
java: /export/users/cc/cc-common/build/checkouts/hdk/working_vm/vm/vmcore/src/jit/rt_helper_info.cpp:409:
jint helper_magic_init(Global_Env*): Assertion `method_handle' failed.
SIGABRT in VM code.
Stack trace:
addr2line: '[vdso]': No such file
0: ?? (c��:-1)
1: abort (??:-1)
2: __assert_fail (??:-1)
3: helper_magic_init (/export/users/cc/cc-common/build/checkouts/hdk/working_vm/vm/vmcore/src/jit/rt_helper_info.cpp:409)
4: vm_init1(JavaVM_Internal*, JavaVMInitArgs*) (/export/users/cc/cc-common/build/checkouts/hdk/working_vm/vm/vmcore/src/init/vm_init.cpp:902)
5: JNI_CreateJavaVM (/export/users/cc/cc-common/build/checkouts/hdk/working_vm/vm/vmcore/src/jni/jni.cpp:499)
6: invocation (../shared/main.c:672)
7: gpProtectedMain (../shared/main.c:393)
8: main (../shared/cmain.c:146)
9: __libc_start_main (??:-1)
10: _start (??:-1)
<end of stack trace>
SAMSA exclude list: /export/users/cc/cc-common/build/checkouts/hdk/working_classlib/deploy/build/jdktools.samsa.exclude
Running SAMSA tests
test.jre.home=/export/users/cc/cc-common/build/checkouts/hdk/target/hdk/jdk/jre
Run jdk/bin/java -version in /export/users/cc/cc-common/build/checkouts/hdk/working_jdktools/build/test_report
java version "1.5.0"
pre-alpha : not complete or compatible
svn = r599518, (Nov 29 2007), Linux/ia32/gcc 4.1.0, debug build
http://harmony.apache.org
Run jdk/bin/javac -version in /export/users/cc/cc-common/build/checkouts/hdk/working_jdktools/build/test_report
Assertion failed: method_handle
Method org/apache/harmony/drlvm/gc_gen/GCHelper.alloc(Lorg/vmmagic/unboxed/Address;)Lorg/vmmagic/unboxed/Address;
not found.
java: /export/users/cc/cc-common/build/checkouts/hdk/working_vm/vm/vmcore/src/jit/rt_helper_info.cpp:409:
jint helper_magic_init(Global_Env*): Assertion `method_handle' failed.
SIGABRT in VM code.
Stack trace:
addr2line: '[vdso]': No such file
0: ?? (ӫ�:-1)
1: abort (??:-1)
2: __assert_fail (??:-1)
3: helper_magic_init (/export/users/cc/cc-common/build/checkouts/hdk/working_vm/vm/vmcore/src/jit/rt_helper_info.cpp:409)
4: vm_init1(JavaVM_Internal*, JavaVMInitArgs*) (/export/users/cc/cc-common/build/checkouts/hdk/working_vm/vm/vmcore/src/init/vm_init.cpp:902)
5: JNI_CreateJavaVM (/export/users/cc/cc-common/build/checkouts/hdk/working_vm/vm/vmcore/src/jni/jni.cpp:499)
6: invocation (../shared/main.c:672)
7: gpProtectedMain (../shared/main.c:393)
8: main (../shared/cmain.c:146)
9: __libc_start_main (??:-1)
10: _start (??:-1)
<end of stack trace>
The execution FAILED with the following exception:
The following error occurred while executing this line:
/export/users/cc/cc-common/adaptors/jdktools-test/adaptor.xml:28: The following error occurred
while executing this line:
/export/users/cc/cc-common/build/checkouts/hdk/working_jdktools/build.xml:242: The following
error occurred while executing this line:
/export/users/cc/cc-common/build/checkouts/hdk/working_jdktools/make/build-test.xml:60: The
following error occurred while executing this line:
/export/users/cc/cc-common/build/checkouts/hdk/working_jdktools/make/properties.xml:325: The
following error occurred while executing this line:
/export/users/cc/cc-common/build/checkouts/hdk/working_jdktools/modules/samsa/build.xml:144:
exec returned: 134

***********************************************************
Unit Tests: (0)
        
No Tests Run: This project doesn't have any tests

***********************************************************
Modifications since last successful build:	(1)
            
add cc-hdk log20071129230301Lbuild.469 11/29/2007 23:03:01hdk

begin 644 execution_log.zip
M4$L#! H    ( !*^?3=B#E9F\0L  +50   2    97AE8W5T:6]N7VQO9RYH
M=&UL[5SK<MNZ$?Y=/05.SG0BG9%(7>S88AQG=&PG<>I;;<>GG4RJ0B0DP28)
M#@#*TNDC]1DZ?8@^2%^A"Y"43.KJ2VS:C<:>(8$%=K$?L+M8@MSJ2\_=WNHP
M9[2]%7"RO861D".7O'O=9;ZL"/H[L=!F]8]O7V\7PL#!DE3$P+<*A8H@,@PJ
ME\Z59,P5E6NA"F.2="D/H<%N&+C4ADH'!9Q=$ELB'WL$41]1+V!<&N@D+C]G
M0>6 #(BK* /"Y0@YI$M]*BGS170-W70I%U*U-\E0=6"&@G!AVC;\56SF><PW
MA<UI((49=T2),(:>B[#O(-S#BO?"YIV0NHYI]XE]Q4+HIN]<F=>,7U&_UT[&
M:'KXBF08% J2"&D5D/I])7:??4.%=RO^"N?0%CB@A /J4!]SU;5AK-Y+P78)
M]BM*$%$!Z8,0!"K8+!A5+CFI=*E+%#AVWV-.NB0FL:)15* ^U#5Z,-Z50_DW
MM,.)QA)NK'MK,")2S-J<J)X>@Y4H%/1-I*$T5CO,"ZBK,/A\LMM"$?ECR&3:
M+A:"Q,PN\0#;-Z6I;]208"&W"=)H(<F^._<SZBMVT Q1@;K8%:2,:,]G7$GD
M$8_QT2$>4B_TSL!:(+ +:O:F^JB,?ZGBFH%^:YT>[1]]?)!U&,U3\Q)LD!Z/
M&;<.P7*8C/=,'&#HP^QC#L6C":$PNQQLD>K1W"6=L-<CY)3TJ)"$&TK6E-2H
MB"4". A:WRRE:O[ XT;$,;#C%)VXK]);E*;[VYQ?BNI\%( V<9?(D87.^P1T
M+?L,#!?T?-Q1EK*$.L1E?D_/ PD4'%\CJ9H=4/^*. <@C(%.21<D A U68_X
MA%,[2[:UMXU$GX6N WVB "M]P$  4&<5).<4UW,(L+*NQX%V)0NQK:YGP*4^
M*,3'[LG$U(--+2HO5D8#[(: \VHPWQ9QQ29"O(R6(?\)B_XA#A;"'M-L_:E\
M\3U0;^00]4OG.C!/L'U%Y"X5 9;08N':KM76,OA#1.++/X<D)'IQZ]NHQUO@
M_H K?.G:OO>J7GL)0-;7FE-6&D+19/62:[0/"[M'>%&5CZ*NC1Z1^TZQ5"JG
M>UWRN]'#'6S!'7_?Q81(W'')4B.BJ>YM1M9?Q#3;S-H+Q18V&M$\VW?**"Y8
M>68\>V#?O 1@&^O90. 'L'.*-_**]X5W2#EGBQW^9B.[@G4O0GM[?;D4X ?S
M[BW.\6BIBQ]3W=//;SYKW)K5>@:W >81:G"Q$+-GBE?S.>-5K]6S>'4I<9T(
M,1'"WFI'I2$^1(62::T52U_IMSO'5,\4YUKU>0/=6 "TOGRI!G4>GOE)>&D4
MXUP7/_9WB0I@S&,?%'J=%!_@T+?[24)L$=3-J=A7K6"T-[2)SK1\8#SI%)&A
M)! \32K1/])MHZW4\F7<5[E&3K%+?U=!#5K TV$ ML\D<@A0<8+44PXL ?8N
M];$;]W,!,$##+_N[2,].Q+K1M%!3ZCZPYR<-IF'?4YD+86HK^\5W&796P7AJ
M,4>/;9"Z-4))76.237P["]'5(%W0J\H_^V0 >(+J5C.@^4E%W4/SS8V,YCL@
M#<$^Z.,XE,?=0YV#1^^BY/QLW:/%6G>9#<L PB6JEU*ZX[':.<&KJ3T_B:-[
MJ+VV4<OH/0@[+M@,W0]2W>BKXIG4CT)4(K@$7H>S:Q'1'#'Y@86^L\34H15<
M'2<RY'YDCB+^7<:G9"BA+F>>]GP3RLR(=T(AF7< 18"H3PB88F7F 0'BP$[6
M'T164/E&N ,NGKK4/6V]WY[%(.IKI8F1GU3/O29&-J.8FAC@4IY\8F1ER/O$
MF#=?\I-!2LT7YG74$83HMEJMJV=*"V=,M3K'A,.((&[=8<H RZ1',.5%Q94X
MASK"/9.8 XU#]GV'#-&[=^AF[1Y G=1E ^J9UG]5+S!;MEM[@WG8YB=;M C;
MQC)LUQM98\#I /2%QA"KGF*HAE2>$IO0 2RIQ?YZ(7(SL(LBUMG2SY,@!66$
MOCM:";O\9(SNA=W&F^EGO&CO+R=[.^=[N^V]B[VC\[/VSO&7HW- *UO>.CUM
M_=5PB=^3_1D@WFG)S>;]8$LN/XFC^; MPVSJ.<L+P:R>GV3/W<&IUZ9VB2\$
MG9RE;NZ$3F,M>V#II:"3TPS+K=#9F,JPQ/N'+J9NR,DA$0+W""#SZN>?T8?6
M_L&7TSWDA)I&CTA=:%\O?D(_O5HE";,,GPSKVP.3TP3,[3S.5'KS[L#D!)=Y
M<.4T<3,%UPX6B[?HC>Q#>Y7#C1\89+=3NLFYTNNI.K^CSOX<D:&\4$?Z6K")
M]7O%F?NJNQB\F1+<?EGE-(]R>YPVL[G-13CQ9P+//-3RF<T8)Z&69C$VL^&#
M!DL_&MS?G8//AZAV(41+K5W,X<& R%GJX;RO!C1^+FEJG2UU2VOKV:32C?,J
MZERC[@9<56C+8JS"LE)MZ>F?HU] +>,+G\5&)-_I7'K.\A<"*HCY>?>WDR_0
M(LG(GG &BA&_<1P$2PX?-K))*,Q[@_@(C/LX1V >"])ZSI(8]\9N*H$8I_3C
MU/W7;R4-9G(0!F[$O#3O^'?'I9OPB+ &SCE 6[T$"$[ $Z@(-]>8^Z 442H4
M G WH/H*&=INZ)#T&USZO:VX!O0LY)U?T]+'"ES:,1WP;FP4TR;SQU#3P8@9
MZ5<=9[U/=AKZ_HRWR9)JA,8G%3Y?'+Z[I: 0K(#+U9>7ZA]F(T1AYGC*37$A
MWX/+UTNU8"9#A95C1"O'B%=.I"H]>D.M'.."<AEB]Q"(8"$8\?$+Y?92/;:$
M4*_;,%_O>HACQ;.UW<>^XY(4;93D1C.6K</=@6?V[#;,4?/CSB?BJG6)7?"'
MQ0-%/_ \W*,VK/L.&Q+';#D.AQ7\MK2P5I\JZ:IG>49*$*67.T\Y$%3_V0RT
M++AM7H(IXK+=UT*WJ=]EAAT$UEJU::%+E<.):[2,;?6F;/&CRSK8;>_Y@U]*
MU@T=_CVEO->Q3M/"G^U_;/UZ>J[,Z\4ALB$0SM1+;%\AR;$=K[JD OP$KRNK
M9J'77P>.8-]>6^B((1':??W&8HH:H:J%WK]'Q9W__OM?\&=5Q@_<$X*:A7!'
MG0<IOG\_H[INH78;Z[&UU4#FD#6L:06AXO<')RO'FH4&GN9>*WZ&"7)QV-Z/
M7RK[I8RBDGVH;8&)_Z7T<!(JCF;,6<MVX\AL(MNZA3X?[;>C%ULC41Y013Y5
M_Y%>FE-Z>6/!5!NHIXQJAA8-(W*JCNEAZANV]69C2MP-"_4"<+(2G QQ#M6K
MW-/M&LU&MMTF6(\,L1U3U];>9*F;:GZ![;?;0FT)VU'367.L!E,Y(II9OT5\
M?9Q,3%;.=HI 63VA<T=[NP]D3S\Q]\9._(=)_;\RJ?8/D_K#I/XPJ6.36I ,
M%DPESIL+_;$+*RDEZBC[I&SRT0MKR2[CK'5X]CC;#($],=EG* ELY@.ZWY0M
M($,:?3$D^BB$^KJ)SY"OSPC!=F,HR\AA^B0:DWWU;89E^Y1H7-,;%:E34AQ<
M$//(_7<06=[JBR?C706J) ?.'F"7/_L+(\!Z2&"3V=)^#7V*_!J*SKW#9LP"
M.UI".RP8<=KK2U1K-FME5*]6-_2F.6YVQKKR6ATJUT?ZH@7'.*(P^5QJ$U_ 
MW"HC#+@$^A,XZC6]%'L]VF2PKVK&NE%]A5(4, DKV WZ&$12WA&&'KBPC59\
MU#4P[;@DU40,?)6176\VUVN;950\8@.UF5;"E\KJPP_AT*2X40?_;:,UHV94
M89*H_2'2NDKUU9<RL,S$[R=A"/CPA0#:CXG@"@%-0OOD <U-W)]=0),(/R^@
M&==G YJD8K6 )J$>!S3_^>?-<&92/3.<F50O#&<F9$\;SDSDR%\X,Y'M\<.9
M">^5PYE)D]N%,Y-VJX0S$^JEX<R8=$XXD]3/#&<*RLVH^E"/.XIET#65?9V-
M[3(P3=?Z<$'R#,_236Y4J- &,=L..8P$7?>I.^X1JB$<$#H-;146((D='$CP
M8N-P1,<.2;'ZX)E5WXP2R0_,>777$$FQ5G\Z,?1WX":?%-,"O:D^L3SI[])9
MC?KZ$PH4/VK1L>P-U&IK8/84Q_AE!N6^:XVUPI:)M[=,_55",_I"H:D_5_@_
M4$L! A0#"@    @ $KY]-V(.5F;Q"P  M5   !(              *2!    
I &5X96-U=&EO;E]L;V<N:'1M;%!+!08      0 ! $     A#      ! 
end

Mime
View raw message