harmony-alerts mailing list archives

Site index · List index
Message view « Date » · « Thread »
Top « Date » · « Thread »
From nom...@intel.com
Subject [build-test alert] FAILED Linux x86: drlvm-reg-test debug
Date Thu, 29 Nov 2007 17:48:16 GMT

BUILD FAILED:
	Ant Error Message:
/export/users/cc/cc-common/scripts/cc-exec-adaptor.xml:104: The following error occurred while
executing this line: /export/users/cc/cc-common/adaptors/drlvm-reg-test/adaptor.xml:74: There
were drlvm-reg-test failures

Date of build:	2007-11-29 23:42:54 +0600
Time to build:	5 minutes 13 seconds
Last changed:	11/29/2007 23:03:01
Last log entry:	hdk

***********************************************************
Errors/Warnings:	(126)
            
[junit] Test org.apache.harmony.drlvm.tests.regression.h0000.DirectByteBufferTest FAILED
[junit] Test org.apache.harmony.drlvm.tests.regression.h1578.NaNTest FAILED
[junit] Test org.apache.harmony.drlvm.tests.regression.h1654.H1654Test FAILED
[junit] Test org.apache.harmony.drlvm.tests.regression.h1748.IntfAccessTest FAILED
[junit] Test org.apache.harmony.drlvm.tests.regression.h1788.abcdTest FAILED
[junit] Test org.apache.harmony.drlvm.tests.regression.h1800.ExecTest FAILED
[junit] Test org.apache.harmony.drlvm.tests.regression.h1802.UnresolvedParamTest FAILED
[junit] Test org.apache.harmony.drlvm.tests.regression.h1802.UnresolvedHandlerTest FAILED
[junit] Test org.apache.harmony.drlvm.tests.regression.h1840.SimplestTest FAILED
[junit] Test org.apache.harmony.drlvm.tests.regression.h1840.SimplestTest FAILED
[junit] Test org.apache.harmony.drlvm.tests.regression.h1852.DivIntTest FAILED
[junit] Test org.apache.harmony.drlvm.tests.regression.h1857.Test FAILED
[junit] Test org.apache.harmony.drlvm.tests.regression.h1859.Test FAILED
[junit] Test org.apache.harmony.drlvm.tests.regression.h1859.Test FAILED
[junit] Test org.apache.harmony.drlvm.tests.regression.h1861.Test FAILED
[junit] Test org.apache.harmony.drlvm.tests.regression.h1863.H1863Test FAILED
[junit] Test org.apache.harmony.drlvm.tests.regression.h2057.SyncTest FAILED
[junit] Test org.apache.harmony.drlvm.tests.regression.h2083.Test FAILED
[junit] Test org.apache.harmony.drlvm.tests.regression.h2083.Test FAILED
[junit] Test org.apache.harmony.drlvm.tests.regression.h2083.Test FAILED
[junit] Test org.apache.harmony.drlvm.tests.regression.h2084.Test FAILED
[junit] Test org.apache.harmony.drlvm.tests.regression.h2086.Test FAILED
[junit] Test org.apache.harmony.drlvm.tests.regression.h2092.Test FAILED
[junit] Test org.apache.harmony.drlvm.tests.regression.h2092.Test FAILED
[junit] Test org.apache.harmony.drlvm.tests.regression.h2103.Test FAILED
[junit] Test org.apache.harmony.drlvm.tests.regression.h2113.Test FAILED
[junit] Test org.apache.harmony.drlvm.tests.regression.h2151.VMInit1Test FAILED
[java] Java Result: 134
[junit] Test org.apache.harmony.drlvm.tests.regression.h2259.H2259 FAILED
[junit] Test org.apache.harmony.drlvm.tests.regression.h2261.RCETest FAILED
[junit] Test org.apache.harmony.drlvm.tests.regression.h2335.SimplestLibraryPathTest FAILED
[junit] Test org.apache.harmony.drlvm.tests.regression.h2644.BootDelegationTest FAILED
[junit] Test org.apache.harmony.drlvm.tests.regression.h2679.DupTest FAILED
[junit] Test org.apache.harmony.drlvm.tests.regression.h2748.Test FAILED
[junit] Test org.apache.harmony.drlvm.tests.regression.h2773.InfinityTest FAILED
[junit] Test org.apache.harmony.drlvm.tests.regression.h2808.finTest FAILED
[junit] Test org.apache.harmony.drlvm.tests.regression.h2846.NoVerifyTest FAILED
[junit] Test org.apache.harmony.drlvm.tests.regression.h2873.RemTest FAILED
[junit] Test org.apache.harmony.drlvm.tests.regression.h2874.Test FAILED
[junit] Test org.apache.harmony.drlvm.tests.regression.h2899.ManyArgsTest FAILED
[junit] Test org.apache.harmony.drlvm.tests.regression.h2926.Test FAILED
[junit] Test org.apache.harmony.drlvm.tests.regression.h2926.Test FAILED
[junit] Test org.apache.harmony.drlvm.tests.regression.h3027.AgentLibTest FAILED
[junit] Test org.apache.harmony.drlvm.tests.regression.h3048.H3048 FAILED
[junit] Test org.apache.harmony.drlvm.tests.regression.h3067.Test FAILED
[junit] Test org.apache.harmony.drlvm.tests.regression.h3074.Test FAILED
[junit] Test org.apache.harmony.drlvm.tests.regression.h3098.JsrNoRetTest FAILED
[junit] Test org.apache.harmony.drlvm.tests.regression.h3098.JsrNoRetTest FAILED
[junit] Test org.apache.harmony.drlvm.tests.regression.h3110.FieldTest FAILED
[junit] Test org.apache.harmony.drlvm.tests.regression.h3121.H3121 FAILED
[junit] Test org.apache.harmony.drlvm.tests.regression.h3130.CallNativeTest FAILED
[junit] Test org.apache.harmony.drlvm.tests.regression.h3150.Test FAILED
[junit] Test org.apache.harmony.drlvm.tests.regression.h3175.Test FAILED
[junit] Test org.apache.harmony.drlvm.tests.regression.h3216.ASETest FAILED
[junit] Test org.apache.harmony.drlvm.tests.regression.h3225.PositiveJsrTest FAILED
[junit] Test org.apache.harmony.drlvm.tests.regression.h3225.NegativeJsrTest FAILED
[junit] Test org.apache.harmony.drlvm.tests.regression.h3225.J9CompatibleJsrTest FAILED
[junit] Test org.apache.harmony.drlvm.tests.regression.h3228.H3228 FAILED
[java] Java Result: 134
[junit] Test org.apache.harmony.drlvm.tests.regression.h3283.JavaLibraryPathTest FAILED
[junit] Test org.apache.harmony.drlvm.tests.regression.h3285.Test FAILED
[junit] Test org.apache.harmony.drlvm.tests.regression.h3317.GetFieldDeclaringClassTest FAILED
[junit] Test org.apache.harmony.drlvm.tests.regression.h3341.StopThreadInWait FAILED
[junit] Test org.apache.harmony.drlvm.tests.regression.h3380.LongToBitsTest FAILED
[junit] Test org.apache.harmony.drlvm.tests.regression.h3382.Test FAILED
[java] Java Result: 134
[junit] Test org.apache.harmony.drlvm.tests.regression.h3404.H3404 FAILED
[junit] Test org.apache.harmony.drlvm.tests.regression.h3446.SubSubTest FAILED
[junit] Test org.apache.harmony.drlvm.tests.regression.h3505.GetFieldModifiersTest FAILED
[junit] Test org.apache.harmony.drlvm.tests.regression.h3582.Test FAILED
[junit] Test org.apache.harmony.drlvm.tests.regression.h3619.ObjectLongWaitTest FAILED
[junit] Test org.apache.harmony.drlvm.tests.regression.h3652.Test FAILED
[junit] Test org.apache.harmony.drlvm.tests.regression.h3658.Test FAILED
[junit] Test org.apache.harmony.drlvm.tests.regression.h3658.Test FAILED
[junit] Test org.apache.harmony.drlvm.tests.regression.h3691.Test FAILED
[junit] Test org.apache.harmony.drlvm.tests.regression.h3698.ExceptionLocation FAILED
[junit] Test org.apache.harmony.drlvm.tests.regression.h3716.Test FAILED
[junit] Test org.apache.harmony.drlvm.tests.regression.h3730.StepM2N FAILED
[junit] Test org.apache.harmony.drlvm.tests.regression.h3738.Test FAILED
[junit] Test org.apache.harmony.drlvm.tests.regression.h3751.Test FAILED
[junit] Test org.apache.harmony.drlvm.tests.regression.h3784.Test FAILED
[junit] Test org.apache.harmony.drlvm.tests.regression.h3816.Test FAILED
[junit] Test org.apache.harmony.drlvm.tests.regression.h3822.Test FAILED
[junit] Test org.apache.harmony.drlvm.tests.regression.h3862.SubrBounds FAILED
[junit] Test org.apache.harmony.drlvm.tests.regression.h3894.ThreadGroupChildren FAILED
[junit] Test org.apache.harmony.drlvm.tests.regression.h3908.InvokeTest FAILED
[junit] Test org.apache.harmony.drlvm.tests.regression.h3909.FinalizerThreadGroup FAILED
[junit] Test org.apache.harmony.drlvm.tests.regression.h3954.Test FAILED
[junit] Test org.apache.harmony.drlvm.tests.regression.h3982.EmptyStackTrace FAILED
[junit] Test org.apache.harmony.drlvm.tests.regression.h4073.Test FAILED
[junit] Test org.apache.harmony.drlvm.tests.regression.h4073.Test FAILED
[junit] Test org.apache.harmony.drlvm.tests.regression.h4265.Test FAILED
[junit] Test org.apache.harmony.drlvm.tests.regression.h4265.Test FAILED
[junit] Test org.apache.harmony.drlvm.tests.regression.h4267.UnresolvedArrayElem FAILED
[junit] Test org.apache.harmony.drlvm.tests.regression.h4292.Test FAILED
[junit] Test org.apache.harmony.drlvm.tests.regression.h4292.Test FAILED
[junit] Test org.apache.harmony.drlvm.tests.regression.h4511.GCTagged FAILED
[junit] Test org.apache.harmony.drlvm.tests.regression.h4512.GetCurrentThreadCpuTime FAILED
[junit] Test org.apache.harmony.drlvm.tests.regression.h4514.Test FAILED
[junit] Test org.apache.harmony.drlvm.tests.regression.h4514.Test FAILED
[junit] Test org.apache.harmony.drlvm.tests.regression.h4579.test FAILED
[junit] Test org.apache.harmony.drlvm.tests.regression.h4595.Test FAILED
[junit] Test org.apache.harmony.drlvm.tests.regression.h4596.Test FAILED
[junit] Test org.apache.harmony.drlvm.tests.regression.h4654.Test FAILED
[junit] Test org.apache.harmony.drlvm.tests.regression.h4675.DivLongTest FAILED
[junit] Test org.apache.harmony.drlvm.tests.regression.h4706.Test FAILED
[junit] Test org.apache.harmony.drlvm.tests.regression.h4751.Test FAILED
[junit] Test org.apache.harmony.drlvm.tests.regression.h4866.Test FAILED
[junit] Test org.apache.harmony.drlvm.tests.regression.h4874.Test FAILED
[junit] Test org.apache.harmony.drlvm.tests.regression.h4874.Test FAILED
[junit] Test org.apache.harmony.drlvm.tests.regression.h4979.AttachCurrentThread FAILED
[junit] Test org.apache.harmony.drlvm.tests.regression.h5021.Test FAILED
[junit] Test org.apache.harmony.drlvm.tests.regression.h5067.Test FAILED
[junit] Test org.apache.harmony.drlvm.tests.regression.h5094.InlinedStackTest FAILED
[junit] Test org.apache.harmony.drlvm.tests.regression.h5094.InlinedStackTest FAILED
[junit] Test org.apache.harmony.drlvm.tests.regression.h5094.InlinedStackTest FAILED
[junit] Test org.apache.harmony.drlvm.tests.regression.h5094.InlinedStackTest FAILED
[junit] Test org.apache.harmony.drlvm.tests.regression.h5206.VolatileLongTest FAILED
[junit] Test org.apache.harmony.drlvm.tests.regression.h5206.VolatileLongTest FAILED
[junit] Test org.apache.harmony.drlvm.tests.regression.h788.Test FAILED
BUILD FAILED
/export/users/cc/cc-common/build/checkouts/hdk/working_vm/build/make/build.xml:578: The following
error occurred while executing this line:
/export/users/cc/cc-common/build/checkouts/hdk/working_vm/build/make/targets/reg.test.run.xml:108:
There were test failures
Total time: 5 minutes 9 seconds
The execution FAILED with the following exception:
The following error occurred while executing this line:
/export/users/cc/cc-common/adaptors/drlvm-reg-test/adaptor.xml:74: There were drlvm-reg-test
failures

***********************************************************
Unit Tests: (4)
        
failure: test org.apache.harmony.drlvm.tests.regression.h3256.InterruptTimedWaitingTest
failure: test org.apache.harmony.drlvm.tests.regression.h3382.TestX
failure: Server mode JIT util.Prop_srv
failure: Server mode JIT util.StringIntern_srv
Unit Test Error Details:	(4)
                
Test: testClass: org.apache.harmony.drlvm.tests.regression.h3256.InterruptTimedWaitingTestExit
code: 134 Err: Assertion failed: method_handle
Method org/apache/harmony/drlvm/gc_gen/GCHelper.alloc(Lorg/vmmagic/unboxed/Address;)Lorg/vmmagic/unboxed/Address;
not found.
java: /export/users/cc/cc-common/build/checkouts/hdk/working_vm/vm/vmcore/src/jit/rt_helper_info.cpp:409:
jint helper_magic_init(Global_Env*): Assertion `method_handle' failed.
SIGABRT in VM code.
Stack trace:
addr2line: '[vdso]': No such file
  0: ?? (\u04f0\ufffd:-1)
  1: abort (??:-1)
  2: __assert_fail (??:-1)
  3: helper_magic_init (/export/users/cc/cc-common/build/checkouts/hdk/working_vm/vm/vmcore/src/jit/rt_helper_info.cpp:409)
  4: vm_init1(JavaVM_Internal*, JavaVMInitArgs*) (/export/users/cc/cc-common/build/checkouts/hdk/working_vm/vm/vmcore/src/init/vm_init.cpp:902)
  5: JNI_CreateJavaVM (/export/users/cc/cc-common/build/checkouts/hdk/working_vm/vm/vmcore/src/jni/jni.cpp:499)
  6: invocation (../shared/main.c:672)
  7: gpProtectedMain (../shared/main.c:393)
  8: main (../shared/cmain.c:146)
  9: __libc_start_main (??:-1)
 10: _start (??:-1)
<end of stack trace>
Test: testClass: org.apache.harmony.drlvm.tests.regression.h3382.TestXExit code: 134 Err:
Assertion failed: method_handle
Method org/apache/harmony/drlvm/gc_gen/GCHelper.alloc(Lorg/vmmagic/unboxed/Address;)Lorg/vmmagic/unboxed/Address;
not found.
java: /export/users/cc/cc-common/build/checkouts/hdk/working_vm/vm/vmcore/src/jit/rt_helper_info.cpp:409:
jint helper_magic_init(Global_Env*): Assertion `method_handle' failed.
SIGABRT in VM code.
Stack trace:
addr2line: '[vdso]': No such file
  0: ?? (\ufffd\ufffd\ufffd:-1)
  1: abort (??:-1)
  2: __assert_fail (??:-1)
  3: helper_magic_init (/export/users/cc/cc-common/build/checkouts/hdk/working_vm/vm/vmcore/src/jit/rt_helper_info.cpp:409)
  4: vm_init1(JavaVM_Internal*, JavaVMInitArgs*) (/export/users/cc/cc-common/build/checkouts/hdk/working_vm/vm/vmcore/src/init/vm_init.cpp:902)
  5: JNI_CreateJavaVM (/export/users/cc/cc-common/build/checkouts/hdk/working_vm/vm/vmcore/src/jni/jni.cpp:499)
  6: invocation (../shared/main.c:672)
  7: gpProtectedMain (../shared/main.c:393)
  8: main (../shared/cmain.c:146)
  9: __libc_start_main (??:-1)
 10: _start (??:-1)
<end of stack trace>
Test: Server mode JITClass: util.Prop_srvExit code: 134 Err: Assertion failed: method_handle
Method org/apache/harmony/drlvm/gc_gen/GCHelper.alloc(Lorg/vmmagic/unboxed/Address;)Lorg/vmmagic/unboxed/Address;
not found.
java: /export/users/cc/cc-common/build/checkouts/hdk/working_vm/vm/vmcore/src/jit/rt_helper_info.cpp:409:
jint helper_magic_init(Global_Env*): Assertion `method_handle' failed.
SIGABRT in VM code.
Stack trace:
addr2line: '[vdso]': No such file
  0: ?? (\ufffd\ufffd\ufffd:-1)
  1: abort (??:-1)
  2: __assert_fail (??:-1)
  3: helper_magic_init (/export/users/cc/cc-common/build/checkouts/hdk/working_vm/vm/vmcore/src/jit/rt_helper_info.cpp:409)
  4: vm_init1(JavaVM_Internal*, JavaVMInitArgs*) (/export/users/cc/cc-common/build/checkouts/hdk/working_vm/vm/vmcore/src/init/vm_init.cpp:902)
  5: JNI_CreateJavaVM (/export/users/cc/cc-common/build/checkouts/hdk/working_vm/vm/vmcore/src/jni/jni.cpp:499)
  6: invocation (../shared/main.c:672)
  7: gpProtectedMain (../shared/main.c:393)
  8: main (../shared/cmain.c:146)
  9: __libc_start_main (??:-1)
 10: _start (??:-1)
<end of stack trace>
Test: Server mode JITClass: util.StringIntern_srvExit code: 134 Err: Assertion failed: method_handle
Method org/apache/harmony/drlvm/gc_gen/GCHelper.alloc(Lorg/vmmagic/unboxed/Address;)Lorg/vmmagic/unboxed/Address;
not found.
java: /export/users/cc/cc-common/build/checkouts/hdk/working_vm/vm/vmcore/src/jit/rt_helper_info.cpp:409:
jint helper_magic_init(Global_Env*): Assertion `method_handle' failed.
SIGABRT in VM code.
Stack trace:
addr2line: '[vdso]': No such file
  0: ?? (C\ufffd\ufffd:-1)
  1: abort (??:-1)
  2: __assert_fail (??:-1)
  3: helper_magic_init (/export/users/cc/cc-common/build/checkouts/hdk/working_vm/vm/vmcore/src/jit/rt_helper_info.cpp:409)
  4: vm_init1(JavaVM_Internal*, JavaVMInitArgs*) (/export/users/cc/cc-common/build/checkouts/hdk/working_vm/vm/vmcore/src/init/vm_init.cpp:902)
  5: JNI_CreateJavaVM (/export/users/cc/cc-common/build/checkouts/hdk/working_vm/vm/vmcore/src/jni/jni.cpp:499)
  6: invocation (../shared/main.c:672)
  7: gpProtectedMain (../shared/main.c:393)
  8: main (../shared/cmain.c:146)
  9: __libc_start_main (??:-1)
 10: _start (??:-1)
<end of stack trace>

***********************************************************
Modifications since last successful build:	(2)
            
add cc-hdk log20071129230301Lbuild.469 11/29/2007 23:03:01hdk
add cc-hdk log20071129230301Lbuild.469 11/29/2007 23:03:01hdk

begin 644 execution_log.zip
M4$L#! H    (  2^?3>=:Y#=J!4  % U P 2    97AE8W5T:6]N7VQO9RYH
M=&UL[=WM<]O(?0?P%WWG%TEG\JJO;F<R'<N::O% @B08GQU9UEG22+8CR6XZ
M'H<%@14)"P0X "B3]^;R_R1]2).IIYGIW$RO[YIIKG=-<W-I[HW?I_]"=P&2
MXC-]UE(0I*^'ID@1 !>+Q7[TVUTL[C;CEG?O;CUP>O?NMD-V[ZY%HKCGL0]O
MGP1^O!&Y'[,JJ:A_^8/;]VYUVHX5LXWHS*_>NK61ON.OP@Y_3PAYX3"/Q>PE
M>2A^NGZ#:*I!3ER/1>0D#%I$8=UV$,9*)V)AI-@V?VS80:L5^$J]XWJ.$K*H
MX\61XH3>66LC9(V-F$6QV#;?^BOKS'I)'H@%Q3:KI&6=LG1%VFUY8TN-O>'I
MW7!XPNRXNGBA=ABT%RS"NC$+_9K#)A9*7S.[&?#7SR*QXUO[FT='^[L/R(?+
M=]IN,OLTZ/#=;CJGRNL@/.5;J-F>%46>6Y^?G'27:!!1*[2;U.YVJ7W26)!^
MUW=CVO'=[K)E7KO^LD7X'O#2$D7,H:W 88LREL4T8BTWHHX;1DL63+/8\A8M
MU_8Z#=>GEA_;O(2&;GWYLG:['5O1Z:*MBKV:?UBW O_$;71"*W8#?\'1%_]V
M@B@I_'O\8W[\-6I0M::6R-I1QR<'KAT&42^*62LBN[Y-[RS<V* 4D# (8LF%
M:2KAY_^"B'_7ONMWNN^VABB ? W7*NCO^!6\M/(5&K;]KLN?-/CR#JMW&HO7
MX.<Q"=F9&_$#Q=<P3-/0*LN^1)3FP&=^'"5?TO:"WM)T-7O4#VCDBG2=\!++
M%J[!E_8"V_+HQ^)HSEIC[ VO^JBH^A846)%F7@T.:\F(5U^L;85LNGB^:)WR
M<X^7XI#Q&MLA_$WU?8O26:O_L>=W:^* U_A!K"4'1DF2H0S2SC<JBAV+KDQZ
M?'[ZGBW(]>DL?;7@ "Q;E?]^XE"\X*5 O+1%A2*63XW4211T0IOUJ8R#K([-
MDCU*L^_J%*\T/<J.RO\IM:#^:OH,Y.]LGML:S]38\LXSN,X&^^?0N6L=Q5:8
MU.3\.)TN/E=9JRXDM'SW9.JLO0I9I&N&ABQ:G$45TT06+<XB4R\ABQ9F44'5
MR\BB)5E4+B*+%F>15H!H2[*HH.%$6Y9%1:"_)(N**NJB)5EDJ :R:'$6E<P*
MLFAQ%I4AVM(LJJ N6I)%%1-9M"2+3!5A[+(LJNC(HH595#0T_.FX-(M0BI9D
MD5E&7;0XBPQ5O\HGVM@;S^KX=C/M#+@Z.1DR\0W3G4R#WK>E'7D?OLN_I5LY
MYHGA>[WW_& E>YUV2BJO^.*O0J;475\1:;FDG7N_S$V'0K"N[76<M'/K_7NP
M>=Y$H9T<?''LQ= #EZ_2WW@T>$$]T6E-NY426=)+OVS/[K)6.^[=>Z>-S-S8
M^'G6\3>F^W/3EQW?C5^2PX[OB^P*P@:UVA;/!=JT0IXM/9J,ADE+.SW?=]H4
M_5[TH1LR.W[0B]F#SLD)"X\G!\R,?LEFQ'-=#&$@)Y:H/ZJDQ>)FX-2:EN]X
MTSW8@_4.DJ5$VI0T;4H_;>E(':5AUQK,5QYM[3"OS4)J>5Y@K^V+Y<]:+:OA
MVDK'KP==YBB;CB-VX =W%GY*_" F)T''GU'%#1(E?G.1<RUYV $_FT3)>N7R
M@A77FLD.U%S_)!"C1JI%U:R25ZX?D_XG27IK8K3(VB,OJ%M>;=L_6[]3'<G;
MOQW+U-O]O)Z_(T>[CS8?'!X3UR?/#WC=SHOQ_&5CRSXE<6C9LSIB^PM9/!=U
M?B:P*KG]XLR)@I>WJ^1Q0**.W4S.P[EK$J)6R?W[9.W_/OW7]%'=T*:'J)PO
MKE6)5>?Y3];NWU^RJ%XEM9J5Y%)-9,D[K%*H3F<[65O](5^4IF*5G+62E&AK
M>_SSYP>U73\=M;3^5R3]S2[_=#-L1.MWY*56?*/2_^8DG::J+TJG425[CW=K
M*<=ILB1FG>^*_VE^F0OSJU3E!?LLL).A4V2-4B7BE0<_UUN6&)E5+947[D:Y
M2AKMIV$@QKHQYX"O,V,;!;.P:!L5,59P?$6[OZ96+"U:TQ1EUG/K=BT2?U#5
MTLTL*[<:/XG2%98N>Y?YO%X](='Y>3UMSF!A4;=+ 8)\M+F[O_WPDKW2C'*%
M/K8>@R@0)9,H_GCRQ1M -9$F0 6H<@+5J RS;!K=]OO 4S**=$<\@Q[0@^@(
MZ  =H#.N0D8A4;E8H?P$.=FT;?X[\ 2>)/#T]I=ON$V_1T@$G:!37G6:EB$K
MHBH5:M5M!S@!)QDX_8/ Z4O@!)R 4VYQ&C%A%0UV%56EVUUFPQR8(\&</T-K
M'<@!.;DF9Y2$]X^$IN:HNLR)4)2YY Q7& QL%/NK*P=N,L-2LKID7W7ZS.?O
M ^^,.4^MT&J!6E K@5I[V#?VP>>(\0 NP,TON#.-F!/NY1'6XV88O+;J'ENY
ML#M)C8[!^3!6AK%;HT,?_Q?*0EDH>SV4'7$BH]Z^2E&E1VZK[?&/P!6XDL!5
MH=_ZNK "@%)0"DI=6:4F5%A)GQ_D@3PC"\D.E- <"8) T+4FZ#+B(T.G#]TS
M?IK *!@EYUHRN#21)K@$EW+CTA@(-V)DBE&^C XTHTQ!+(B5'09^@S 0W(+;
M_'*;LI!9^&="):@D??ZJKZ$25()*^57)G*O2Z(9!#LC)D)S/?H'61D #:*XG
M-)<1_I0T6 2+9%@4X9IL: 2-\JU1GX.5A#VE MT1S_ &WF#.7H@#<2#.N K9
M!$&Z:I3I4<_'Y%2 209,WQOM"/HC^H' $WC**4]C--R H8"Z6BDLGJ1J<+O,
MH;,^V=L^ELMQI8 V25 L@^(C1(@@& 3GF^ ^!_/:)&>(].0I1()(5U*DT=CP
M_A\0'$(FR'2#9')%66Z'/!@,(12$NHI"[0Y]ZK_ZR=_\1MSA92]]]W07'6_S
MT@2\@-=UP.LR^MPJ18 %L"3># 9WR 1)("G?)!57-?J0;[L$;^ -)G@",V#F
MIC-3RC3R,75(!(EP^2\L@D4WWJ(^!BL)>0 -H)$$S:_2!K9/OD(+&[@!-^!F
M>MN:BB$(X$9FCPZHF4@3J $U>:%FP$%&K6R:!HV@D12-OOS'E*/_1NP#D !2
M;D'2L@7)T&AZ,FAP"2[AXE:@!)2 TK@*%[!IZF*C;Y,*LT3W@Z"]W9T]!]+@
MM2BDY)!%'2^N$JU0G)N(]?7U_JZ(E^ND>I'DD#7^581U><TB*MX[ERVW;IAT
M1SS#;)A]0;/MX5CU#[Y$. FY(7=>Y1ZJD%$\J9<T>KBUC5@2+LF>L_!WD DR
M0:;<RG0N0T8V%0H&/7);;8]_M._60ROL/;7B)JR"59CX'4I!*2BUR(B;,-%N
MJ5A4CCK\Y-X2*\^9;/<B!O,OH ^"(!8YT4@*./@%O_*:,('O1)J +_#-"[ZS
M<<@H6BR53?JPTP9/X$D"3V]_@=9+T 2:<DO3N089>50N5G#I #"2UU2)>X!!
M)(B46Y$&'F3%4;E =_T346)[8 DL26#I^Z.C/7 3$N@$G?*KTP0/JYC:HZ)6
M*/\&Z -],'X#[L =N#-JPDK(*9;HX^ Y"]T31#UP1\H\'I@M%^; G#R;,X%"
M1BUR%1YR';(66 )+,N;6_5E_;MW?HB$.. &GW.)TKD)F+N&>BD );70@B8 D
MD'0.0E8>F28]L/R>.!7@$ER2X]*?/OUI_[[T?_&?;W:@%)2"4OE6:H()F9,@
M^F1O]U@J:J:.&PD#,]SF!'@!+^ UY&#>&(@9(KFB++=#QI\A$V2ZBC+=YBR1
MAHBQW']_PW\T4JEN RR !;"N+5BK;Q,LJ'J9;G(MQ)Q/P I8R1A \7.8!)-@
M4FY-FD+A!DP 6%"+%>6@M]VU65N4./DS (IOH#OB&<;"V(N.G?\G& MC86R.
MC1UHL(*KM0IJJ8RF1T@C0YHMM#'"&EB3;VOZ'&35QHAQ\-!(CD:8[!P:0:.<
M:Y3I*/B":E;H7A0^#@Y9#)6@DHS6N%_#))@$DW)LT@0**VF4 SR 9V0A>2/6
M,6LL_($_U]V?2XB--$VE'[G,<^ 3?)(Y;05_U+X!42 *1.65J#$;LO))U^B.
M>(9-L$G.33=@TD2:8!),RHU) P^R\JB@TBU.P6-^\,\8@B; )#EH$I?\]O[M
MS?#-#_G_MY_^%&A-I EH :W<H#6%QDVXODHSU'2]XR!)*YMSA=6,"3J>/)4Z
M991("L8CPFKI=V[$A/%P&2[GU^4^"W+G.Y2.5]D 7L!+!E[14"[E:] %ND!7
M;NGJHY!1,ZBNE>CFT398 DO2VC^_A$@0"2+E5:01$K)"23?HTR!R12/K7A0"
M)^ D :<:1HW )MB4;YNF95C%]5[B:QZSA@6  ) \@!0 !(  4.X!FI!A50#M
MF5M!J\V_J>X!(2 D":$?I0C]^6%_B.+N?X@ABH?#_J0?X7[%\]($I^!4GIR:
M 4AF#7IBQES^#,  V 4!.X).T DZY5RGO@<R!^Q]F^\W2C0Y.<)..SYV6\SY
M:\L58_!G!EF#UZ*PDD,6=;RX2K1"<6Z2UM?7^SLF7JZ3JKS$D37^Q81U>7TC
MJN,[ERYYI4!%/NR[]= *>T^MN(G %*[+&3L"TR?2!--A>FY,GRU#5A%G!6/M
M 9/TB[J?_ _&-@(I()5?I#(=;5_0RO01BY.YN!XRV[-"OH6MY-)J6 6K)%H%
MI2;2!*6@5%Z46LQ$5G85-7H4!^WC)B^:SJXO&B4A%L2"6! +8MUTL6;@D)53
M%97N!W[C.'C@QHBKH!24@E)0"DK-HB$SHW3T3D$FB?<1@TL3:8)+<"D_+NES
M>Z72U^\_U'&P[1_/V&KZ6A2Z2QC6.$Q(UD,8BVJ1[HAGZ M]$1?"7_A[P_T=
MBI!1.%@LENA1I\X?" K!D@26MH 24 )*^49I#(6,9#)48S@2Y2!PW!.7EST@
M!:00.X$I, 6FY@NQBFFQ#/2;01\Y^KS]-:[D@CMP)[?N+.DSNP@S)<VD3^JO
M^&$1HT7$6$:@ W3DW;8+\$RD"?  GKS ,QN'C-KG2@8"(M@DQ29[V![WP>\1
M&D$H")5;H8SYH=&EF%2!23!)ADF%T;F7OGA377B^ R6@!)2N+DJ5U;7701R(
M@T$)P ;8C&T#V&04 9D:/()'LB>?K?T6[7)0"2KE5J4^"YFI5*';79NUQ:'?
M[Q<!$ 6BY'0<@::)-($FT)0?FF;8D)%39:V$Z DT2;]UQU>(GD 4B,HK40,6
MLE*IH-*CF+4/],> "3!AUCZ !)!N-DCG(F1F$L8] "0I('WYSZE(7R-(@DDP
M*;\F93KPH6Q@X - DADA\0=NN0N20%)^23(R'?50KA1!$DB20=(1&NV@$33*
MMT9]#C+2J(*Q#=!(CD:?_7W*T2=?(#Z"2! IKR)5%HQK&-WP>W&C8WH@<".'
MFW]!Z -H $V.H=$SG1:H4M+%_2S"!Z(2CR 21,)4#5 )*MUTE<98R,HFLTB/
MF[P8.H_"H-/>:O)R%C)<' ND+HK4]T$4B )1^29JM@ZK:+ SU0K=Y<?YE*'9
M#OX@2() $ @"3;"049!DJB;]R.6GA_LQ"T<\A%)0"DI!*2AUXY6:#4167AD8
M^0V?9-ZWCS^4/V"T'8R"4;DURLAT_+=9T>EVJQWWDIKK6.P<> )/")] $VBZ
MZ31-VY"-4D6U7$#D!)HPT1U@ DPW'J8A!RL8\ !J0(WT*$C<*NES--.!')!S
M'<FYA !(+QE0"2KA[DC0"!I!HP$'JPB 0 VHD41-830"X@'0PI,9XD <B)-'
M<=XM_GGA,(_%["5Y*'[RLG"1:C?]V/.[-=<JZ+6&;=<<5N\TE"3I"D]ZNA.*
M[8EZ(E+FJC-<H;^OBMC7LG+(6L$9.V TV8!D8,OTF<_?!]X9<S;#T.IM>ZP%
M;^&MG-"./S[ ''S@%MSFF-N91F35^FABUCX0)3,D1"@XGB;8!)MR8Y,Y?]J^
MT0U#&DB3H33?&VU\_"^$0R 'Y%Q'<BXA_C$TC3[:.K8:#>9 )LATT5O;_ASC
M+^ 1/,JO1Z,@9&:23A^Q>*L3ALR/T\DMMMJ=8[>%"WA!%*Z2 E) ZJ8C-5>(
MS,S"!$@ "C-,@"@"HD#4.0BKZ$H"-L!&;C3$'U^A'PG>P)OKZ,UEQ#]E,_DU
M2 ))B'_@$3RZZ1[U0<C*(Q.7^L(C*1YM02-H!(WRK9%YT6M\+ZA1"1I!(\FW
MQ_@&+78P"2;EUZ32RGJ(2K@?$\"1 \[;OP,S8 ;,Y)694J9W82J6R@9]Z)[M
M!WX#( $D] ^!); $EB9=6$405%;1Z@9S9+:Z09R)-$$<B),7<08<9!0(E0T-
M&D$CB?/_0*.)-$$C:)0;C?H<9*11I838"!K)F?/GE[ (%L&B_%HTP" KB\H8
MK "+I%CTV:_2T.@37,T*D2!2?D4JKV[V!' #;B1Q<X2&.% #:JXM-9<0_)AE
MDV[&?,^:8[/9 2?@A'%RX D\W7">YOBP@L#(4'6,4( ]&*$ >2 /Y!ERD$U@
M9*BE,C2"1O(BH:_1)02.P%%N.>I[D!5'9I'N^J(><I)J"S2!)EQ8!)D@$V2:
M0<-*VN= $ B23]!W4H+(=].?/]G]S1O^X[O#[J/OH"-I7IJ@%)2"4E *2EW>
M: ;^"/Z(ICQ0!(I $2B:G2A0-&\A>8,;TL?GH @4@:+K3M$E]##I:HD^#SQ>
M"CR&Z5*AE22M</LB* 6E\JW4+!I6$3"!(!"TXK:[^[]#P 2*0!$H6O@]Y4H%
MH[^ACPQ]; 1 4 ?JY%F=@09+6^9:UBG;")DH&N-U2OK-Z2?\W4=6;'ED.PR#
MD*=F^^AXXUND1M?,$MT/@O9VUQ:IHMV65S6K(K,V?5%&+,]UR(\/]HG--V7Q
MPQV2M6>^*ZK#*E&[6N$.>6U%*0JBJHR;C#"/M1BOF^V GX/\)\]*\6LGL#OB
M]W3!WASSY415> % TH\]OUMSK8)>:]AVS6'U3D-)]E[A>T\'K\0W1(J,/"-N
ME.!HD?,<&^XOV8W%Y^V ;Z#N]7B^A&&G'4_B,Y$3H>5')T'8(K';XGEMJL56
M-%4*R0MF-X.7Y,-W_#=W X?#'21BC\6?.&E*DL,;Q;R2$<=W6C=I*;C$(]Z,
M6Y[<'1E[DR24G[I1QXNCZOSE'CS;W7\XJQZX:%:(JB-]F9S/1IE7MLF9%?"_
M %^+8\M$=4$"VQ87XCOD=5.<<ZS+[$YRZ.,F+Z_)GRKRT\6KX 8;.2PT[/A)
M,C4U36;(R&OQ)#Y,_DKK\*R<GXO'@:C_TI/$("W7[_ 5B4DBQNL?9WQ%02XO
MZN+ 5(G6_\@.VKV79(L_BUTO)?5/1.)@^>[V#W'ZYS8_X(VD*^56OSA][+;Y
M,18+BNWR=^_P9_'L+=9T52UKFF[6]$)1IWQ3MVZ)X]D_8/R<30L1>>W&S:2N
M'3G279NUQ3+56^];!!:DVG*L-J\;)A,\^'UR7,O%L<,ZON3Y ;ZK6/?N*NV0
M\>=ZX/3X#W&>WOM_4$L! A0#"@    @ !+Y]-YUKD-VH%0  4#4# !(     
M         *2!     &5X96-U=&EO;E]L;V<N:'1M;%!+!08      0 ! $  
(  #8%0     ! 
end

Mime
View raw message