harmony-alerts mailing list archives

Site index · List index
Message view « Date » · « Thread »
Top « Date » · « Thread »
From nom...@intel.com
Subject [build-test alert] FAILED Windows 2003 x86: jdktools-test debug
Date Wed, 28 Nov 2007 11:28:48 GMT

BUILD FAILED:
	Ant Error Message:
D:\cc\cc-common\scripts\cc-exec-adaptor.xml:104: The following error occurred while executing
this line: D:\cc\cc-common\adaptors\jdktools-test\adaptor.xml:28: The following error occurred
while executing this line: D:\cc\cc-common\build\checkouts\hdk\working_jdktools\build.xml:242:
The following error occurred while executing this line: D:\cc\cc-common\build\checkouts\hdk\working_jdktools\make\build-test.xml:97:
There were test errors.

Date of build:	2007-11-28 17:05:26 +0600
Time to build:	23 minutes 14 seconds
Last changed:	11/28/2007 14:55:27
Last log entry:	hdk

***********************************************************
Errors/Warnings:	(229)
            
Result: 1
[cc-ant]: Test Suite 'jdktools-test' execution. Repository updated: ${repository.updated}
[cc-ant]: Check for 'run' failure of hdk = ${hdk.parameters.run.failed}
[cc-ant]: Result: failed.superiors = '${failed.superiors}'
========================================
Testing jdktools binaries...
========================================
Compiling JPDA tests
Since fork is false, ignoring memoryMaximumSize setting
----------
1. WARNING in D:\cc\cc-common\build\checkouts\hdk\working_jdktools\modules\jpda\test\common\unit\org\apache\harmony\jpda\tests\framework\DebuggeeRegister.java
(at line 58)
registered.add(debuggee);
^^^^^^^^^^^^^^^^^^^^^^^^
Type safety: The method add(Object) belongs to the raw type LinkedList. References to generic
type LinkedList<E> should be parameterized
----------
----------
2. WARNING in D:\cc\cc-common\build\checkouts\hdk\working_jdktools\modules\jpda\test\common\unit\org\apache\harmony\jpda\tests\framework\TestOptions.java
(at line 505)
internalProperties.put(name, value);
^^^^^^^^^^^^^^^^^^^^^^^^^^^^^^^^^^^
Type safety: The method put(Object, Object) belongs to the raw type HashMap. References to
generic type HashMap<K,V> should be parameterized
----------
----------
3. WARNING in D:\cc\cc-common\build\checkouts\hdk\working_jdktools\modules\jpda\test\common\unit\org\apache\harmony\jpda\tests\framework\jdwp\PacketDispatcher.java
(at line 114)
eventQueue.add(eventPacket);
^^^^^^^^^^^^^^^^^^^^^^^^^^^
Type safety: The method add(Object) belongs to the raw type List. References to generic type
List<E> should be parameterized
----------
4. WARNING in D:\cc\cc-common\build\checkouts\hdk\working_jdktools\modules\jpda\test\common\unit\org\apache\harmony\jpda\tests\framework\jdwp\PacketDispatcher.java
(at line 249)
replies.put(new Integer(replyPacket.getId()),
replyPacket);
^^^^^^^^^^^^^^^^^^^^^^^^^^^^^^^^^^^^^^^^^^^^^^^^^^^^^^^^^^^^^^^^^^^^^^^^^^^^^^^^^^^^^^^^^^^
Type safety: The method put(Object, Object) belongs to the raw type Hashtable. References
to generic type Hashtable<K,V> should be parameterized
----------
5. WARNING in D:\cc\cc-common\build\checkouts\hdk\working_jdktools\modules\jpda\test\common\unit\org\apache\harmony\jpda\tests\framework\jdwp\PacketDispatcher.java
(at line 284)
commands.put(Id, command);
^^^^^^^^^^^^^^^^^^^^^^^^^
Type safety: The method put(Object, Object) belongs to the raw type Hashtable. References
to generic type Hashtable<K,V> should be parameterized
----------
6. WARNING in D:\cc\cc-common\build\checkouts\hdk\working_jdktools\modules\jpda\test\common\unit\org\apache\harmony\jpda\tests\framework\jdwp\PacketDispatcher.java
(at line 355)
commands.put(Id, command);
^^^^^^^^^^^^^^^^^^^^^^^^^
Type safety: The method put(Object, Object) belongs to the raw type Hashtable. References
to generic type Hashtable<K,V> should be parameterized
----------
----------
7. WARNING in D:\cc\cc-common\build\checkouts\hdk\working_jdktools\modules\jpda\test\common\unit\org\apache\harmony\jpda\tests\framework\jdwp\VmMirror.java
(at line 1834)
frames.add(frame);
^^^^^^^^^^^^^^^^^
Type safety: The method add(Object) belongs to the raw type ArrayList. References to generic
type ArrayList<E> should be parameterized
----------
8. WARNING in D:\cc\cc-common\build\checkouts\hdk\working_jdktools\modules\jpda\test\common\unit\org\apache\harmony\jpda\tests\framework\jdwp\VmMirror.java
(at line 1902)
vars.add(var);
^^^^^^^^^^^^^
Type safety: The method add(Object) belongs to the raw type ArrayList. References to generic
type ArrayList<E> should be parameterized
----------
9. WARNING in D:\cc\cc-common\build\checkouts\hdk\working_jdktools\modules\jpda\test\common\unit\org\apache\harmony\jpda\tests\framework\jdwp\VmMirror.java
(at line 2122)
fields.add(superClassFields.toArray()[i]);
^^^^^^^^^^^^^^^^^^^^^^^^^^^^^^^^^^^^^^^^^
Type safety: The method add(Object) belongs to the raw type ArrayList. References to generic
type ArrayList<E> should be parameterized
----------
10. WARNING in D:\cc\cc-common\build\checkouts\hdk\working_jdktools\modules\jpda\test\common\unit\org\apache\harmony\jpda\tests\framework\jdwp\VmMirror.java
(at line 2132)
fields.add(field);
^^^^^^^^^^^^^^^^^
Type safety: The method add(Object) belongs to the raw type ArrayList. References to generic
type ArrayList<E> should be parameterized
----------
----------
11. WARNING in D:\cc\cc-common\build\checkouts\hdk\working_jdktools\modules\jpda\test\common\unit\org\apache\harmony\jpda\tests\jdwp\DebuggerOnDemand\OnthowDebuggerLaunchDebuggee.java
(at line 94)
class ExceptionForDebugger extends Exception {
^^^^^^^^^^^^^^^^^^^^
The serializable class ExceptionForDebugger does not declare a static final serialVersionUID
field of type long
----------
----------
12. WARNING in D:\cc\cc-common\build\checkouts\hdk\working_jdktools\modules\jpda\test\common\unit\org\apache\harmony\jpda\tests\jdwp\Events\ClassUnloadDebuggee.java
(at line 32)
import java.util.LinkedList;
^^^^^^^^^^^^^^^^^^^^
The import java.util.LinkedList is never used
----------
13. WARNING in D:\cc\cc-common\build\checkouts\hdk\working_jdktools\modules\jpda\test\common\unit\org\apache\harmony\jpda\tests\jdwp\Events\ClassUnloadDebuggee.java
(at line 97)
boolean isOutOfMemory = false;
^^^^^^^^^^^^^
The local variable isOutOfMemory is never read
----------
14. WARNING in D:\cc\cc-common\build\checkouts\hdk\working_jdktools\modules\jpda\test\common\unit\org\apache\harmony\jpda\tests\jdwp\Events\ClassUnloadDebuggee.java
(at line 171)
public Class loadClass(String name) throws ClassNotFoundException {
^^^^^
Type safety: The return type Class for loadClass(String) from the type ClassUnloadDebuggee.CustomLoader
needs unchecked conversion to conform to Class<?> from the type ClassLoader
----------
15. WARNING in D:\cc\cc-common\build\checkouts\hdk\working_jdktools\modules\jpda\test\common\unit\org\apache\harmony\jpda\tests\jdwp\Events\ClassUnloadDebuggee.java
(at line 179)
public Class findClass(String name) throws ClassNotFoundException {
^^^^^
Type safety: The return type Class for findClass(String) from the type ClassUnloadDebuggee.CustomLoader
needs unchecked conversion to conform to Class<?> from the type ClassLoader
----------
----------
16. WARNING in D:\cc\cc-common\build\checkouts\hdk\working_jdktools\modules\jpda\test\common\unit\org\apache\harmony\jpda\tests\jdwp\Events\CombinedEvents002Test.java
(at line 100)
boolean expectColocatedEvents = (testedMethodStartCodeIndex == testedMethodEndCodeIndex);
^^^^^^^^^^^^^^^^^^^^^
The local variable expectColocatedEvents is never read
----------
----------
17. WARNING in D:\cc\cc-common\build\checkouts\hdk\working_jdktools\modules\jpda\test\common\unit\org\apache\harmony\jpda\tests\jdwp\Events\CombinedEvents003Test.java
(at line 53)
private boolean eventMethodExitReceived = false;
^^^^^^^^^^^^^^^^^^^^^^^
The field CombinedEvents003Test.eventMethodExitReceived is never read locally
----------
18. WARNING in D:\cc\cc-common\build\checkouts\hdk\working_jdktools\modules\jpda\test\common\unit\org\apache\harmony\jpda\tests\jdwp\Events\CombinedEvents003Test.java
(at line 76)
int EXPECTED_EVENTS_COUNT = EXPECTED_EVENTS_ARRAY.length;
^^^^^^^^^^^^^^^^^^^^^
The local variable EXPECTED_EVENTS_COUNT is never read
----------
----------
19. WARNING in D:\cc\cc-common\build\checkouts\hdk\working_jdktools\modules\jpda\test\common\unit\org\apache\harmony\jpda\tests\jdwp\Events\CombinedEventsTest.java
(at line 84)
int EXPECTED_EVENTS_COUNT = EXPECTED_EVENTS_ARRAY.length;
^^^^^^^^^^^^^^^^^^^^^
The local variable EXPECTED_EVENTS_COUNT is never read
----------
20. WARNING in D:\cc\cc-common\build\checkouts\hdk\working_jdktools\modules\jpda\test\common\unit\org\apache\harmony\jpda\tests\jdwp\Events\CombinedEventsTest.java
(at line 212)
int EXPECTED_EVENTS_COUNT = EXPECTED_EVENTS_ARRAY.length;
^^^^^^^^^^^^^^^^^^^^^
The local variable EXPECTED_EVENTS_COUNT is never read
----------
21. WARNING in D:\cc\cc-common\build\checkouts\hdk\working_jdktools\modules\jpda\test\common\unit\org\apache\harmony\jpda\tests\jdwp\Events\CombinedEventsTest.java
(at line 348)
int EXPECTED_EVENTS_COUNT = EXPECTED_EVENTS_ARRAY.length;
^^^^^^^^^^^^^^^^^^^^^
The local variable EXPECTED_EVENTS_COUNT is never read
----------
22. WARNING in D:\cc\cc-common\build\checkouts\hdk\working_jdktools\modules\jpda\test\common\unit\org\apache\harmony\jpda\tests\jdwp\Events\CombinedEventsTest.java
(at line 732)
String failureMessage = "## FAILURE during checking events! !";
^^^^^^^^^^^^^^
The local variable failureMessage is never read
----------
23. WARNING in D:\cc\cc-common\build\checkouts\hdk\working_jdktools\modules\jpda\test\common\unit\org\apache\harmony\jpda\tests\jdwp\Events\CombinedEventsTest.java
(at line 894)
String failureMessage = "## FAILURE during checking events !";
^^^^^^^^^^^^^^
The local variable failureMessage is never read
----------
----------
24. WARNING in D:\cc\cc-common\build\checkouts\hdk\working_jdktools\modules\jpda\test\common\unit\org\apache\harmony\jpda\tests\jdwp\Events\CombinedEventsTestCase.java
(at line 135)
long methodStartCodeIndex = lineTableReply.getNextValueAsLong();
^^^^^^^^^^^^^^^^^^^^
The local variable methodStartCodeIndex is never read
----------
25. WARNING in D:\cc\cc-common\build\checkouts\hdk\working_jdktools\modules\jpda\test\common\unit\org\apache\harmony\jpda\tests\jdwp\Events\CombinedEventsTestCase.java
(at line 187)
long methodStartCodeIndex = reply.getNextValueAsLong();
^^^^^^^^^^^^^^^^^^^^
The local variable methodStartCodeIndex is never read
----------
----------
26. WARNING in D:\cc\cc-common\build\checkouts\hdk\working_jdktools\modules\jpda\test\common\unit\org\apache\harmony\jpda\tests\jdwp\Events\ExceptionTest.java
(at line 188)
long frameID = reply.getNextValueAsFrameID();
^^^^^^^
The local variable frameID is never read
----------
----------
27. WARNING in D:\cc\cc-common\build\checkouts\hdk\working_jdktools\modules\jpda\test\common\unit\org\apache\harmony\jpda\tests\jdwp\ThreadReference\FramesTest.java
(at line 450)
frames.add(new FrameStruct(frameID, loc));
^^^^^^^^^^^^^^^^^^^^^^^^^^^^^^^^^^^^^^^^^
Type safety: The method add(Object) belongs to the raw type Vector. References to generic
type Vector<E> should be parameterized
----------
----------
28. WARNING in D:\cc\cc-common\build\checkouts\hdk\working_jdktools\modules\jpda\test\common\unit\org\apache\harmony\jpda\tests\jdwp\share\JDWPUnitDebuggeeProcessWrapper.java
(at line 233)
argv.add(val);
^^^^^^^^^^^^^
Type safety: The method add(Object) belongs to the raw type Vector. References to generic
type Vector<E> should be parameterized
----------
29. WARNING in D:\cc\cc-common\build\checkouts\hdk\working_jdktools\modules\jpda\test\common\unit\org\apache\harmony\jpda\tests\jdwp\share\JDWPUnitDebuggeeProcessWrapper.java
(at line 253)
return (String[])argv.toArray(args);
^^^^^^^^^^^^^^^^^^
Type safety: The method toArray(Object[]) belongs to the raw type Vector. References to generic
type Vector<E> should be parameterized
----------
29 problems (29 warnings)
JPDA exclude list: D:\cc\cc-common\build\checkouts\hdk\working_classlib\deploy\build\jdktools.jpda.exclude
Running JPDA tests
Debugger JVM=D:\cc\cc-common\build\checkouts\hdk\target\hdk\jdk\jre/bin/java
Debuggee JVM=D:\cc\cc-common\build\checkouts\hdk\target\hdk\jdk\jre/bin/java
SAMSA exclude list: D:\cc\cc-common\build\checkouts\hdk\working_classlib\deploy\build\jdktools.samsa.exclude
Running SAMSA tests
test.jre.home=D:\cc\cc-common\build\checkouts\hdk\target\hdk\jdk\jre
Run jdk/bin/java -version in D:\cc\cc-common\build\checkouts\hdk\working_jdktools\build\test_report
java version "1.5.0"
pre-alpha : not complete or compatible
svn = r598917, (Nov 28 2007), Windows/ia32/msvc 1310, debug build
http://harmony.apache.org
Run jdk/bin/javac -version in D:\cc\cc-common\build\checkouts\hdk\working_jdktools\build\test_report
Run jdk/bin/javah in D:\cc\cc-common\build\checkouts\hdk\working_jdktools\build\test_report
Run jdk/bin/javadoc in D:\cc\cc-common\build\checkouts\hdk\working_jdktools\build\test_report
Run jdk/bin/jarsigner in D:\cc\cc-common\build\checkouts\hdk\working_jdktools\build\test_report
Run jdk/bin/keytool -help in D:\cc\cc-common\build\checkouts\hdk\working_jdktools\build\test_report
Compiling TOOLS tests
Since fork is false, ignoring memoryMaximumSize setting
----------
1. WARNING in D:\cc\cc-common\build\checkouts\hdk\working_jdktools\modules\tools\src\test\java\org\apache\harmony\tests\tools\javah\Test\Test01.java
(at line 24)
private static final long xxx2 = 1;
^^^^
The field Test01.xxx2 is never read locally
----------
1 problem (1 warning)
TOOLS exclude list: D:\cc\cc-common\build\checkouts\hdk\working_classlib\deploy\build\jdktools.tools.exclude
Running TOOLS tests
test.jre.home=D:\cc\cc-common\build\checkouts\hdk\target\hdk\jdk\jre
The test report is in D:\cc\cc-common\build\checkouts\hdk\working_jdktools\build\test_report\html\index.html
The execution FAILED with the following exception:
The following error occurred while executing this line:
D:\cc\cc-common\adaptors\jdktools-test\adaptor.xml:28: The following error occurred while
executing this line:
D:\cc\cc-common\build\checkouts\hdk\working_jdktools\build.xml:242: The following error occurred
while executing this line:
D:\cc\cc-common\build\checkouts\hdk\working_jdktools\make\build-test.xml:97: There were test
errors.

***********************************************************
Unit Tests: (160)
        
error: testOwnedMonitors001 org.apache.harmony.jpda.tests.jdwp.ThreadReference.OwnedMonitorsTest
Unit Test Error Details:	(1)
                
Test: testOwnedMonitors001Class: org.apache.harmony.jpda.tests.jdwp.ThreadReference.OwnedMonitorsTestorg.apache.harmony.jpda.tests.framework.TestErrorException:
Debuggee process did not finish during timeout
	at org.apache.harmony.jpda.tests.jdwp.share.JDWPUnitDebuggeeProcessWrapper.WaitForProcessExit(JDWPUnitDebuggeeProcessWrapper.java:284)
	at org.apache.harmony.jpda.tests.jdwp.share.JDWPUnitDebuggeeProcessWrapper.finishProcessAndRedirectors(JDWPUnitDebuggeeProcessWrapper.java:87)
	at org.apache.harmony.jpda.tests.jdwp.share.JDWPUnitDebuggeeWrapper.stop(JDWPUnitDebuggeeWrapper.java:109)
	at org.apache.harmony.jpda.tests.jdwp.share.JDWPTestCase.internalTearDown(JDWPTestCase.java:108)
	at org.apache.harmony.jpda.tests.jdwp.share.JDWPSyncTestCase.internalTearDown(JDWPSyncTestCase.java:83)
	at org.apache.harmony.jpda.tests.jdwp.share.JDWPRawTestCase.tearDown(JDWPRawTestCase.java:118)
Caused by: java.lang.IllegalThreadStateException: process has not exited
	at java.lang.Runtime$SubProcess.exitValue(Runtime.java:357)
	at org.apache.harmony.jpda.tests.jdwp.share.JDWPUnitDebuggeeProcessWrapper.WaitForProcessExit(JDWPUnitDebuggeeProcessWrapper.java:279)
	at org.apache.harmony.jpda.tests.jdwp.share.JDWPUnitDebuggeeProcessWrapper.finishProcessAndRedirectors(JDWPUnitDebuggeeProcessWrapper.java:87)
	... 14 more

***********************************************************
Modifications since last successful build:	(1)
            
add cc-hdk log20071128145527Lbuild.389 11/28/2007 14:55:27hdk

begin 644 execution_log.zip
M4$L#! H    ( ):+?#<V3<,3*A(  )1^   2    97AE8W5T:6]N7VQO9RYH
M=&UL[5U];]L\DO\[!?H=N,_BL D0*WZ)W[)N#KDDW:9/T_3BM,\=ZE[!2+2M
M5!:UI)3$6SS?_69(R;8D6[83IG&+-=I HLCA<'[#X7!(49UA./(..]?<&1]V
M L$..Y3(<.RQ5W_K<S\L2?=?[("TRO_Q][\=OGP1!0X-64G>^@<O7[Q\49(L
MC(+2C?,MY-R3I3NID^-LV7018;&3*/!<&YX[)!#\AMDA\>F($=<G[BC@(K3(
MASC]B@>E=^R6>9@S8"(<$X?U7=\-7>Y+?0UD^JZ0(98_.>C9-OPKV7PTXGY/
MVL(-0MF+2[M,6O<CCU#?(71 L<)\F>O(]9R>/63V-QY!V:'SK7?'Q3?7'WQ-
M&M0;T6\L0Q4;&#(90@L)_CXS>\B_D!>O5OR]N(+"4 E)*B'7KD\%4K>LU:D@
M&[;'J%]"9F0)VA!$H1*_S8-QZ4:P4M_UF$;$'HZXDTV+LQTD+2I!GD@_50T;
M?7-<\84<"Z9 A)N#ATE19\(JO@J&R#]=!1(;HVZU7#(H'?-1X'HH_;<?3HY(
M7.+)F.G9'I62)57<T%MJSS)1;5:(Y)&P&5&XD) _49U=U\=*H!QQ)>E33[)=
MX@Y\+I"/$1MQ,3ZG]^XH&G7!$A#H\*BD:2*ER2^=7K'('T>7[\_>_^/A'4VK
M7N\&+(IJ1R\N'8$1Z'$QZ-&  HW>D I('D\SREY?@%E!BKT3=AT-!HQ=LH$K
M0R8L9##-*]FF(0'A,U)O[:0?;8FX&',LZCC;3DQMY^\DD_'_%OS2V:[& 0B2
M]EDX/B!70P9B#H<<3!+0OKA&P[=#KIG'_8$"/H0<@MZ1$(N]<_UOS'D'[%CD
MDO6!)\!/91LPGPG7SF;KG!X2.>21YP!-$E"4"30%L'16 W%1>G53P$6[>1&H
M$:$8UW(]"ZSK@RA\ZGV86G(PEMLX'.V26^I%@/&*$*^--E:DT=XERU!_0^7P
MG :%D,=Y.K_O?GHBQ&N;@OB-<Q?T/E#[&PM/7!G0$$H4]^E*93^+/;@5?OC?
M$8N8ZM3J5M-<!W.3/7MIGS;0F_=_7@RK^^V\8097,NFT[(Z<07\>,+&-Z6--
MW!JP\,S9WMG9S=!=\ILA\1 ;\-#?T]B.D%Y[;*GU4+D,V(_Z3ZQCK9R=P(IA
MPJ"5[,S9)7'"ZEKQ*V#:^'DQK=5SX_Z_,2U*;VX4UI]&YZX0?,GXWJKE.JZB
M(]7@KBZ7@VMN,#\2@HZ7CNB37(\>UEL_(63M<C4+V2T5&C"X*(;KYX6J_?-!
M5:U4<U#U7>8Y&BP9P>3I&*,+KW5BR)6XMG<^NU\>[CS]O!!7RC\CQK4BC-7E
MKVQ!%V+YS$$LA6 <OQ(7_@E#/Z5WX8,@[Y+D=S3R[6$2Y"J$N9WW;['CDM-[
MFZD8RFLN$K*$W8<,O*3I0_(]4UC/E5;HO4,,'0J7>NZ_T'LA!;4Z'(#V>4@<
M!KD$([@@04. O._ZU(OI?&)"0L&/9R=$Z2;A?:T2J$Z/A/R90UL*\E.,1\B>
M,JL??8]39R5\\YU8KZD0O+6BT/6L:6PPVYW).G 6T,50LL]N <M(KFPSGSFZ
M]!BAMYM9H5\#/XSZ((B+*+SHGZLX.GFE ^P+Q$Z6"-SC-F@_>$:NZD%ITA.)
M"T97E?@SQX(>(_%*LY(5>1!=>V C%"6"A-35=C=4*QD8TMV!$4;P.ZGSO.?A
M:Q[YSC+C1E89V 0+(^%K Z0YZ'.1XV*'] 4?J7%NFC/3ZN-(AGST#I( 3)\Q
M,+]HW $%YL TU;_5=@]'0KB#6D9XJ2AU_O-P7@6:UHHZ\<RQF\?I1"X^F-()
M&#TV0">R7&R^3BS4E6>.":5TA8^N<2N OBV7J[@H5*PMY?(BH\WN W!-CSD:
MW#"A"<9[&^MESKER8KLA%9#'86>^P^[)JU=D]NDI@)P\RWG-<^W]RG9_/G</
ML/\+<7WF^$\1KK6EN-9K.2,@W%N0%)G B[1BF.[=\)+9S+V%CK1D="Y$;1YN
MVBV=WX)%/*1@U,A[XQ5A>^88T.-@:S;FK,V2T__Y<'I\=7KR]?33Z?NK[M?C
MBX_OKP"H;/K1Y>71_UH>\P?A<!Y^#^MI\VLWV=.>.1:T&+*E>.7727XAO*K/
M'+]Y!"[52GX"^ L!LPG!F(<!4]O/;2OZE8#9I)#)>L T\R&3>'[0IZX7"7;.
MI*0#!J#\]M>_DM='9^\^7IX2)U)Y5)OP0HWH\B_D+[^M%%59"DVF\H=@LDD1
ME35'EWR8\N&8;! D"Z':I%!,#JIC*I?,O&NY%7:,PL;A_NQ,296Y0HE>XAX;
MW*#SGMV'GW"[W1',3/W!]OPITX-,W%P>'M*;-BDR\@"(6KD891%$XB="9B%B
M&Q2?F 24EL<E6CD_00&EUO3.3A9@\UH_+89GN8&+ZS )PB8$$ZZ&V)#),F)/
M26OY*+1?SX6(9O:4X'Y#10A&IL@.MV/A[:)0=S9AU?L3/.6B</E49WFZ+>*;
M$)*0\(#UWI[\\>$CE$ABJA\$!X'(/P0-@F5[ FNYD!(5@]MXGXKWH_:I_#@X
MJYL0EG@\;/E(8!R1CR/OG[_L*!R3W2IP(Q?&:B>_A_;8I!8-,]2]$4#C>W5@
M^4>2;,/-'14^"$;NX,M2 8PS $&)W=M>Y+#,"U/J-:GX$<A;ANN]%*66_SWW
MNN? 8,;'<=Y$>RQ4!BNF'K\X./>UK<O(]^>]M)4\)V2RJ^#MI_-7JW ([@@,
MK>KR!O\+M@>^UMY4TW*TF3G:GV^P>TS;!?W$TOW$BON)%HUJJH7]Q/KDBC"B
MWCED JVWXFT1.+:E26**)/@&)JGLDM=Z*B,/2'F7G.+F('UYY8X881X-)',.
M2,.J5EI$,OOQI/:M9JMBC%1] YEJ5ZNF2+4J-6.D]HV1:M>:A:1JJY*J[%OU
M]GXAK>JJM-J;J5>M:G&_64=6U6*N]E<E5:M;M25LK=S"N@43RDT3.[1OOUBM
MUFE?L[@[-U86>]EJ+)'5&MI>KYBS?<;$7BT;,S+FF"K7#-EC(%5IF.F"E9;5
M+A?36D=6E;:Y$<?8X-6LF=/0LJ'NC*3,#:GF1F>38Y<Y93!&"@QRW1Q7!M7J
M1YFK-0Q[RY2DZE:]:<QI;]3-6:N&.5+F5,$@4VUS#I%!K@SJNDD+8VY::9 K
M@[*JF1NY#(X1;7-Z97+D,J<,)A$T9V0,JN@F,M5HF0-PXV8WFZI4[;*A:$QU
MWZINI(DQ-E."R7QY\YQCLZ0,CC>;.705=YSZ&MI>;IB;ZS:>/1)=R<<8:E:C
M.L]DG7:O5EE1R*R66Q=W/G/..=" "I$CM=_J],1,9,60 "MHIPWA6C%HJ"L&
ME:1BL$?5ET[MUIB[[IM;^FBWC%F?5M,8J66#[3I<+9GGKQ,+KA4KPQJD&DL6
M&59?KVB8A-"@9]E8$L]_KCGU1LY]3#DF5:N\1$=7)E4SN<#:;)DC92[LTVYL
M9"AC\Q9W"C5TGG/R\/T4;[@WL\W6P!A>-K=RVFA9IM9SF^;Z?!,ZJJ$^WS0W
M #27+L(^A]O?:"[=*; .A*;"QJ!7IE;>H(7&0@)(:]^8EII;:3:F68T9A^#E
MBY!']K 4OW0BU0'M!]-TIHC,I++)0>T'R[?O=8_.NT^X?T_2D9S9P(?UVMRW
M*<CE/8=J77W2O3[;'$_C]SGQ&;X^3T)V'^X2AZL#&G@X5(>-+]\!J!ND<J0S
M8))U(\#@\Q%[X"Z]7)5X1O]DZQXI)><O/'2S[()S\*'">V9_(4=JQ")O](A%
M]&E/3) #LFWOD&,>C(4[&(:DTFZ#JE7+Y8;:>!H7Z_)^>(?'**F3+:@ZU8(+
MXH)V>J[-? EJM$LHX!"H[S+@"93I^E4CDS;^5K%@VOX;26<!;2M1+QA28 J/
M;H+6!QX+&=:$UU MT$V7D;<^OLU0;[?:E>8NV7[/;PD80^"_N;-+_G!]A]_)
M/9?6JGLC>6N32JT"/48=ODZ4Q-+DAF$8'.SM)>-Z/,S#B%^,GOWD\)W:G@O]
MF[Q%,>HS_@&\LM5L EHUJV9!JZ8@GOW7.=R) .505F@V+7+D>40]!HO")!.W
MS+&*FS5\JM:\?7]64M\'(4.FSB/1G5AM3Z:X;SF=/7WW$5^<.YCGAL7[?I%S
MZQR_S/&9ZR/=OY"./BL,3VN1AT74)T72R824KCD/%150Q"'IX-]#U4<&+OAV
M1*7>N2!DW$<-K6:^@Z:(9PG-_^'N;8?U:>2%\;EF2+!0$,!3CA_\+> )=[O_
M )8XZ2":ARE2J'M(3G](9,*28(XKF(TFV_7784L&S';[KOIL2\[4Y%AR2$?7
MP\5XPE?"4DH#$\;L^$,=H$.IZE;C<%(9N1NZ]C!/M0^64[\@A2\B4#%>U@+7
MAYZ1K>9,)<9?Y)A1/?5V U1#HY"/P&BJ\S^6U0#VZYJ#@<G"AL<:B7A\1 L 
MLYAE_*;ZVBPUY2.H,_;P9),(N"+_A&F2!G*FT&I2ENB;*'E>C_%X/[ %64VX
M9!*4%YRG8COG</O)+!V0/T'R^C1"%T<TE"%P/69A$5LPG P0WR=C3'1U!4/F
M!=8\$[LU9>)[;!7_)&^/+I6_2  WFD%JI@#JD]L?SRE8I#EQJ2WXD9@  (L4
M'2Q/\N5+W]A80E=CI)-<?566<$N]EZ@=%:UPR?,, 96F7HB94L!;H*!25R@=
MH.;.UB\EP.$ A0EW25J>^TGAF7);)#EO"-(G9<DV& ['[??!U=#G<<VI<R?+
MH)(> */-\E?L8%B!^EI6W+9B"<-3!?C\\E;WM7*^K1-PG941S4.J#,N6:A6_
M=6&N0!U'?7V+>O&(D*O2@SZ2+@)-9G?)  )W 9<R[P^6;"; P5$:Y+@R\.B8
M8!+8&#SI2I+M"'BY<V%<3%04N4^XS$HOE)1TKKI'7S]>OCM$FBFE@GD7*  =
M!6AJAURXX3A?'FO7-/#JJ^HVLYJA$A(D(-LLNQEJ((O[,>D,.?1I$"%X<?+P
M^T$'._?AGTI4\%AY=M"K(1.),ZDF8JY=PJR!I3-:.J,%-N6@4JWMSZM+=PO\
M.\%]MD^D*MQ^<W7U 5WU[L7Q[]VL(&,8A;;R>H1 <E.KCT1M,0Y"/A T@'%3
M$8;)1:("8@%)5;B3\)>D*IK9WB;GL[$6%^H OA'UZ0"'Q 5F85I3FKNI/2A@
M$SJ<*3YQ5-#:CGV<AA@$6%Q;FM=)B4)F45O-<SO;90LJG&5XMDPAQR/'/+^C
M^#@/QQVDH@?9&M,23I=:P'3.-0 =PA&>E'#@?BKW('WW>UQEI/R"]+.$G>^E
M3OP!#&TK_IQ-T5X IG7TY5?U8:S#/RW+(J6W'?3"DDR%C/C\SD\^M"$SG&PI
MW1#LGUM;_] S2992"G@23>+O,X504+;PMK:.\2H]7 AVFUA\/#\ZRGH\)7UR
M9@B%]<6TBX<<["X/AUI9P!'/%G481C=@5+ED(W[+" QY,&50 _M\L[)58O<(
M%10Y51>IYF%]:@1&(RQ#AV>'U:T23+"!,A3O,IB+*%XQLW8R7)%,P*&UV9*H
M:U#N:@B.K-*[1'>Y=B )"(@FP&0+ZU.>H?B9/NZ9IOC>MH<P5]]!2I0<=R_U
MV119&L"C[7$?Q#7Y]"=D1\Z5V.9D5RZ1@ZA2?Y#VI+*YP=OR0UO!^ $O499:
M@AE>%3AY'VFK))G7UP0FJ@>>*R3&#EB*BC(9DP F,):CEGB5:?Z+7,FMJ>_\
M*?&<9^M40B[J6F\0Q:(.KNW-]TPOSX2IP+TXV,H4T5J7K3L?;5[ERYI7%Q?O
MNJE/:\:OH4^SU/_]U<O4Z0GZ3@I;'Z& %<P[.T&W5&=6(33U343UIUQ9\DVU
M1:>EIH[<5R?0W-_?5\DK4EEZ1,+D-__0&7TN:LR<(OJ84T^3$PS(=B4YOV"%
MXPNT+C[9^H?^^R/7/W*=R_SZQPJ+Z=/6XQ<!9+RN#BY(%\V?/G2Z2P'IPL7T
ME?<MU:R6N2T%[7KQ/H>5N2I;Y?VFF44\[>"4P%"5V"@(QSHQ#A/.).53,$17
MTMXAW.OFZ%MHE*"^U*>$ ^/0]F:C,<JH#794Y(;H0MA%C;FK/?SD>,_%\[XL
MO$1^)<S!PRG#+U_ R#-[JP6AY"-T9/#EBQ?()(Y)D7+R],8//4*K*"7'$*@Z
M!S Y?>M %9EY@/(GW+8C(:#OW0U=;T(1'H?H,J&=Q*^69YI.'1K@AMA)IU?,
M)<GX0?"#:DN? &.DOM5%K>O>K_[HRM4WT:>.@&*CW51<@.MSAW^41FFEMP#4
MSAX][.RIC\[OZ0_0[ZFOT?\_4$L! A0#"@    @ EHM\-S9-PQ,J$@  E'X 
M !(              *2!     &5X96-U=&EO;E]L;V<N:'1M;%!+!08     
. 0 ! $    !:$@     ! 
end

Mime
View raw message