harmony-alerts mailing list archives

Site index · List index
Message view « Date » · « Thread »
Top « Date » · « Thread »
From nom...@intel.com
Subject [build-test alert] FAILED Windows 2003 x86: jdktools-test debug
Date Tue, 27 Nov 2007 16:54:30 GMT

BUILD FAILED:
	Ant Error Message:
D:\cc\cc-common\scripts\cc-exec-adaptor.xml:104: The following error occurred while executing
this line: D:\cc\cc-common\adaptors\jdktools-test\adaptor.xml:28: The following error occurred
while executing this line: D:\cc\cc-common\build\checkouts\hdk\working_jdktools\build.xml:242:
The following error occurred while executing this line: D:\cc\cc-common\build\checkouts\hdk\working_jdktools\make\build-test.xml:97:
There were test errors.

Date of build:	2007-11-27 22:34:02 +0600
Time to build:	20 minutes 20 seconds
Last changed:	11/27/2007 21:56:04
Last log entry:	hdk

***********************************************************
Errors/Warnings:	(229)
            
Result: 1
[cc-ant]: Test Suite 'jdktools-test' execution. Repository updated: ${repository.updated}
[cc-ant]: Check for 'run' failure of hdk = ${hdk.parameters.run.failed}
[cc-ant]: Result: failed.superiors = '${failed.superiors}'
========================================
Testing jdktools binaries...
========================================
Compiling JPDA tests
Since fork is false, ignoring memoryMaximumSize setting
----------
1. WARNING in D:\cc\cc-common\build\checkouts\hdk\working_jdktools\modules\jpda\test\common\unit\org\apache\harmony\jpda\tests\framework\DebuggeeRegister.java
(at line 58)
registered.add(debuggee);
^^^^^^^^^^^^^^^^^^^^^^^^
Type safety: The method add(Object) belongs to the raw type LinkedList. References to generic
type LinkedList<E> should be parameterized
----------
----------
2. WARNING in D:\cc\cc-common\build\checkouts\hdk\working_jdktools\modules\jpda\test\common\unit\org\apache\harmony\jpda\tests\framework\TestOptions.java
(at line 505)
internalProperties.put(name, value);
^^^^^^^^^^^^^^^^^^^^^^^^^^^^^^^^^^^
Type safety: The method put(Object, Object) belongs to the raw type HashMap. References to
generic type HashMap<K,V> should be parameterized
----------
----------
3. WARNING in D:\cc\cc-common\build\checkouts\hdk\working_jdktools\modules\jpda\test\common\unit\org\apache\harmony\jpda\tests\framework\jdwp\PacketDispatcher.java
(at line 114)
eventQueue.add(eventPacket);
^^^^^^^^^^^^^^^^^^^^^^^^^^^
Type safety: The method add(Object) belongs to the raw type List. References to generic type
List<E> should be parameterized
----------
4. WARNING in D:\cc\cc-common\build\checkouts\hdk\working_jdktools\modules\jpda\test\common\unit\org\apache\harmony\jpda\tests\framework\jdwp\PacketDispatcher.java
(at line 249)
replies.put(new Integer(replyPacket.getId()),
replyPacket);
^^^^^^^^^^^^^^^^^^^^^^^^^^^^^^^^^^^^^^^^^^^^^^^^^^^^^^^^^^^^^^^^^^^^^^^^^^^^^^^^^^^^^^^^^^^
Type safety: The method put(Object, Object) belongs to the raw type Hashtable. References
to generic type Hashtable<K,V> should be parameterized
----------
5. WARNING in D:\cc\cc-common\build\checkouts\hdk\working_jdktools\modules\jpda\test\common\unit\org\apache\harmony\jpda\tests\framework\jdwp\PacketDispatcher.java
(at line 284)
commands.put(Id, command);
^^^^^^^^^^^^^^^^^^^^^^^^^
Type safety: The method put(Object, Object) belongs to the raw type Hashtable. References
to generic type Hashtable<K,V> should be parameterized
----------
6. WARNING in D:\cc\cc-common\build\checkouts\hdk\working_jdktools\modules\jpda\test\common\unit\org\apache\harmony\jpda\tests\framework\jdwp\PacketDispatcher.java
(at line 355)
commands.put(Id, command);
^^^^^^^^^^^^^^^^^^^^^^^^^
Type safety: The method put(Object, Object) belongs to the raw type Hashtable. References
to generic type Hashtable<K,V> should be parameterized
----------
----------
7. WARNING in D:\cc\cc-common\build\checkouts\hdk\working_jdktools\modules\jpda\test\common\unit\org\apache\harmony\jpda\tests\framework\jdwp\VmMirror.java
(at line 1834)
frames.add(frame);
^^^^^^^^^^^^^^^^^
Type safety: The method add(Object) belongs to the raw type ArrayList. References to generic
type ArrayList<E> should be parameterized
----------
8. WARNING in D:\cc\cc-common\build\checkouts\hdk\working_jdktools\modules\jpda\test\common\unit\org\apache\harmony\jpda\tests\framework\jdwp\VmMirror.java
(at line 1902)
vars.add(var);
^^^^^^^^^^^^^
Type safety: The method add(Object) belongs to the raw type ArrayList. References to generic
type ArrayList<E> should be parameterized
----------
9. WARNING in D:\cc\cc-common\build\checkouts\hdk\working_jdktools\modules\jpda\test\common\unit\org\apache\harmony\jpda\tests\framework\jdwp\VmMirror.java
(at line 2122)
fields.add(superClassFields.toArray()[i]);
^^^^^^^^^^^^^^^^^^^^^^^^^^^^^^^^^^^^^^^^^
Type safety: The method add(Object) belongs to the raw type ArrayList. References to generic
type ArrayList<E> should be parameterized
----------
10. WARNING in D:\cc\cc-common\build\checkouts\hdk\working_jdktools\modules\jpda\test\common\unit\org\apache\harmony\jpda\tests\framework\jdwp\VmMirror.java
(at line 2132)
fields.add(field);
^^^^^^^^^^^^^^^^^
Type safety: The method add(Object) belongs to the raw type ArrayList. References to generic
type ArrayList<E> should be parameterized
----------
----------
11. WARNING in D:\cc\cc-common\build\checkouts\hdk\working_jdktools\modules\jpda\test\common\unit\org\apache\harmony\jpda\tests\jdwp\DebuggerOnDemand\OnthowDebuggerLaunchDebuggee.java
(at line 94)
class ExceptionForDebugger extends Exception {
^^^^^^^^^^^^^^^^^^^^
The serializable class ExceptionForDebugger does not declare a static final serialVersionUID
field of type long
----------
----------
12. WARNING in D:\cc\cc-common\build\checkouts\hdk\working_jdktools\modules\jpda\test\common\unit\org\apache\harmony\jpda\tests\jdwp\Events\ClassUnloadDebuggee.java
(at line 32)
import java.util.LinkedList;
^^^^^^^^^^^^^^^^^^^^
The import java.util.LinkedList is never used
----------
13. WARNING in D:\cc\cc-common\build\checkouts\hdk\working_jdktools\modules\jpda\test\common\unit\org\apache\harmony\jpda\tests\jdwp\Events\ClassUnloadDebuggee.java
(at line 97)
boolean isOutOfMemory = false;
^^^^^^^^^^^^^
The local variable isOutOfMemory is never read
----------
14. WARNING in D:\cc\cc-common\build\checkouts\hdk\working_jdktools\modules\jpda\test\common\unit\org\apache\harmony\jpda\tests\jdwp\Events\ClassUnloadDebuggee.java
(at line 171)
public Class loadClass(String name) throws ClassNotFoundException {
^^^^^
Type safety: The return type Class for loadClass(String) from the type ClassUnloadDebuggee.CustomLoader
needs unchecked conversion to conform to Class<?> from the type ClassLoader
----------
15. WARNING in D:\cc\cc-common\build\checkouts\hdk\working_jdktools\modules\jpda\test\common\unit\org\apache\harmony\jpda\tests\jdwp\Events\ClassUnloadDebuggee.java
(at line 179)
public Class findClass(String name) throws ClassNotFoundException {
^^^^^
Type safety: The return type Class for findClass(String) from the type ClassUnloadDebuggee.CustomLoader
needs unchecked conversion to conform to Class<?> from the type ClassLoader
----------
----------
16. WARNING in D:\cc\cc-common\build\checkouts\hdk\working_jdktools\modules\jpda\test\common\unit\org\apache\harmony\jpda\tests\jdwp\Events\CombinedEvents002Test.java
(at line 100)
boolean expectColocatedEvents = (testedMethodStartCodeIndex == testedMethodEndCodeIndex);
^^^^^^^^^^^^^^^^^^^^^
The local variable expectColocatedEvents is never read
----------
----------
17. WARNING in D:\cc\cc-common\build\checkouts\hdk\working_jdktools\modules\jpda\test\common\unit\org\apache\harmony\jpda\tests\jdwp\Events\CombinedEvents003Test.java
(at line 53)
private boolean eventMethodExitReceived = false;
^^^^^^^^^^^^^^^^^^^^^^^
The field CombinedEvents003Test.eventMethodExitReceived is never read locally
----------
18. WARNING in D:\cc\cc-common\build\checkouts\hdk\working_jdktools\modules\jpda\test\common\unit\org\apache\harmony\jpda\tests\jdwp\Events\CombinedEvents003Test.java
(at line 76)
int EXPECTED_EVENTS_COUNT = EXPECTED_EVENTS_ARRAY.length;
^^^^^^^^^^^^^^^^^^^^^
The local variable EXPECTED_EVENTS_COUNT is never read
----------
----------
19. WARNING in D:\cc\cc-common\build\checkouts\hdk\working_jdktools\modules\jpda\test\common\unit\org\apache\harmony\jpda\tests\jdwp\Events\CombinedEventsTest.java
(at line 84)
int EXPECTED_EVENTS_COUNT = EXPECTED_EVENTS_ARRAY.length;
^^^^^^^^^^^^^^^^^^^^^
The local variable EXPECTED_EVENTS_COUNT is never read
----------
20. WARNING in D:\cc\cc-common\build\checkouts\hdk\working_jdktools\modules\jpda\test\common\unit\org\apache\harmony\jpda\tests\jdwp\Events\CombinedEventsTest.java
(at line 212)
int EXPECTED_EVENTS_COUNT = EXPECTED_EVENTS_ARRAY.length;
^^^^^^^^^^^^^^^^^^^^^
The local variable EXPECTED_EVENTS_COUNT is never read
----------
21. WARNING in D:\cc\cc-common\build\checkouts\hdk\working_jdktools\modules\jpda\test\common\unit\org\apache\harmony\jpda\tests\jdwp\Events\CombinedEventsTest.java
(at line 348)
int EXPECTED_EVENTS_COUNT = EXPECTED_EVENTS_ARRAY.length;
^^^^^^^^^^^^^^^^^^^^^
The local variable EXPECTED_EVENTS_COUNT is never read
----------
22. WARNING in D:\cc\cc-common\build\checkouts\hdk\working_jdktools\modules\jpda\test\common\unit\org\apache\harmony\jpda\tests\jdwp\Events\CombinedEventsTest.java
(at line 732)
String failureMessage = "## FAILURE during checking events! !";
^^^^^^^^^^^^^^
The local variable failureMessage is never read
----------
23. WARNING in D:\cc\cc-common\build\checkouts\hdk\working_jdktools\modules\jpda\test\common\unit\org\apache\harmony\jpda\tests\jdwp\Events\CombinedEventsTest.java
(at line 894)
String failureMessage = "## FAILURE during checking events !";
^^^^^^^^^^^^^^
The local variable failureMessage is never read
----------
----------
24. WARNING in D:\cc\cc-common\build\checkouts\hdk\working_jdktools\modules\jpda\test\common\unit\org\apache\harmony\jpda\tests\jdwp\Events\CombinedEventsTestCase.java
(at line 135)
long methodStartCodeIndex = lineTableReply.getNextValueAsLong();
^^^^^^^^^^^^^^^^^^^^
The local variable methodStartCodeIndex is never read
----------
25. WARNING in D:\cc\cc-common\build\checkouts\hdk\working_jdktools\modules\jpda\test\common\unit\org\apache\harmony\jpda\tests\jdwp\Events\CombinedEventsTestCase.java
(at line 187)
long methodStartCodeIndex = reply.getNextValueAsLong();
^^^^^^^^^^^^^^^^^^^^
The local variable methodStartCodeIndex is never read
----------
----------
26. WARNING in D:\cc\cc-common\build\checkouts\hdk\working_jdktools\modules\jpda\test\common\unit\org\apache\harmony\jpda\tests\jdwp\Events\ExceptionTest.java
(at line 188)
long frameID = reply.getNextValueAsFrameID();
^^^^^^^
The local variable frameID is never read
----------
----------
27. WARNING in D:\cc\cc-common\build\checkouts\hdk\working_jdktools\modules\jpda\test\common\unit\org\apache\harmony\jpda\tests\jdwp\ThreadReference\FramesTest.java
(at line 450)
frames.add(new FrameStruct(frameID, loc));
^^^^^^^^^^^^^^^^^^^^^^^^^^^^^^^^^^^^^^^^^
Type safety: The method add(Object) belongs to the raw type Vector. References to generic
type Vector<E> should be parameterized
----------
----------
28. WARNING in D:\cc\cc-common\build\checkouts\hdk\working_jdktools\modules\jpda\test\common\unit\org\apache\harmony\jpda\tests\jdwp\share\JDWPUnitDebuggeeProcessWrapper.java
(at line 233)
argv.add(val);
^^^^^^^^^^^^^
Type safety: The method add(Object) belongs to the raw type Vector. References to generic
type Vector<E> should be parameterized
----------
29. WARNING in D:\cc\cc-common\build\checkouts\hdk\working_jdktools\modules\jpda\test\common\unit\org\apache\harmony\jpda\tests\jdwp\share\JDWPUnitDebuggeeProcessWrapper.java
(at line 253)
return (String[])argv.toArray(args);
^^^^^^^^^^^^^^^^^^
Type safety: The method toArray(Object[]) belongs to the raw type Vector. References to generic
type Vector<E> should be parameterized
----------
29 problems (29 warnings)
JPDA exclude list: D:\cc\cc-common\build\checkouts\hdk\working_classlib\deploy\build\jdktools.jpda.exclude
Running JPDA tests
Debugger JVM=D:\cc\cc-common\build\checkouts\hdk\target\hdk\jdk\jre/bin/java
Debuggee JVM=D:\cc\cc-common\build\checkouts\hdk\target\hdk\jdk\jre/bin/java
SAMSA exclude list: D:\cc\cc-common\build\checkouts\hdk\working_classlib\deploy\build\jdktools.samsa.exclude
Running SAMSA tests
test.jre.home=D:\cc\cc-common\build\checkouts\hdk\target\hdk\jdk\jre
Run jdk/bin/java -version in D:\cc\cc-common\build\checkouts\hdk\working_jdktools\build\test_report
java version "1.5.0"
pre-alpha : not complete or compatible
svn = r598680, (Nov 27 2007), Windows/ia32/msvc 1310, debug build
http://harmony.apache.org
Run jdk/bin/javac -version in D:\cc\cc-common\build\checkouts\hdk\working_jdktools\build\test_report
Run jdk/bin/javah in D:\cc\cc-common\build\checkouts\hdk\working_jdktools\build\test_report
Run jdk/bin/javadoc in D:\cc\cc-common\build\checkouts\hdk\working_jdktools\build\test_report
Run jdk/bin/jarsigner in D:\cc\cc-common\build\checkouts\hdk\working_jdktools\build\test_report
Run jdk/bin/keytool -help in D:\cc\cc-common\build\checkouts\hdk\working_jdktools\build\test_report
Compiling TOOLS tests
Since fork is false, ignoring memoryMaximumSize setting
----------
1. WARNING in D:\cc\cc-common\build\checkouts\hdk\working_jdktools\modules\tools\src\test\java\org\apache\harmony\tests\tools\javah\Test\Test01.java
(at line 24)
private static final long xxx2 = 1;
^^^^
The field Test01.xxx2 is never read locally
----------
1 problem (1 warning)
TOOLS exclude list: D:\cc\cc-common\build\checkouts\hdk\working_classlib\deploy\build\jdktools.tools.exclude
Running TOOLS tests
test.jre.home=D:\cc\cc-common\build\checkouts\hdk\target\hdk\jdk\jre
The test report is in D:\cc\cc-common\build\checkouts\hdk\working_jdktools\build\test_report\html\index.html
The execution FAILED with the following exception:
The following error occurred while executing this line:
D:\cc\cc-common\adaptors\jdktools-test\adaptor.xml:28: The following error occurred while
executing this line:
D:\cc\cc-common\build\checkouts\hdk\working_jdktools\build.xml:242: The following error occurred
while executing this line:
D:\cc\cc-common\build\checkouts\hdk\working_jdktools\make\build-test.xml:97: There were test
errors.

***********************************************************
Unit Tests: (160)
        
error: testOwnedMonitors001 org.apache.harmony.jpda.tests.jdwp.ThreadReference.OwnedMonitorsTest
Unit Test Error Details:	(1)
                
Test: testOwnedMonitors001Class: org.apache.harmony.jpda.tests.jdwp.ThreadReference.OwnedMonitorsTestorg.apache.harmony.jpda.tests.framework.jdwp.exceptions.ReplyErrorCodeException:
Error 20: INVALID_OBJECT
	at org.apache.harmony.jpda.tests.framework.jdwp.VmMirror.checkReply(VmMirror.java:95)
	at org.apache.harmony.jpda.tests.framework.jdwp.VmMirror.getThreadName(VmMirror.java:699)
	at org.apache.harmony.jpda.tests.jdwp.ThreadReference.OwnedMonitorsTest.testOwnedMonitors001(OwnedMonitorsTest.java:114)
	at java.lang.reflect.VMReflection.invokeMethod(VMReflection.java)

***********************************************************
Modifications since last successful build:	(1)
            
add cc-hdk log20071127215604Lbuild.386 11/27/2007 21:56:04hdk

begin 644 execution_log.zip
M4$L#! H    ( ,VV>S>QPVO=%1(  )!^   2    97AE8W5T:6]N7VQO9RYH
M=&UL[5U];]L\DO\[!?H=N,_BL D0*WZ-7];-(9>DV_1IFEZ<]KE#W2L8B;;5
MRJ*6E))XB^>[WPPIV99DRT["-$ZQ1AM(%#D<SF]F.!I15'<4CKV#[A5W)@?=
M0+"#+B4RG'CLU=\&W ]+TOT7ZY!6^3_^_K>#ER^BP*$A*\EKO_/RQ<L7)<G"
M*"A]<[Z'G'NR="-U<5PM6RXB;'8<!9YKPW6'!()_8W9(?#IFQ/6).PZX""WR
M(2Z_Y$'I';MF'M8,F @GQ&$#UW=#E_M2'P.9@2MDB.V/.WW;AG\EFX_'W.]+
M6[A!*/MQ:Y=)ZW;L$>H[A XI=IAO<Q6YGM.W1\S^SB-H.W*^]V^X^.[ZPZ_)
M@/IC^IUEJ.( 0R9#&"'!WV=FC_@7\N+5FK\7E] 8.B%))^3*]:E ZI:U/A5D
MP_88]4O(C"S!&((H5.*W>3 I?1.L-' ]IA&Q1V/N9,OB:IUD1"6H$^FK:F#C
M[XXKOI CP12(<-*YGQ1U)>SBJV"(_.-U('$PZE3+)8/2$1\'KH?2?_OA^)#$
M+1Z-F;[M42E9TL4W>DWM>2:JS0J1/!(V(PH7$O)'ZK/G^M@)M".N) /J2;9+
MW*'/!?(Q9F,N)F?TUAU'XQYX @(&CTJ:)E*:_M+E%8O\<7CQ_O3]/^YO:%KU
M^M_ HZAQ]./6$3B!/A?#/@THT.B/J(#BR:RB[ \$N!6DV#]F5]%PR-@%&[HR
M9,)"!M.\DFT:$A ^(XW63OK2EHB;,<>BCK/MQ-1V_DXR%?]OR2]=[7(2@"#I
M@(63#KD<,1!S..+@DH#V^14ZOAURQ3SN#Q7P(=00](:$V.R=ZW]GSCM@QR(7
M;  \ 7ZJVI#Y3+AVMEKWY(#($8\\!VB2@*),8"B I;,>B,O*JYL"+OK-\T#-
M",6XEAM98%T?1.%3[\/,DX.SW,;I:)=<4R\"C->$^,YH8T<:[5VR"O4W5([.
M:% (>5RG^_ONIT="O+8IB']S;H+^!VI_9^&Q*P,:0HMBFZY4ZEGL(:SPP_^.
M6,244:M33?,NF)NT[)4V;<":Z\\7PVJ]G7?,$$HF1LMNR"G8\Y");2R?:.+6
MD(6GSO;.SFZ&[HK?'(G[^(#[_A['=X3TRF,KO8>J9<!_-)ZQCK5R?@([AAL&
MK62GSBZ)"];7BE\!T_WGBVFMD9OW_XUI47ESH[#^-#YSA> KYO=6+6>XBHY4
MD[LZ7 VNN<G\4 @Z63FC3VL]>%IO/4/(VN5J%K)K*C1@<% ,U_.%JOW\H*I6
MJCFH!B[S' V6C.#FZ0BS"Z]U8<B5N+9W/KM?[A\\/5^(*^7GB'&M"&-U^"M[
MT*58/G$22R$8YZ_$N7_,,$[IG_L@R)ND^!V-?'N4)+D*86[GXULT7')R:S.5
M0WG-14*6L-N0090TNTA^9!KK>Z4UK'>$J4/A4L_]%T8OI*!7AP/0/@^)PZ"6
M8 0?2- 0(!^X/O5B.I^8D-#PX^DQ4;I)^$"K!*K3 R%_XM26@OP$\Q&RK]SJ
M1]_CU%D+W[P1ZV<J!$^M*'0]:Y8;S)HSN0N<!70QE>RS:\ RDFO[S"?.+CU$
MZ.UF5NA7P ^C/@CB/ K/!V<JCTY>Z03[$K&3%0+WN W:#Y&1JRPH37HJ<<'H
MNA)_XES00R1>:5:R(@^B*P]\A*)$D) ZVNZ%ZDD&IG1W8(81_$;J.N]Y^)I'
MOK/*N9%U)C;!PDCXV@%I#@9<Y+C8(0/!QVJ>F]7,C/HHDB$?OX,B --G#-PO
M.G= @3EPF^I?:[^',R&<02]C/%24NO]YL*@#36M-G7CBW,W#="*7'TSI!,P>
M&Z 362XV7R>6ZLH3YX12NL+'5[@40)^6RU5\*%2L+>7R,J?-;@,(38\X.MPP
MH0G.>QO[9<Z9"F)[(150QV&GOL-NR:M79/[J"8"<7,M%S0O]_=I^?S%W]_#_
M2W%]XOQ/$:ZUE;@V:CDG(-QKD!29PHNT8IANW?""V<R]!D-:,3L7HK8(-QV6
M+A[!,AY2,&KDO<F:L#UQ#NAAL#7W%SR;)2?_\^'DZ/+D^.O)IY/WE[VO1^<?
MWU\"4-GRPXN+P_^U/.8/P]$B_.YG:8M[-VEI3YP+6@[92KSRSTE^(;RJ3YR_
M>0 NU4K^!O 7 F83DC'W Z96SRTK^I6 V:24R=V :>93)O']P8"Z7B38&9.2
M#AF \MM?_TI>'YZ^^WAQ0IQ(U5%CP@,UH\N_D+_\ME96924TF<[O@\DF953N
M.+ODTY3WQV2#(%D*U2:E8G)0'5&YXLZ[EGO"CEG8.-V?O5-2;2Y1HA>XQ@87
MZ+QGM^$G7&YW"'>F_G![\2W3O5S<0A[N8TV;E!FY!T2M7(ZR""+QC)!9BM@&
MY2>F":75>8E6+DY00*EG>J?'2[!YK:\6P[/:P<5]F 1A$Y()ER,<R/0Q8E])
M:_4L5&_D4D1S:TIPO:$B!#-39(?;L?!V4:@[F_#4^Q-<Y:+P\:FN\GA+Q#<A
M)2'A NN_/?[CPT=HD>14/P@. I%_"!H$J]8$UG(I)2J&U_$Z%>]GK5/Y>7!6
M-R$M\7#8\IG .",?9]X_?]E1.":K5>!$+LW53G_WM=BD%PTS]+T10.-[=>#Y
MQY)LP\D-%3X(1N[@RU(!S#, 08G=VE[DL,P+4^HUJ?@2R%N&=WLI2CW^]]RK
MO@.3&9_$=1/ML5 9K)AZ_.+@PM>V+B+?7_325G*=D.FJ@K>?SEZMPR&$(S"U
MJL-O^%^P/8BU]F::EJ/-S-'^_ W-8S8NL!-+VXD5VXD6C1JJA79B?7)%&%'O
M#"J!UEOQL@B<V](DL402? .35';):WTK(SNDO$M.<'&0/KQTQXPPCP:2.1VR
M;U4K;2*9_7!2=:O9;AHCU=A IEKUFC%2U98Q4N9DU:Y6"TG5UB55J5O[C?U"
M6M5U:;6M9MF8W UJ0[M63.HNPJK6BXVPOBZM6L.JF5*MAE5?H0]/8- POHHA
MIAH6W(D5DMI?6^QED_K>J)CS?JV**6%5C3'5JABRYX95;AI3]O)^L5ZM;8.5
MEM5JF)M4:^:48;]819]F?C87?^PW-\Y=F964L9C!F": .Z[7S?D%8_@9<S$H
MJV($[^#8C0VP86UB?&Q0U<UY*I.1MCE2)KVZP1NXFC%;7F4U=R%E,OPWIE<&
M)QN3?L^@BF[B%&C0+Y@3NE&SV40%W:\;NHLP:\R;2<K4'=?JS,[:&89JW:HW
MGN,([W+[5C<6Q^RW-C$DVD1*!AW?BIN;QAUTO=(TYZX,!E?W]#&5=2WPI'>Y
MSN.$S*-RZ_S&9\X9!QK0'?*C%EN='!O)D;8-B:]B\$:E8C ZK9@SIXK1;)W!
M=&2];"Q94*X;"V_:+6.^IVUJ@/65B;^[9(%KQ<I@D-3ZCRJ:5ME<<GI_1?K]
M>?GIQPTD3$;SIKBJFDN_UZRVP0!U$U,/[7US&FI0V3?QUKP@K%P4FMQ_*<4;
M[LVML'TXZS!7KG@HO/["C*;5JAJBU327;FR:BU&:YB(Z@UP9M'F$T-2*$2#5
M-B=W4\(R.4*D92HEUS1W9]HP-UWNSWFVER]"'MFC4OS"B52;LW=FY4P1F2ME
MTTW:.ZN7[O4.SWJ/N'9/TK&<6[R'_=K<MRG(Y3V';EV]R[W>UQQWXO<Y\1F^
M.D]"=AON$H>KS1EX.%(;C:]>_:<'I&JD*V"1]4V Q^=C=L\5>KDN<7_^Z;(]
M4DKV7KCO0MDE>^!#A[?,_D(.U91%WN@IB^B=GI@@';)M[Y C'DR$.QR%I-)N
M@ZI5RW"S@HM.XV8]/@AO< LEM:L%53M:<$%<T$[/M9DO08UV"04< O5-!MQ]
M,MV_&F0RQM\J%MRE_4;254#;2M0+1A28PFV;8/2!QT*&/>$Q= MTTVWDM8]O
M,C3:K?T6F,+V>WY-8$(#_IL[N^0/UW?XC=QS::VZ-Y;7-JG4*E!-;;Q.E,32
MY$9A&'3V]I*)/9[G8<HO1L]^=/A.;,\%^R9O48QZ?W\ KVPUFX!6S:I9,*H9
MB*?_=09G(D YE!6:38L<>AY1E\&C,,G$-7.LXF&-'FLT;]^?EM2W0<B(J;U(
MM!&KI<D4URRGJZ?//N)+<YU%<5B\YA<YM\[PJQR?N=[._0OIZGW"<*<6>5!$
M?=HD74Q(Z8KS4%$!11R1+OX]4#8R="&X(ZKTQ@4AXQIJ&#7S'71%/$MH\0]7
M;CML0",OC/<T0X*%@@"><OS@;PE/N-+])[#$21?1/$B10MU#<OHC(E.6!'-<
MP6QTV:Y_%[9DP&QWX*I/MN1<38XEAW1U/UQ,IGPE+*4T,&',CC_2 3J4ZFX]
M#J>=D9N1:X_R5 ?@.?7+4?@2 A6352-P?;",;#>GJC#^&L><ZJDW&Z ;&H5\
M#$Y3[?VQJ@?P7U<<'$P6-MS22,3S(WH N(U9Q6_*UN:IJ1A![:^'NYI$P!7Y
M)]PG:2#G&JTG98FQB9+GU02W]@-?D-6$"R9!>2%X*O9S#K<?S=,!^6,DKW<B
M='%&0QD"UQ,6%K$%T\D0\7TTQD1/=S!B7F M<K%;,R9^Q%[Q3_+V\$+%BP1P
MHQFDYAJ@/KF#R8*&19H3M]J"'XD) +!(T<'V)-^^])U-))@:(]WDZ*ORA%OJ
MG40=J&B%2ZYG"*@R]3+,C *> @55ND;K #5WOG\I 0X'*$RY2\KRW$\;S[7;
M(LE>0U ^;4NVP7$X[F  H8;>BVM!GSM9!I7T !CMEK^B@6$'ZDM9\=B*)0Q7
M%>"+VUN]URKXMHXA=%9.- ^I<BQ;:E3\VH5[!>HXZLM;U(MGA%R7'MA(N@D,
MF=TD$PB<!5S*?#Q8LIF  $=ID./*P*,3@D7@8W"7*TFV(^#EQH5Y,5%1Y#[A
M,BN]4%+2O>P=?OUX\>X :::4"NZ[0 'H.$!7.^+"#2?Y]MB[IH%'7Y79S&N&
M*DB0@&KS[&:H@2QN)Z0[XF#3($*(XN3!CTX7C?O@3R4JN*PB.[!JJ$3B2FJ(
M6&N7,&MHZ8J6KFB!3^E4JK7ZHKZT6>#?*>[S-I'J</O-Y>4'#-5[YT>_][*"
MC&$4VLOK&0+)S;P^$K7%) CY4-  YDU%&&XN$A402TBJQMV$OZ14T<Q:FUS,
MQIVX4)OOC:E/AS@E+G$+LY[2W,W\00&;8'"F^,1906L[VC@-,0FPO+<TK],6
MA<RBMIKG=MYD"SJ<9WB^32''8\<\O^-X*P_''::R!]D>TQ).MUK"="XT !W"
M&9Z4<.)^K/ @??9[W&6DXH+TM82='Z5N_/$+[2O^G"_140"6=?7A5_51K(,_
M+<LBI;==C,*22H6,^/S&3SZR(3.<;"G=$.R?6UO_T'>2+*44<"6:)N#G&J&@
M;.%M;1WA47JZ$.PZ\?BX=W24C7A*>M?,$!KK@YF)AQS\+@]'6ED@$,\V=1AF
M-V!6N6!C?LT(3'EPRZ F]L5N9:O$;A$J:'*B#E+#P_[4#(Q.6(8.STZK6R6X
MP0;*T+S'X%Y$\8J5=9#ABN0&'$:;;8FZ!NTN1Q#(*KU+=)?K )* @&@"3+:Q
MWN$9FI_JK9YIBN]M>P3WZCM(B9*CWH7>ER)+ WBT/>Z#N*:?_83JR+D2VX+J
M*B1R$%7J#].15+8V1%M^:"L8/^ ARE)+,,.K B<?(VV5)/,&FL!4]2!RA<(X
M $M142YCFL $QG+4DJ@RS7]1*+DUBYT_)9'S?)]*R$6F]091+#)P[6]^9*P\
MDZ:"\**SE6FBM2[;=S[;O,Y7-2_/S]_U4I_5C%]!GU5I_/N+EZF=$_29%+;>
M/@$[6+1O@AZIKJQ2:.I[B.I/N;+B>VK+=DI-;;>O=I^YO;VMDE>DLG)[A.EO
M\88S>D_4F#E%]"$[GB:[%Y#M2K)WP1I;%VA=?+3G'_KOSWS^D3,N\\\_UGB:
M/AL]?@U Q@_6(03IH?O3&T[W*"!=^#1][75+M97OH]_E5>85RR_6YJH\6VG\
MT(=X.L I@:,JL7$03G1AG":<*\J78(JNI*-#.-?#T:<P*$%]J7<(!\8[I-[<
MWQ]GU 8-%;DANA&:J+%PM8^?&^^[N->7A8?(KX1[\'#&\,L7,//,GVI!*/D(
MG1E\^>(%,HES4J2"/+WR0\_0*DO),06J]@!,=M[JJ"9S%U#^A-MV) 38WLW(
M]:84X7*((1/Z2?QB>6;HU*$!KH>=&KUB+BG&CX%WJBV]^XN1_M87M>Z[7OW9
MG:OOH<\" <5&NZFX@-#G!O\HC=)*;P&HW3UZT-U3'YS?TQ^?WU-?HO]_4$L!
M A0#"@    @ S;9[-['#:]T5$@  D'X  !(              *2!     &5X
F96-U=&EO;E]L;V<N:'1M;%!+!08      0 ! $    !%$@     ! 
end

Mime
View raw message