harmony-alerts mailing list archives

Site index · List index
Message view « Date » · « Thread »
Top « Date » · « Thread »
From nom...@intel.com
Subject [build-test alert] FAILED Linux x86: jdktools-test debug
Date Tue, 27 Nov 2007 12:38:55 GMT

BUILD FAILED:
	Ant Error Message:
/export/users/cc/cc-common/scripts/cc-exec-adaptor.xml:104: The following error occurred while
executing this line: /export/users/cc/cc-common/adaptors/jdktools-test/adaptor.xml:28: The
following error occurred while executing this line: /export/users/cc/cc-common/build/checkouts/hdk/working_jdktools/build.xml:242:
The following error occurred while executing this line: /export/users/cc/cc-common/build/checkouts/hdk/working_jdktools/make/build-test.xml:98:
There were test failures.

Date of build:	2007-11-27 18:19:58 +0600
Time to build:	18 minutes 48 seconds
Last changed:	11/27/2007 15:18:15
Last log entry:	hdk

***********************************************************
Errors/Warnings:	(226)
            
Result: 1
========================================
Testing jdktools binaries...
========================================
Compiling JPDA tests
Since fork is false, ignoring memoryMaximumSize setting
----------
1. WARNING in /export/users/cc/cc-common/build/checkouts/hdk/working_jdktools/modules/jpda/test/common/unit/org/apache/harmony/jpda/tests/framework/DebuggeeRegister.java
(at line 58)
registered.add(debuggee);
^^^^^^^^^^^^^^^^^^^^^^^^
Type safety: The method add(Object) belongs to the raw type LinkedList. References to generic
type LinkedList<E> should be parameterized
----------
----------
2. WARNING in /export/users/cc/cc-common/build/checkouts/hdk/working_jdktools/modules/jpda/test/common/unit/org/apache/harmony/jpda/tests/framework/TestOptions.java
(at line 505)
internalProperties.put(name, value);
^^^^^^^^^^^^^^^^^^^^^^^^^^^^^^^^^^^
Type safety: The method put(Object, Object) belongs to the raw type HashMap. References to
generic type HashMap<K,V> should be parameterized
----------
----------
3. WARNING in /export/users/cc/cc-common/build/checkouts/hdk/working_jdktools/modules/jpda/test/common/unit/org/apache/harmony/jpda/tests/framework/jdwp/PacketDispatcher.java
(at line 114)
eventQueue.add(eventPacket);
^^^^^^^^^^^^^^^^^^^^^^^^^^^
Type safety: The method add(Object) belongs to the raw type List. References to generic type
List<E> should be parameterized
----------
4. WARNING in /export/users/cc/cc-common/build/checkouts/hdk/working_jdktools/modules/jpda/test/common/unit/org/apache/harmony/jpda/tests/framework/jdwp/PacketDispatcher.java
(at line 249)
replies.put(new Integer(replyPacket.getId()),
replyPacket);
^^^^^^^^^^^^^^^^^^^^^^^^^^^^^^^^^^^^^^^^^^^^^^^^^^^^^^^^^^^^^^^^^^^^^^^^^^^^^^^^^^^^^^^^^^
Type safety: The method put(Object, Object) belongs to the raw type Hashtable. References
to generic type Hashtable<K,V> should be parameterized
----------
5. WARNING in /export/users/cc/cc-common/build/checkouts/hdk/working_jdktools/modules/jpda/test/common/unit/org/apache/harmony/jpda/tests/framework/jdwp/PacketDispatcher.java
(at line 284)
commands.put(Id, command);
^^^^^^^^^^^^^^^^^^^^^^^^^
Type safety: The method put(Object, Object) belongs to the raw type Hashtable. References
to generic type Hashtable<K,V> should be parameterized
----------
6. WARNING in /export/users/cc/cc-common/build/checkouts/hdk/working_jdktools/modules/jpda/test/common/unit/org/apache/harmony/jpda/tests/framework/jdwp/PacketDispatcher.java
(at line 355)
commands.put(Id, command);
^^^^^^^^^^^^^^^^^^^^^^^^^
Type safety: The method put(Object, Object) belongs to the raw type Hashtable. References
to generic type Hashtable<K,V> should be parameterized
----------
----------
7. WARNING in /export/users/cc/cc-common/build/checkouts/hdk/working_jdktools/modules/jpda/test/common/unit/org/apache/harmony/jpda/tests/framework/jdwp/VmMirror.java
(at line 1834)
frames.add(frame);
^^^^^^^^^^^^^^^^^
Type safety: The method add(Object) belongs to the raw type ArrayList. References to generic
type ArrayList<E> should be parameterized
----------
8. WARNING in /export/users/cc/cc-common/build/checkouts/hdk/working_jdktools/modules/jpda/test/common/unit/org/apache/harmony/jpda/tests/framework/jdwp/VmMirror.java
(at line 1902)
vars.add(var);
^^^^^^^^^^^^^
Type safety: The method add(Object) belongs to the raw type ArrayList. References to generic
type ArrayList<E> should be parameterized
----------
9. WARNING in /export/users/cc/cc-common/build/checkouts/hdk/working_jdktools/modules/jpda/test/common/unit/org/apache/harmony/jpda/tests/framework/jdwp/VmMirror.java
(at line 2122)
fields.add(superClassFields.toArray()[i]);
^^^^^^^^^^^^^^^^^^^^^^^^^^^^^^^^^^^^^^^^^
Type safety: The method add(Object) belongs to the raw type ArrayList. References to generic
type ArrayList<E> should be parameterized
----------
10. WARNING in /export/users/cc/cc-common/build/checkouts/hdk/working_jdktools/modules/jpda/test/common/unit/org/apache/harmony/jpda/tests/framework/jdwp/VmMirror.java
(at line 2132)
fields.add(field);
^^^^^^^^^^^^^^^^^
Type safety: The method add(Object) belongs to the raw type ArrayList. References to generic
type ArrayList<E> should be parameterized
----------
----------
11. WARNING in /export/users/cc/cc-common/build/checkouts/hdk/working_jdktools/modules/jpda/test/common/unit/org/apache/harmony/jpda/tests/jdwp/DebuggerOnDemand/OnthowDebuggerLaunchDebuggee.java
(at line 94)
class ExceptionForDebugger extends Exception {
^^^^^^^^^^^^^^^^^^^^
The serializable class ExceptionForDebugger does not declare a static final serialVersionUID
field of type long
----------
----------
12. WARNING in /export/users/cc/cc-common/build/checkouts/hdk/working_jdktools/modules/jpda/test/common/unit/org/apache/harmony/jpda/tests/jdwp/Events/ClassUnloadDebuggee.java
(at line 32)
import java.util.LinkedList;
^^^^^^^^^^^^^^^^^^^^
The import java.util.LinkedList is never used
----------
13. WARNING in /export/users/cc/cc-common/build/checkouts/hdk/working_jdktools/modules/jpda/test/common/unit/org/apache/harmony/jpda/tests/jdwp/Events/ClassUnloadDebuggee.java
(at line 97)
boolean isOutOfMemory = false;
^^^^^^^^^^^^^
The local variable isOutOfMemory is never read
----------
14. WARNING in /export/users/cc/cc-common/build/checkouts/hdk/working_jdktools/modules/jpda/test/common/unit/org/apache/harmony/jpda/tests/jdwp/Events/ClassUnloadDebuggee.java
(at line 171)
public Class loadClass(String name) throws ClassNotFoundException {
^^^^^
Type safety: The return type Class for loadClass(String) from the type ClassUnloadDebuggee.CustomLoader
needs unchecked conversion to conform to Class<?> from the type ClassLoader
----------
15. WARNING in /export/users/cc/cc-common/build/checkouts/hdk/working_jdktools/modules/jpda/test/common/unit/org/apache/harmony/jpda/tests/jdwp/Events/ClassUnloadDebuggee.java
(at line 179)
public Class findClass(String name) throws ClassNotFoundException {
^^^^^
Type safety: The return type Class for findClass(String) from the type ClassUnloadDebuggee.CustomLoader
needs unchecked conversion to conform to Class<?> from the type ClassLoader
----------
----------
16. WARNING in /export/users/cc/cc-common/build/checkouts/hdk/working_jdktools/modules/jpda/test/common/unit/org/apache/harmony/jpda/tests/jdwp/Events/CombinedEvents002Test.java
(at line 100)
boolean expectColocatedEvents = (testedMethodStartCodeIndex == testedMethodEndCodeIndex);
^^^^^^^^^^^^^^^^^^^^^
The local variable expectColocatedEvents is never read
----------
----------
17. WARNING in /export/users/cc/cc-common/build/checkouts/hdk/working_jdktools/modules/jpda/test/common/unit/org/apache/harmony/jpda/tests/jdwp/Events/CombinedEvents003Test.java
(at line 53)
private boolean eventMethodExitReceived = false;
^^^^^^^^^^^^^^^^^^^^^^^
The field CombinedEvents003Test.eventMethodExitReceived is never read locally
----------
18. WARNING in /export/users/cc/cc-common/build/checkouts/hdk/working_jdktools/modules/jpda/test/common/unit/org/apache/harmony/jpda/tests/jdwp/Events/CombinedEvents003Test.java
(at line 76)
int EXPECTED_EVENTS_COUNT = EXPECTED_EVENTS_ARRAY.length;
^^^^^^^^^^^^^^^^^^^^^
The local variable EXPECTED_EVENTS_COUNT is never read
----------
----------
19. WARNING in /export/users/cc/cc-common/build/checkouts/hdk/working_jdktools/modules/jpda/test/common/unit/org/apache/harmony/jpda/tests/jdwp/Events/CombinedEventsTest.java
(at line 84)
int EXPECTED_EVENTS_COUNT = EXPECTED_EVENTS_ARRAY.length;
^^^^^^^^^^^^^^^^^^^^^
The local variable EXPECTED_EVENTS_COUNT is never read
----------
20. WARNING in /export/users/cc/cc-common/build/checkouts/hdk/working_jdktools/modules/jpda/test/common/unit/org/apache/harmony/jpda/tests/jdwp/Events/CombinedEventsTest.java
(at line 212)
int EXPECTED_EVENTS_COUNT = EXPECTED_EVENTS_ARRAY.length;
^^^^^^^^^^^^^^^^^^^^^
The local variable EXPECTED_EVENTS_COUNT is never read
----------
21. WARNING in /export/users/cc/cc-common/build/checkouts/hdk/working_jdktools/modules/jpda/test/common/unit/org/apache/harmony/jpda/tests/jdwp/Events/CombinedEventsTest.java
(at line 348)
int EXPECTED_EVENTS_COUNT = EXPECTED_EVENTS_ARRAY.length;
^^^^^^^^^^^^^^^^^^^^^
The local variable EXPECTED_EVENTS_COUNT is never read
----------
22. WARNING in /export/users/cc/cc-common/build/checkouts/hdk/working_jdktools/modules/jpda/test/common/unit/org/apache/harmony/jpda/tests/jdwp/Events/CombinedEventsTest.java
(at line 732)
String failureMessage = "## FAILURE during checking events! !";
^^^^^^^^^^^^^^
The local variable failureMessage is never read
----------
23. WARNING in /export/users/cc/cc-common/build/checkouts/hdk/working_jdktools/modules/jpda/test/common/unit/org/apache/harmony/jpda/tests/jdwp/Events/CombinedEventsTest.java
(at line 894)
String failureMessage = "## FAILURE during checking events !";
^^^^^^^^^^^^^^
The local variable failureMessage is never read
----------
----------
24. WARNING in /export/users/cc/cc-common/build/checkouts/hdk/working_jdktools/modules/jpda/test/common/unit/org/apache/harmony/jpda/tests/jdwp/Events/CombinedEventsTestCase.java
(at line 135)
long methodStartCodeIndex = lineTableReply.getNextValueAsLong();
^^^^^^^^^^^^^^^^^^^^
The local variable methodStartCodeIndex is never read
----------
25. WARNING in /export/users/cc/cc-common/build/checkouts/hdk/working_jdktools/modules/jpda/test/common/unit/org/apache/harmony/jpda/tests/jdwp/Events/CombinedEventsTestCase.java
(at line 187)
long methodStartCodeIndex = reply.getNextValueAsLong();
^^^^^^^^^^^^^^^^^^^^
The local variable methodStartCodeIndex is never read
----------
----------
26. WARNING in /export/users/cc/cc-common/build/checkouts/hdk/working_jdktools/modules/jpda/test/common/unit/org/apache/harmony/jpda/tests/jdwp/Events/ExceptionTest.java
(at line 188)
long frameID = reply.getNextValueAsFrameID();
^^^^^^^
The local variable frameID is never read
----------
----------
27. WARNING in /export/users/cc/cc-common/build/checkouts/hdk/working_jdktools/modules/jpda/test/common/unit/org/apache/harmony/jpda/tests/jdwp/ThreadReference/FramesTest.java
(at line 450)
frames.add(new FrameStruct(frameID, loc));
^^^^^^^^^^^^^^^^^^^^^^^^^^^^^^^^^^^^^^^^^
Type safety: The method add(Object) belongs to the raw type Vector. References to generic
type Vector<E> should be parameterized
----------
----------
28. WARNING in /export/users/cc/cc-common/build/checkouts/hdk/working_jdktools/modules/jpda/test/common/unit/org/apache/harmony/jpda/tests/jdwp/share/JDWPUnitDebuggeeProcessWrapper.java
(at line 233)
argv.add(val);
^^^^^^^^^^^^^
Type safety: The method add(Object) belongs to the raw type Vector. References to generic
type Vector<E> should be parameterized
----------
29. WARNING in /export/users/cc/cc-common/build/checkouts/hdk/working_jdktools/modules/jpda/test/common/unit/org/apache/harmony/jpda/tests/jdwp/share/JDWPUnitDebuggeeProcessWrapper.java
(at line 253)
return (String[])argv.toArray(args);
^^^^^^^^^^^^^^^^^^
Type safety: The method toArray(Object[]) belongs to the raw type Vector. References to generic
type Vector<E> should be parameterized
----------
29 problems (29 warnings)
JPDA exclude list: /export/users/cc/cc-common/build/checkouts/hdk/working_classlib/deploy/build/jdktools.jpda.exclude
Running JPDA tests
Debugger JVM=/export/users/cc/cc-common/build/checkouts/hdk/target/hdk/jdk/jre/bin/java
Debuggee JVM=/export/users/cc/cc-common/build/checkouts/hdk/target/hdk/jdk/jre/bin/java
SAMSA exclude list: /export/users/cc/cc-common/build/checkouts/hdk/working_classlib/deploy/build/jdktools.samsa.exclude
Running SAMSA tests
test.jre.home=/export/users/cc/cc-common/build/checkouts/hdk/target/hdk/jdk/jre
Run jdk/bin/java -version in /export/users/cc/cc-common/build/checkouts/hdk/working_jdktools/build/test_report
java version "1.5.0"
pre-alpha : not complete or compatible
svn = r598567, (Nov 27 2007), Linux/ia32/gcc 4.1.0, debug build
http://harmony.apache.org
Run jdk/bin/javac -version in /export/users/cc/cc-common/build/checkouts/hdk/working_jdktools/build/test_report
Run jdk/bin/javah in /export/users/cc/cc-common/build/checkouts/hdk/working_jdktools/build/test_report
Run jdk/bin/javadoc in /export/users/cc/cc-common/build/checkouts/hdk/working_jdktools/build/test_report
Run jdk/bin/jarsigner in /export/users/cc/cc-common/build/checkouts/hdk/working_jdktools/build/test_report
Run jdk/bin/keytool -help in /export/users/cc/cc-common/build/checkouts/hdk/working_jdktools/build/test_report
Compiling TOOLS tests
Since fork is false, ignoring memoryMaximumSize setting
----------
1. WARNING in /export/users/cc/cc-common/build/checkouts/hdk/working_jdktools/modules/tools/src/test/java/org/apache/harmony/tests/tools/javah/Test/Test01.java
(at line 24)
private static final long xxx2 = 1;
^^^^
The field Test01.xxx2 is never read locally
----------
1 problem (1 warning)
TOOLS exclude list: /export/users/cc/cc-common/build/checkouts/hdk/working_classlib/deploy/build/jdktools.tools.exclude
Running TOOLS tests
test.jre.home=/export/users/cc/cc-common/build/checkouts/hdk/target/hdk/jdk/jre
The test report is in /export/users/cc/cc-common/build/checkouts/hdk/working_jdktools/build/test_report/html/index.html
The execution FAILED with the following exception:
The following error occurred while executing this line:
/export/users/cc/cc-common/adaptors/jdktools-test/adaptor.xml:28: The following error occurred
while executing this line:
/export/users/cc/cc-common/build/checkouts/hdk/working_jdktools/build.xml:242: The following
error occurred while executing this line:
/export/users/cc/cc-common/build/checkouts/hdk/working_jdktools/make/build-test.xml:98: There
were test failures.

***********************************************************
Unit Tests: (160)
        
failure: testThreadGroup002 org.apache.harmony.jpda.tests.jdwp.ThreadReference.ThreadGroup002Test
Unit Test Error Details:	(1)
                
Test: testThreadGroup002Class: org.apache.harmony.jpda.tests.jdwp.ThreadReference.ThreadGroup002Testjunit.framework.AssertionFailedError:

testThreadGroup002 FAILED:
## Unexpected thread status found out for some tested threads!

	at org.apache.harmony.jpda.tests.jdwp.share.JDWPTestCase.printErrorAndFail(JDWPTestCase.java:753)
	at org.apache.harmony.jpda.tests.jdwp.ThreadReference.ThreadGroup002Test.testThreadGroup002(ThreadGroup002Test.java:286)
	at java.lang.reflect.VMReflection.invokeMethod(VMReflection.java)

***********************************************************
Modifications since last successful build:	(1)
            
add cc-hdk log20071127151815Lbuild.457 11/27/2007 15:18:15hdk

begin 644 execution_log.zip
M4$L#! H    ( -B4>S<#A6)\?A(  .1^   2    97AE8W5T:6]N7VQO9RYH
M=&UL[5U[<]LXDO_;^A38V;I:N\JBW@]K%%_Y;&?B3!S[+,=S5ZE<"B8AB0Y%
M< '2MC8UW_VZ 5(2*8F2;-BCI%:5N/@ &HW^]0L@"':'X<@[[-YR9WS8#00[
M[%(BP[''WORCS_VP*-U_L0YIE__CUW\<%J+ H2$KRGN_4R@4)0NCH'CG? LY
M]V3Q0>+%N$CZJHB@PDD4>*X--QT2"'['[)#X=,2(ZQ-W%' 16N0ROG[-@^('
M=L\\+!DP$8Z)P_JN[X8N]Z4^!C)]5\@0ZY?8(Q(H19()6;)M^%>T^6C$_9*T
MA1N$LA03<IFT'D<>H;Y#Z(!BV[G5;R/7<TKVD-G?> 1DALZWT@,7WUQ_\#7I
M8VE$O[%, X5"R&38*1#\?6;VD'\AA3=K_@K74!=:($D+Y-;UJ4#2EK4^E8+M
M,>H7D1%9!.Z#"!@JV#P8%^\$*_9=CR$X]G#$G?25N$A']Z((]R-U1W5F],UQ
MQ1=R+)C"$DXZSY:@+H2-?14,*;U&4[)04"=:0FFLCODH<#W$X/WER1'1Q5^#
MIY+M42E9W-@=O:?V+#?55H5('@F;$846"?F+M]YS?6P.JA%7DC[U)-LG[L#G
M CD:L1$7XW/ZZ(ZB40^\!0&_@-J;HE&<_%*7*Q;YX^CJX]G'WXS8H=;3TAWX
M(-6?4EP[ L]1XF)0H@$%&J4A%7!Y/"TH2WT!O@@IED[8;308,';%!JX,F;"0
MUQ379)>&!.!@I-'>2]W9$7$EYEC4<7:=F-;>KR1=[O^6_%*EKL<!2)/V63CN
MD.LA UF'0PZ."RA?W**GW".WS./^0.E!""4$?2 A5OO@^M^8\P&8L<@5ZP-'
M *(J-F ^$ZZ=+=8]/21RR"// 9HDH"@/Z @ ZJR#Y)++U2T$&+WK1:!"22ZV
MY48&7-<'@?C4NYRZ>O"INQC%]LD]]2+ >3V8-T4<F]&([Y-5R+^C<GA.@US8
MXS+=W_=O7@+UVA:B?N<\!*5+:G]CX8DK QI"C5S;KE3J&?PA(_'#_XY8Q)1Q
MJU--<0/<#5KX2MM^ME77?P8@J_6#.2\-J6ABO>R!G(%A#YC8Q>MC3=H:L/#,
MV=W;VT]37?&;H? $7_#$WXNXD)#>>FRE$U&EGNU&&C^%FK6S_@*;A8&&UK,S
M9Y_$%];6C!\>V.;/ &RMD4T$_@WLDLNM;<7[9G3N"L'S WZ[EK5@146J:*\.
M5P)L++H?"4''*T/\I-0SXWS[A\;MH%S-X'9/A48-#G(Q^T'Q.OB1\:I6JEF\
M^B[S'(V8C&!L=8S3$&_UQ9 KJ>WN?7:_/#FG^D%QKI1_;*!K.4"KPY_5H2[#
M<WLFO!2*\5R7N/!/&"8PI0L?!/J07/Y (]\>)A-B>5 ?S.6^:,'D]-%F:J;E
M+1<)4<(>0P;)T_0F^9ZNJX=2J\UXB'.-PJ6>^R],:DA.FPX'L'T>$H=!*<$(
M/N6@(<#>=WWJQ71N  :H^.GLA"CM)+ROU0)5ZCFP;\\TF(+]%&<N9$EYV4^^
MQZFS#L9SQJP?VQ \M:+0]:SI;.*OBQ!=#](<JCC_[+-[P!-$MYX#W9ZIJ&=(
M_J"5D?PM<,.H#_*XB,*+_KF:@R=O].3\8MF3?*E[W 8S@'3)5::4)CP1NV!T
M/;%OS\31,\1>:54R<@^B6P]\AJ)#D(PZVNV%ZE$(3@3O0=01_$'J,A]Y^)9'
MOK/"U9$U0IU@821\[8YT^WTNYGC8(WW!1RKR34MF>GP<R9"//L E0-1G#%PQ
MNGE @#DPDO7OM1?$V AGT,H(#Q6E[G\>+FI TUI+,;9GJN=9BI&=44PI!H24
MOUPQLCQLNV(LTY?MF4%*Z0L?W>(2!'U:+E?QF5*NQI3+2UPX] CRUF..#CA,
M*((KW\56F7.N,MQ>2 64<=B9[[!'\N8-F;U["E G][()]4+OOVX46,S;QM%@
M&;;;,UN4AVUM%;:-6M89"/<>Y$4F$".E&*I'-[QB-G/OP:3RXW4N<@NPTQGK
M8NZ7<9""4J/OC=?";GMFC)Z%7:LY_XR7G/[/Y>GQ]>G)U].;TX_7O:_'%Y\^
M7@-:V>M'5U='_VMYS!^$PP4@/LGD%K=MS.2V9^)H.6RK,)M[SO*38%;=GLF>
MIX-3K<R-$G\2=+9LZN9)Z-3JV05+/PLZ6SK#LA$ZK;D9EGC\T*>N%PEVSJ2D
M P;(_/+WOY.W1V<?/EV=$B=2952/\$#%>ODW\K=?UIF$685/ING-@=G2"9C-
M(L[<].;3@=D27);!M:43-W-P'5.9/T2O91_:XQQN_, @.YQ25:Y1KE>X?@?7
M_GQDC^$-+ND[@D&L/]A=.*YZBL-;R,'F9K6E\RB;X]3.SFWFX21^$'B6H;:=
MLQF32:B5LQCM;/J@P%*/!L].EN#S5M_-A6BEMXM;, ;$EDT]7 ^Q0Y/GDB4E
MLY5AJ=[(3BK-K%?!=8V*#(2JR YW8Q'NHVCW_OKGZ#=PEXO<9[&ZR NM2]^R
M^0L)-UCI_<D?EY^@1C(C>RDX"$;^(6@0K%A\6,M.0E$QN(^7P'BOLP3FM2"M
M;MDDQK.QFYM C*?TXZG[SU_V%)C)0A@XD<NF>2>_)YINTH;&&EK> K3Q)4 (
M B-)=N'D@0H?A"+W"H4 P@V(OL@>;2]R6/H-+O7>5GP'Y"S#)[^FI985>.YM
MR8'HQL=QV41_+%0'*VY(O>JXZ'VRJ\CW%[Q-EMPF9+)2X?W-^9L-&85D!4*N
M.KS#_Z"-D(65)BHWUPI[B58^WZ'!3+L*EF-IR[%BR]&B4KVWT'*L&U>$$?7.
MH1 8@A4OO\"PEZ*(%R3!ETA)99^\U2,?V2'E?7**:Y#TX;4[8H1Y-)#,Z9"F
MU6S5B&3VLRG5K4JU8812S3HXJ!KBJ5:M&Z+4:)B1$_2N4C'$4ZML1N)UJUK)
MI51;EU*E:M5J[3Q2U75)M:UJLV5*Y"TS@FI9]5Q]VD1.U4JNDM?7)05)^H$Q
M.1DREYK5KIE2\F8]5Y_6IM0 P\N5>'/MWM6L9K-I1,D!N[HI095KN3RM3:D-
M@C)#"7@R!![&!&,\-7,EOK;A59I6O6$F4(&]M,UT#RD9"\.& A7PU##CH5#)
MC7FHJC'5-)1"&:64[Z V20W,19>FJ62L7#.5M)8KIK*59MT43Z:D5"V;LKI:
MU5B0JIC+Z8QID[G4OFW.8YKQ3C L*QOCR5 (!DIU4W'SH&+,$Y2-Q8.FL=X9
MBIN8%1P8TW%C6G!@RN[:^<.RC<8MINRN;"BQQ]37F!;436E!NVY,"XSE/.VJ
ML6R\:J9W#:N2C]W:$P954(.:J5FQEB%S:5A50\/\EE4W.+XS92Z5BBFW<F!L
MV&(N[:D8,F%(-!NY/#76[EW%JC?-C5Z-#3;,.$V0DQE/U[9J;3-*4,&$W$SO
MD)2A\48%0YZ9,(Q<54V-@MKE7%&M/59L0)9A!K^6U3+TJ*1AM3;(-2OYH\5%
M.?EI[WJ=9UV9)1[Q^6^"1T'\_I!:.'AZ8B(,YF<>&TSBMO*SZPTH-5MF\@50
M?'.32::F[Y"2N0'REF7\.%HSEETWS4!7L1HM4[VKYFOF1F,'8R'>U*.AEB%*
M-7#(QB;=ZL:>[AJSE:4IXP*G_/05#N^X-[,VUD"^U&J;B9+-EM4PA&\34ETS
ME&#L9&CJ"BBUC?%DRJ!,!1_ KMDP,^(!+3 F\88AB3=Q;8(9.T=29N)/<\5Z
MB4V2;T-+$YH0-LI:#0HAC^QA,7Y'1*J-W3O)5:8(3*ZQR0;OG14KZGI'Y[W7
M65(GZ4A.U]0A!S;W;0J"^<B! 5?OCJ\W0,>=_'U.?(;OPY.0/8;[Q.%JUP4>
M#G$?\E5K\G2_5('4?;QBW0EP[GS$GK]:+MLV[NX_64%'BLGF"@96M"[>31^:
M?F3V%W*D(A9YIR,6T7L\,4$Z9-?>(\<\& MW, Q)Y>  =*]:!IW"!:)QM1[O
MAP^X@9+:OH*JK2NX("ZHJ^?:S)>@6_N$ BZ!^MP#;DF9:E[U-NGL+Y#'6>5?
M2*H$*&&1>L&0 DNX91-T/?!8R+ =/(9&@6JJBKSW\>V#QD&[T6SMD]V/_)[ 
MZ!B8;^WMXR;GT6/)I;5J:6#;.$%D@?6HO=F)DE6*UC ,@TXI6>V;!'B(];D 
MVJ^(X*GMN6#SY#V*4G\; / KP[ / *M9->S=%,>S_SJ',Q&@-,H*T)9%CCR/
MJ-O@91@P><\<*[=_PY?OUON/9T7UZ1$R9&H+$FW@:DDQQ;7&J=*IDT_X$EQG
M44(6K]'%'ECG^+V/SUQO_?Z%=/5^8;@YBSQ<3GM2(765D.(MYZ$B 1HY)%W\
M>ZA,9>!"BD?4U0<7!(W+GJ&_S'?00_$,G<4_7&OML#Z-O##>UPSIY8@ &)IC
M!G]+&,)5Z2_-#R==A/ P10@U#XGI#Y),^!',<06ST8>[_@8\R8#9;M]57X/)
MNIHL/P[IZD:X&$^82OA)Z5S"E1U_Y0/T)M786NQ-VB(/0]<>SA/M@]O4KS3A
MFP)4C//9=WTPA&PC9^IB_-F.&753+Q] (S0*^0@\IMK9(Y\^^*];#FXE"Q=N
M6B3B6(G6#L.7?%Y3AC5+2R4-:E,]W*\D H[(/V%TI/&;J;26>"6F*DJ0MV/<
MS@_L/H/_%9.@KI!"Y7HVA]NOX-N@H1-L2.]"Z&)$0T$"]V,6YO '(66 "+\"
MAZ*GFQHR+[ 6N->=*3??8Y_X)WE_=*5220(PTC1P,^51M]S^>$&]Y5H4U]F!
M'XFK \I(S\':9*YV\1L;2[ W1KK)T5?E!W?4ZX0Z5=&ZE]Q/UU>7U)LK4P)X
M"@34U=65 U3AV=:E!!@<(##A+;DVQ_JD[DRU'9+L)037)U7)+K@.Q^WW00_T
MKEL+FMS+L*<$!XAHG_P5[0SIJT]PQ1W+%2[<5#@OKF[UWJI,W#J!5%KYT#DL
ME6_945WB]RZ,(*CCJ ]Z42\.!MD&/3"0= WH+GM(0@><!5S*N62P:#,!>8U2
M',>5@4?'!"^!F\%MK"39!0L"5PG1,-%+9#WA,2.X4%+2O>X=??UT]>$02:9T
M"49@@#P=!>AHAURXX7BN.K:M2>#15V4HLQJA+B080+%99M/$0 Z/8](=<C!A
MD!YD;O+P>Z>+MGSXIQ(3W%;9'%@Q%")Q(=4_++5/F#6P=$%+%[3 A70JU5I]
M05/:%O#O!/!90TBUM_ON^OH24_3>Q?'OO;TY:@B@T#Y>QP>D-O7Y2-,6XR#D
M T$#B)>*+HPH$O#%8HJJ;C?A+KFJ2&8L3"YF8B,>U-9Z(^K3 0;#Q8Y@VE":
MMZD'6,XD&)DI+M']:R5'LZ8A3@0L;2S-Z:1"'JNHI.9YG;73Y>W-LCM;)8_?
MD6.>VU&\^X;C#F9G#[(-IJ6;KK28Y;E$ )0'@S@I8G!^^60@=?)[W':DLH#4
MK82M[\5N_ D,[2C^G+VB8SY>Z^K#K^I;68=_6I9%BN^[F(0EA7*X\/F#GWQH
M0Z;9V%':(=@_=W9^TZ-%EE(+N!,E\^TS=5!"MO!V=H[Q*!TC!+M/_#QN%!W)
M;&6U'68(=?7!U+Q##NZ6AT.M+9![9VHZ#"<S())<L1&_9P2"' P15!A?Z%!V
MBAIJJ'&J#E)=P]94P$77*T.'1]GV8/P,=*%VC\'(0S&*975"X8ID? T]S51$
M58-JUT-(6I7:)9K+=8Y(0#8T02135V_B#+7/]&[.-,7TKCV$H?@>$J+DN'>E
M]XW(D  &;8_[(*G)ET.A-+*M)#9?6J4^#J))_4$Z8\H4AJ3*#VT%WR4>HA2U
M[#*,*E3F<J&=HF1>7]>?Z!ODIG QSK-21)2KF,Q: EM98DGFF&8^)UW<F>;&
M-TEF/-NB$N]R4WJ'X.58LW8RWS,FG9Z"@C2BLY.IH34MW6YF@GF-#VY>7UQ\
MZ,U^<3-^$7Q:HO'O3V"NVLQ GTEAZQT-L*U%6QGH'NO":HY,?1Q1_2E7\K^I
MMF3/T]2N^FIWF,?'QRIY0RJK=BR8_!9N"*-W-XT94R2?OG=ILJ$ V:TDVPFL
MVDU *^5K//O0?U_KV4?6V%[RV<<:C\^G(L"=_V7\)!T2D!XZ0[V;=(\"Z'F/
MS]=>E%2U*BUC[^/GOUFZ-D]EJUQ]YD,\G=@4P5L5V2@(QW@IGA"<7,B>XV1<
M42>"G8+F7Y]!+P3UI=[L&SB%OK8;M5%:6]! D0>BZZ!IOD2*6L)OE9=<W)++
MPL-"0<*0.YSP78  -#W14E"B$7HBL%! 1C$P12JQTTL[='Q6,Y(<)SO55GW)
MCE@=567F!LJ=<-N.A "3>QBZWH0BW XQ5T('V2GD])XZ%,880DZ,7G&97,;/
MAW>J;;TMB^&6UY>[YJ)>_>O84%]5G^8+BJ$#+1;(BQ[PC]*YQ$"L0K=$#[LE
M]1'[DOZ@O=*8P_\'4$L! A0#"@    @ V)1[-P.%8GQ^$@  Y'X  !(     
M         *2!     &5X96-U=&EO;E]L;V<N:'1M;%!+!08      0 ! $  
(  "N$@     ! 
end

Mime
View raw message