harmony-alerts mailing list archives

Site index · List index
Message view « Date » · « Thread »
Top « Date » · « Thread »
From nom...@intel.com
Subject [build-test alert] FAILED Linux x86_64: reliability
Date Mon, 26 Nov 2007 02:19:26 GMT
svn.revision=597678
BUILD FAILED:
	Ant Error Message:
/export/users/cc/cc-reliability/scripts/cc-exec-adaptor.xml:104: The following error occurred
while executing this line: /export/users/cc/cc-reliability/adaptors/reliability/adaptor.xml:98:
Some reliability tests failed on /export/users/cc/cc-reliability/build/checkouts/snapshot/hdk/jdk/jre/bin/java

Date of build:	2007-11-25 15:35:15 +0600
Time to build:	1,003 minutes 59 seconds
Last changed:	11/25/2007 15:07:13
Last log entry:	snapshot

***********************************************************
Errors/Warnings:	(59)
            
[java] Java Result: 104
[java] Java Result: 104
[java] Java Result: 104
[java] Java Result: 104
[java] Java Result: 104
[java] Java Result: 104
[java] Java Result: 104
[java] Java Result: 104
[java] Java Result: 104
[java] Java Result: 104
[java] Java Result: 104
[java] Java Result: 104
[java] Java Result: 104
[java] Java Result: 104
[java] Java Result: 104
[java] Java Result: 104
[java] Java Result: 104
[java] Java Result: 104
[java] Java Result: 104
[java] Java Result: 104
[java] Java Result: 104
[java] Java Result: 104
[java] Java Result: 104
[java] Java Result: 104
[java] Java Result: 104
[java] Java Result: 139
[java] Java Result: 104
[java] Java Result: 104
[java] Java Result: 104
[java] Java Result: 104
[java] Java Result: 104
[java] Java Result: 104
[java] Java Result: 104
[java] Java Result: 104
[java] Java Result: 104
[java] Java Result: 104
[java] Java Result: 104
[java] Java Result: 104
[java] Java Result: 104
[java] Java Result: 104
[java] Java Result: 104
[java] Java Result: 104
[java] Java Result: 104
[java] Java Result: 104
[java] Java Result: 104
[java] Java Result: 104
[java] Java Result: 104
[java] Java Result: 104
[java] Java Result: 104
[java] Java Result: 104
[java] Java Result: 104
[java] Java Result: 104
[java] Java Result: 104
[java] Java Result: 104
[java] Java Result: 104
[java] Java Result: 104
[java] Java Result: 104
[java] Java Result: 104
The execution FAILED with the following exception:
The following error occurred while executing this line:
/export/users/cc/cc-reliability/adaptors/reliability/adaptor.xml:98: Some reliability tests
failed on /export/users/cc/cc-reliability/build/checkouts/snapshot/hdk/jdk/jre/bin/java

***********************************************************
Unit Tests: (58)
        
error: test api.kernel.thread.WeakReferenceandThreadTest.WeakReferenceandThreadTest
Unit Test Error Details:	(1)
                
Test: testClass: api.kernel.thread.WeakReferenceandThreadTest.WeakReferenceandThreadTestOK
OK
OK
OK
OK
OK
OK
OK
OK
OK
OK
OK
OK
OK
OK
OK
OK
OK
OK
OK
OK
OK
OK
OK
OK
OK
OK
OK
OK
OK
OK
OK
OK
OK
OK
OK
OK
OK
OK
OK
OK
OK
OK
OK
OK
OK
OK
OK
OK
OK
OK
OK
OK
OK
OK
OK
OK
OK
OK
OK
OK
SIGSEGV in VM code.
Stack trace:
  0: SetBooleanFieldOffset(JNIEnv_External*, _jobject*, int, unsigned char) (apr_strtok.c:-1)
  1: ?? (??:-1)
  2: jthread_wrapper_start_proc(void*) (apr_strtok.c:-1)
  3: start_thread (??:-1)
addr2line: '[stack]': No such file
  4: ?? (tart_thread:-1)
  5: start_thread (??:-1)
  6: start_thread (??:-1)
addr2line: '[stack]': No such file
  7: ?? (tart_thread:-1)
  8: clone (??:-1)
LTend of stack traceGT

***********************************************************
Modifications since last successful build:	(1)
            
add cc-snapshot log20071125150713Lbuild.24 11/25/2007 15:07:13snapshot

begin 644 execution_log.zip
M4$L#! H    ( &A">C>AIMM1$ 4  /XA   2    97AE8W5T:6]N7VQO9RYH
M=&ULQ5I?4]LX$'_G4^CEIB^'':!<VUR.&7 2FDXH'0QEI@S#*/(F%I$ECR0'
MPJ>_E1VX! *-0^S+)+%D:?7;?Y)V9;=BFXB#UD!%TX-6JN&@18FQ4P'_?!@J
M:;<-?X F^=SXX^\/!UM9&E$+VV8BFUM;.L-_XCY7MW1"K\E1QD4TY +[8YMW
MGXB%YKR8C".NKTF@ 0>*"%::Q(?[5&GK9P:T\1G#[[8&P>F "VZG_L"-ZVLP
MF;#&GV_9;30^;>_L;._NW^SL[^TOP"U4'#\TY=X#3YLOF")7P&)U3<XR*;D<
M$0O&-LFLNW<8"=#!6;"W>X[WEQ 7Y6_X3\YR'IMDI_&Q),KQ+Y[VY&EF0XNJ
M2:J$ZLFA:,-0'(/%0<!6B56?5+\$'SBIT*UT#3BHMS9GEBM)];1J/#<^:A!%
M&TW[,(&7\VK#8#^IQCDFH ]R9./UT);.OS%H"<*C>F3*S,,Y,N\P37^>!/T?
M5%?G4/-XG7M@'3FI RJ72ZL4M.5@UD=\2_6 XC17[ATK-5['4CD=+IW161+&
M-KJ37]V-:B12@UM@=@TF"T+O-+\$0DFHV,@+@%TNJ<#-M4Y,7/*9H,9\I29F
M*GH']EL&2=EXM+J+&:N1\37,5Q#B=F9 &F[YI&I5/@'B%B-KQ8IQ]XRP7@]H
MF%_>*^9;-K>Y0&O8O"!$#BD;GVO*<I,_JU:HH )^I%66>AV9)>#VY%HPO<('
MPLRD(",W8 ++[E7/2$ %RS#,PM G+]<C?CB5+-9*\H<">5;_W\%WJT>_!#H^
M@R%HD RHC JKYX[_>M.*;.U]*3-GU9T+"E=?VA,JZ0@2D.OLSO\1H[Z-A029
M5IEF<*HYWH0R8I98FIA*4DQA]1H</Y)ZW[@-9N5*F%S! A;N2RG=]?>.T'O&
M/>M6-:5O#H7H*T8%F"I\/ =L ^,)%5VE$VIOJD8;@3V<4"[RS*; N@F46#.;
M6JIVR97'8JHQ/2RC_3DR+U#24B[?$2ROCM61#$U0$Y)R$<P)1IVUB':)Z_4H
M*"K?:;+I4'<&)7$VELJ/YND\=U8VJWA!<>WV3L.*U;,$6Z73+M:K-LQ+9(<Z
MD_R$IA78:) -<7LL;:(9F7<TM7"4EZD0N&18:'.-B525BGJ)[3836C?HC\P6
MA3I@W40MT$+!JPOCET->:IH>5W<.^CIH'8AME>%V5[N@7:&HK1T5<];:,?NX
MS]0.&L9*;TK4U];.%:+,YYW>%@#Y[YUNFL^2@19&!M_!!L*E$!MB8Y)XQAU 
M_$9?V"T_>\.)$94X\'I&Y@6N$E"S28,CQK XC<SSVQ*LS9-YCR>:%29J" GW
M#%*'M_*FOD#D=9Z*F^5KQ$KP,V*/N7LE,5>!<!QL5,(5UH/,<E%F.KK^+N%A
MF=;H*AM>&PS@N-Q.RW#T2..%LT(^W\[ /5?<](F# <U?F73/^[_1>G31Z[=)
M>!$$G3#L7O07&L^5I8)8G@#R]&>CL4<2+C,4E^Q_)"BKDE&>;U]%(,#"-6F[
MJU/)SLXGXB)U0X9:)>]X1H_Z>U0:PSSCFKALHT#X:X9@U7O'WSJ/@;A'6YG3
M)>D>]OJ=-KGC-B866X:8Y:L[!_JT$#1SDKD&K94FBN6N&)&[&#E['-%Y2,P-
M$5Q"<^MWK-*(IE;I12YG-]U+$<TOGYLD5 F0N0ZY"Z*N*<)&!$5832$L!C96
M&:K$2)J:6%D_CL;^K?MI\ =<^LX1MEH^/6CY^>L=?O&JAY^_]_$O4$L! A0#
M"@    @ :$)Z-Z&FVU$0!0  _B$  !(              *2!     &5X96-U
C=&EO;E]L;V<N:'1M;%!+!08      0 ! $    ! !0     ! 
end

Mime
View raw message