harmony-alerts mailing list archives

Site index · List index
Message view « Date » · « Thread »
Top « Date » · « Thread »
From nom...@intel.com
Subject [build-test alert] FAILED Linux x86_64: ehwa
Date Sun, 25 Nov 2007 17:57:09 GMT
svn.revision=597678
BUILD FAILED:
	Ant Error Message:
/export/users/cc/cc-suites/scripts/cc-exec-adaptor.xml:104: The following error occurred while
executing this line: /export/users/cc/cc-suites/adaptors/ehwa/adaptor.xml:85: The following
error occurred while executing this line: /export/users/cc/cc-suites/scripts/framework.xml:1070:
Java returned: 1

Date of build:	2007-11-25 23:47:10 +0600
Time to build:	9 minutes 54 seconds
Last changed:	11/25/2007 15:46:21
Last log entry:	snapshot

***********************************************************
Errors/Warnings:	(91)
            
[exec] Result: 25
[echo]
[echo]
[echo] ========================== EHWA.log =======================
[echo]
[echo] Eclipse Home = /export/users/cc/cc-suites/build/libs/eclipse-3.2.1-lnx-x86_64/eclipse
[echo] Tested JRE = /export/users/cc/cc-suites/build/checkouts/snapshot/hdk/jdk/jre
[echo] Tested JRE options for Eclipse launching =
[echo] Delay factor = 2
[echo]
[echo] --- Automated EHWA scenario for Eclipse 3.2.1 ---
[echo]
[echo] Start:
[echo]
[echo] Run Eclipse
[echo] Select workspace
[echo]  wait window 'Workspace Launcher' to appear ...
[echo]  window 'Workspace Launcher' appeared
[echo] Press 'OK' button
[echo]  wait window '' to close ...
[echo]  window '' successfully closed
[echo] Close Welcome page
[echo]  wait window 'Java - Eclipse SDK' to appear ...
[echo]  window 'Java - Eclipse SDK' appeared
[echo] Create new project
[echo]  wait window 'New' to appear ...
[echo]  window 'New' appeared
[echo] Select new Java project
[echo]  wait window 'New Java Project' to appear ...
[echo]  window 'New Java Project' appeared
[echo] Type 'EHWA' as project name
[echo] Press 'Finish' button
[echo]  wait window 'New Java Project ' to close ...
[echo]  window 'New Java Project ' successfully closed
[echo] Create new Java class
[echo]  wait window 'Java - Eclipse SDK' to appear ...
[echo]  window 'Java - Eclipse SDK' appeared
[echo]  wait window 'New' to appear ...
[echo]  window 'New' appeared
[echo] Select new Java class for 'EHWA' project
[echo]  wait window 'Java Class' to appear ...
[echo]  window 'Java Class' appeared
[echo] Type 'EHWA' as class name, press 'Finish' button
[echo] Select the 'public static void main(String[] args)' checkbox
[echo] Press 'Finish' button
[echo]  wait window 'New Java Class ' to close ...
[echo]  window 'New Java Class ' successfully closed
[echo] Put System.out.println("Hello, world"); into EHWA class
[echo]  wait window 'Java - EHWA.java - Eclipse SDK' to appear ...
[echo]  window 'Java - EHWA.java - Eclipse SDK' appeared
[echo] Save EHWA class
[echo] Run EHWA class
[echo] Exit Eclipse
[echo]  wait window 'Java - EHWA.java - Eclipse SDK' to appear ...
[echo]  window 'Java - EHWA.java - Eclipse SDK' appeared
[echo]  wait window 'Java - EHWA.java - Eclipse SDK ' to close ...
[echo] ERROR: Failed to close 'Java - EHWA.java - Eclipse SDK ' window during 240 sec!
[echo]
[echo] Print error screen picture:
[echo] 	Picture was saved to /export/users/cc/cc-suites/build/results/ehwa/20071125_1147/error.xwd.
Use 'xwud -in error.xwd' to view the saved file.
[echo]
[echo] Kill Eclipse:
[echo] 	Found 1 Eclipse processes
[echo] 	Process 0:
[echo] 	Eclipse process was killed
[echo]
[echo]
[echo] EHWA FAILED!
[echo]
[echo] ======================= eclipse.log =======================
[echo] Install location:
[echo]     file:/export/users/cc/cc-suites/build/libs/eclipse-3.2.1-lnx-x86_64/eclipse/
[echo] Configuration file:
[echo]     file:/export/users/cc/cc-suites/build/libs/eclipse-3.2.1-lnx-x86_64/eclipse/configuration/config.ini
loaded
[echo] Configuration location:
[echo]     file:/export/users/cc/cc-suites/build/libs/eclipse-3.2.1-lnx-x86_64/eclipse/configuration/
[echo] Framework located:
[echo]     file:/export/users/cc/cc-suites/build/libs/eclipse-3.2.1-lnx-x86_64/eclipse/plugins/org.eclipse.osgi_3.2.1.R32x_v20060919.jar
[echo] Framework classpath:
[echo]     file:/export/users/cc/cc-suites/build/libs/eclipse-3.2.1-lnx-x86_64/eclipse/plugins/org.eclipse.osgi_3.2.1.R32x_v20060919.jar
[echo] Debug options:
[echo]     file:/export/users/cc/cc-suites/tests/ehwa/.options not found
[echo] Time to load bundles: 113
[echo] Starting application: 4571
[echo] Application Started: 58981
[echo]
[echo] ===========================================================
BUILD FAILED
/export/users/cc/cc-suites/tests/ehwa/ehwa_run.xml:209: EHWA FAILED!
Total time: 9 minutes 53 seconds
The execution FAILED with the following exception:
The following error occurred while executing this line:
/export/users/cc/cc-suites/adaptors/ehwa/adaptor.xml:85: The following error occurred while
executing this line:
/export/users/cc/cc-suites/scripts/framework.xml:1070: Java returned: 1

***********************************************************
Unit Tests: (0)
        
No Tests Run: This project doesn't have any tests

***********************************************************
Modifications since last successful build:	(1)
            
add cc-snapshot log20071125154621Lbuild.44 11/25/2007 15:46:21snapshot

begin 644 execution_log.zip
M4$L#! H    ( "._>3?'9".0(@8  "P@   2    97AE8W5T:6]N7VQO9RYH
M=&ULU5I;3]M*$'XNOV).I:.T4F,GX9Y2)%I O>D4!:H^H IMUI-D8>.UO.M<
MSJ\_LVN'$L@Z<=I"3T01J6=FOQG/Y?,D!P,SE(<'715-#P^2% \/&&@SE?BF
MUE.QJ6OQ+[9AK_'WZ]KA1I9$S&!=C^+VQD::T6^PK\MK-F+?X6TF9-03DN1Q
M,&97)!!,AG).9N[- POYW\@'ZCO4ZW7H9#&<O/]V!)ICS%*A0,5@!@@]):4:
MB[@/7,4]T<]29@1=(R6OP0O4!B/XV#F!-Q#B)%&I"3.-J0XYIY^ZSH1!'7:M
M&R$?(+]1F=&ACEFB!\J$@^@FO+;_4ESE$)582)H.\TJ?<"D2C?!>#7$54%)T
M=8BY4GTS: 7-NHPG]<G>SM7.UNR"][1CE&P*/<:-2NFT5EGHUWOY;[4+9\ R
MHX1I+Q,S+H@!Q7FI:.'SJG+!B")+=\6?=N\DLM@FUNS>S"=8$ 1>U7,V0F"D
MD$Q!]3P&C/I%MSF<LQMT&;_)D@78+!QRBWY;KW;VP%:H?F0<EQ%*-.AR$(T%
M$HD4;2).?PN,4*7]VWNN=%_\48"X2C&@YF?$\$&U/BFPO+\_.:1 H['G:&^I
M=7"H1G>K=*S2&YTPCHLJ=$T';!LB[#3*PEOSY7T#LL2-/K"J]I#2?O$N1>;0
MI*@S:?0=5(O4+H<W)%"HT8RA-^WE\2]LYVZT&HW=9K.U?=5L;NWZ^YAAJ9F?
MNU[9,W);XRO0B#^#);2G!5+U:;*G$*%A0BZ\^Q/D-#8[G2^=-IR2$,6!.AF7
MBG*@]I$DH>Z0!]?%WT5^G!]_@AH08XC4&*(LM6%O;34(-_\+F(' @;HJ\O'*
M)6J02) B1A+<7'@7'9B.<ZH-K6W_#$KH/!/T"&\P1*U9'_T#R'O!?^6-]P6W
M<?4)5,?QN*3EJ5B;S<.9IY)E,1_8E"F)UWUVM49D+>4](HHT=/4]3WSOXG%!
M=-+5SW#%W:ZD.,\@FHY K,0?[M:[OY5;CE\XYD=-C9N;.UW>7R5C)LRLT&O?
M;A4^NWN(:<TB9TF"K+PYEYK(]3'RMT5R74/MRZ<:=#-CB/>M"+CVHYVMA*X&
M.N.<#NME4DYSS<A_V#MG^1M*;HLWH4:T*K"/#_IIY4@N,K$TDOFT@QC'U$75
MM<V"%1'_@^/*$)W.4DQ%-EI,SJ?JP'*]LUQO'93W#"R%?#%-:$#:ED+"^A9Q
MS(8E&5!D\:F(A1Y4S>3[(*%J:B\P4"W7?V2.,\,E(V_^\'1_JA3.@V.'3)$D
M%7/:&7EGC:P7IT*U:A[GL&T6OR+$E;*UB(#=)M62K"L%!VV(CW,8*1'!D(GX
MQ;FQ1/'R.["TKU_6\EU"5TU^=\FX:*Q?,#/U2N5READXGQ(/&@9$H )'667\
MXOE[E%*]LJ-71L]?O@;Z;Y5SD[4*:C$W7[NX?.:6%X!=UJSBQNT.<HG<R82\
M74ID_NR@5$&W:GK^ZH>UZI3WS*8R8)I2=],\18PA$=QD*9;PX&=GN0B%1(.F
M9(DJ4]Y[C[@.0# 91P%\M0&8C+,(ZB*&VPLNHB-!96R[4GZH)=O!&DY_$E+.
M EKFYJG*XHA(_2SVU/=MS\"23']VELM H\SP/8,NCC<$JJP'K?$P:BOS].C#
MYY/CDM2H_NP,LY786L_.'V(:)11_J;C;:/F?]NW+?63RBQ9I?C8TMX5V1SX:
MJ/GM7OXNH E)\6%1&?>?P_SXP9S'[3WV-"7^81]-<X@8/1["1&9]$>L'Z^YB
M@=79;$VN1M2&=AK[S7UJL^D*3K@YES S^#^Z<8S=K#];XOR< W?6O\%L*Q0K
M0R29.J:?H(JA6X[8U";Z%T<2=1N:S<WRC8P=<32>B87F.0Y;V[M-K\K1#\E<
MG7(.MO?V]_PJZVP/E[[\&\^W7S]\/BX:\]R%U0)^]_/C=JNQWYYK]/YC+Q3U
M7;"?J[1A'X8BSL@H;&]:ZJ#B2&]L7-!DM8O;S 4O-TA4PPSN?:Z,$XY)WFXN
MYB\X'J$XSU*B4C >V&U889$NFX'0;FO<WBAQE44L,2HMO"W>.6?WMMOP&PXD
MWB,2BFYO5N;NL&9CEV:X8V(I$MN);1XU-PY"=G@0NB\#A/D7 T+W+8'_ %!+
M 0(4 PH    ( "._>3?'9".0(@8  "P@   2              "D@0    !E
G>&5C=71I;VY?;&]G+FAT;6Q02P4&      $  0!     4@8      
end

Mime
View raw message