harmony-alerts mailing list archives

Site index · List index
Message view « Date » · « Thread »
Top « Date » · « Thread »
From nom...@intel.com
Subject [build-test alert] FAILED Linux x86: JettyScenario
Date Fri, 23 Nov 2007 13:09:19 GMT
Jetty server JRE:

Apache Harmony Launcher : (c) Copyright 1991, 2006 The Apache Software Foundation or its licensors,
as applicable.
java version "1.5.0" 
pre-alpha : not complete or compatible
svn = r597436, (Nov 22 2007), Linux/ia32/gcc 4.1.0, release build
http://harmony.apache.org

Scenario framework JRE:

Apache Harmony Launcher : (c) Copyright 1991, 2006 The Apache Software Foundation or its licensors,
as applicable.
java version "1.5.0" 
pre-alpha : not complete or compatible
svn = r597436, (Nov 22 2007), Linux/ia32/gcc 4.1.0, release build
http://harmony.apache.org

================================================================================
Scenario results:

Testsuite: org.apache.harmony.test.jetty.JettyScenario
Tests run: 5, Failures: 1, Errors: 0, Time elapsed: 3.873 sec
------------- Standard Output ---------------
Setup completed.

==============================================================testInitialPage===
Starting initial page test case.
Loading page from server: http://localhost:7070/test/
Getting resource with name: initial_page.html
Found resource: /export/users.2/cc/cc-suites/tests/JettyScenario/resources/JettyScenario/initial_page.html
Saving content of downloaded page to: /export/users.2/cc/cc-suites/build/results/JettyScenario/JettyScenario/initial_page.html
Comparing page content with etalon: initial_page.html
Page is equal to etalon.
Initial page test case passed.

============================================================testStaticContent===
Starting static content page test case.
Loading page from server: http://localhost:7070/test/data.txt
Getting resource with name: static_content.txt
Found resource: /export/users.2/cc/cc-suites/tests/JettyScenario/resources/JettyScenario/static_content.txt
Saving content of downloaded page to: /export/users.2/cc/cc-suites/build/results/JettyScenario/JettyScenario/static_content.txt
Comparing page content with etalon: static_content.txt
Page have different number of lines than etalon.

=======================================================testSessionDumpServlet===
Starting servlet test case.
Loading page from server: http://localhost:7070/test/session/
Getting resource with name: session_dump.html
Found resource: /export/users.2/cc/cc-suites/tests/JettyScenario/resources/JettyScenario/session_dump.html
Saving content of downloaded page to: /export/users.2/cc/cc-suites/build/results/JettyScenario/JettyScenario/session_dump.html
Comparing page content with etalon: session_dump.html
Page is equal to etalon.
Session dump servlet page is OK.
Getting resource with name: session_dump_new.html
Found resource: /export/users.2/cc/cc-suites/tests/JettyScenario/resources/JettyScenario/session_dump_new.html
Saving content of downloaded page to: /export/users.2/cc/cc-suites/build/results/JettyScenario/JettyScenario/session_dump_new.html
Comparing page content with etalon: session_dump_new.html
Page is equal to etalon.
Session create page is OK.
Getting resource with name: session_dump_set.html
Found resource: /export/users.2/cc/cc-suites/tests/JettyScenario/resources/JettyScenario/session_dump_set.html
Saving content of downloaded page to: /export/users.2/cc/cc-suites/build/results/JettyScenario/JettyScenario/session_dump_set.html
Comparing page content with etalon: session_dump_set.html
Page is equal to etalon.
Session set page is OK.
Getting resource with name: session_dump_remove.html
Found resource: /export/users.2/cc/cc-suites/tests/JettyScenario/resources/JettyScenario/session_dump_remove.html
Saving content of downloaded page to: /export/users.2/cc/cc-suites/build/results/JettyScenario/JettyScenario/session_dump_remove.html
Comparing page content with etalon: session_dump_remove.html
Page is equal to etalon.
Session remove page is OK.
Getting resource with name: session_dump_invalidate.html
Found resource: /export/users.2/cc/cc-suites/tests/JettyScenario/resources/JettyScenario/session_dump_invalidate.html
Saving content of downloaded page to: /export/users.2/cc/cc-suites/build/results/JettyScenario/JettyScenario/session_dump_invalidate.html
Comparing page content with etalon: session_dump_invalidate.html
Page is equal to etalon.
Session invalidate page is OK.
Servlet test case passed.

===========================================================testRequestDumpJSP===
Starting JSP test case.
Loading page from server: http://localhost:7070/test/snoop.jsp
Getting resource with name: request_dump_JSP.html
Found resource: /export/users.2/cc/cc-suites/tests/JettyScenario/resources/JettyScenario/request_dump_JSP.html
Saving content of downloaded page to: /export/users.2/cc/cc-suites/build/results/JettyScenario/JettyScenario/request_dump_JSP.html
Comparing page content with etalon: request_dump_JSP.html
Page is equal to etalon.
JSP test case passed.

=====================================================testGZippedStaticContent===
Starting gzipped static content test case.
Loading page from server: http://localhost:7070/test/data.txt.gz
Unpacking content from archive.
Getting resource with name: static_content_ungzipped.txt
Found resource: /export/users.2/cc/cc-suites/tests/JettyScenario/resources/JettyScenario/static_content_ungzipped.txt
Saving content of downloaded page to: /export/users.2/cc/cc-suites/build/results/JettyScenario/JettyScenario/static_content_ungzipped.txt
Comparing page content with etalon: static_content_ungzipped.txt
Page is equal to etalon.
Gzipped static content test case passed.
------------- ---------------- ---------------

Testcase: testInitialPage took 1.128 sec
Testcase: testStaticContent took 0.234 sec
	FAILED
Content is not correct.
junit.framework.AssertionFailedError: Content is not correct.
	at org.apache.harmony.test.jetty.JettyScenario.testStaticContent(Unknown Source)
	at java.lang.reflect.VMReflection.invokeMethod(VMReflection.java)

Testcase: testSessionDumpServlet took 0.458 sec
Testcase: testRequestDumpJSP took 1.359 sec
Testcase: testGZippedStaticContent took 0.58 sec

================================================================================
Jetty server output:

2007-11-23 13:09:01.469::INFO:  Logging to STDERR via org.mortbay.log.StdErrLog
2007-11-23 13:09:01.778::INFO:  Statistics on = false for SelectChannelConnector @ 0.0.0.0:7070
2007-11-23 13:09:01.846::INFO:  jetty-6.1.2rc1
2007-11-23 13:09:01.963::INFO:  Deploy /export/users.2/cc/cc-suites/build/libs/jetty-6.1.2rc1/contexts/test.xml
-> org.mortbay.jetty.webapp.WebAppContext@29c4ebcf{/test,/export/users.2/cc/cc-suites/build/libs/jetty-6.1.2rc1/webapps/test}
2007-11-23 13:09:01.983::INFO:  Deploy /export/users.2/cc/cc-suites/build/libs/jetty-6.1.2rc1/contexts/javadoc.xml
-> org.mortbay.jetty.servlet.Context@29c7bc3d{/javadoc,file:/export/users.2/cc/cc-suites/build/libs/jetty-6.1.2rc1/javadoc/}
2007-11-23 13:09:04.904::WARN:  Unknown realm: Test JAAS Realm
2007-11-23 13:09:06.933::INFO:  Started SelectChannelConnector @ 0.0.0.0:7070

================================================================================

BUILD FAILED:
	Ant Error Message:
/export/users.2/cc/cc-suites/scripts/cc-exec-adaptor.xml:104: The following error occurred
while executing this line: /export/users.2/cc/cc-suites/adaptors/JettyScenario/adaptor.xml:186:
Jetty scenario failed

Date of build:	2007-11-23 19:08:49 +0600
Time to build:	25 seconds
Last changed:	11/23/2007 12:56:54
Last log entry:	snapshot

***********************************************************
Errors/Warnings:	(2)
            
The execution FAILED with the following exception:
The following error occurred while executing this line:
/export/users.2/cc/cc-suites/adaptors/JettyScenario/adaptor.xml:186: Jetty scenario failed

***********************************************************
Unit Tests: (5)
        
failure: testStaticContent org.apache.harmony.test.jetty.JettyScenario
Unit Test Error Details:	(1)
                
Test: testStaticContentClass: org.apache.harmony.test.jetty.JettyScenariojunit.framework.AssertionFailedError:
Content is not correct.
	at org.apache.harmony.test.jetty.JettyScenario.testStaticContent(Unknown Source)
	at java.lang.reflect.VMReflection.invokeMethod(VMReflection.java)

***********************************************************
Modifications since last successful build:	(1)
            
add cc-snapshot log20071123125654Lbuild.52 11/23/2007 12:56:54snapshot

begin 644 execution_log.zip
M4$L#! H    ( "B9=S>TJT?%N0$  #8#   2    97AE8W5T:6]N7VQO9RYH
M=&ULE5/+;MLP$+SK*_92Y&*1>32.S2@&#"0!6O34^&;XP% KBP%%"N32CWY]
M2<M&Z@0H$$*"'KLS.YC=K5KJS*QZ=?5^5O4>9Y6$0'N##Q>-LU0&_0<%3"Z_
MW5_,BMC7DK ,&RL*R&>).U0KF!-XW.B@G87;Z=WX^Y051:E<UVN#I6Y*BUAC
M+8K"QW>H:MT*'OX],*]E3\Y#D^Z?2+1_46BEUT[ [VB!L8Q=UFB0< 6/^:GM
M6@#'7>\\\1C0!W;-E4I7&:(F#/PU:E-SCR$:"OR,EK_E+V;<^DS4"TF?B0<-
MD$@WZ \9R[=H-:VR&IL3G%\SV4O5(FNE[YS=LU22V,![5NL,OTA) ;(;<#N"
M9ZE-3 (%7(W@R7OGT^OE"!:Z0T C^Y#,@QLVN;M)8M0GIJ_(@.?YCU]/C\6 
M]YA]2RQ>VI!<[X!230'CZ747CCUT 4OK2#=:24HM%A^\<GW_R:MBT2;E:3AB
M1AQKPE93"Y0BC3/&;3,*=PK[@75Q'L@V@%,J>H\U;-LT2B?&%*96!S#:HBC^
MVWPY3-3'OA]_LUUGQ-5D+$[J3R8UJ2-8%Q67LXH?UH(/*\(/^_(74$L! A0#
M"@    @ *)EW-[2K1\6Y 0  -@,  !(              *2!     &5X96-U
C=&EO;E]L;V<N:'1M;%!+!08      0 ! $    #I 0     ! 
end

Mime
View raw message