harmony-alerts mailing list archives

Site index · List index
Message view « Date » · « Thread »
Top « Date » · « Thread »
From nom...@intel.com
Subject [build-test alert] FAILED Linux x86: ehwa
Date Fri, 23 Nov 2007 08:40:48 GMT
svn.revision=597436
BUILD FAILED:
	Ant Error Message:
/export/users.2/cc/cc-suites/scripts/cc-exec-adaptor.xml:104: The following error occurred
while executing this line: /export/users.2/cc/cc-suites/adaptors/ehwa/adaptor.xml:85: The
following error occurred while executing this line: /export/users.2/cc/cc-suites/scripts/framework.xml:1070:
Java returned: 1

Date of build:	2007-11-23 14:30:32 +0600
Time to build:	10 minutes 9 seconds
Last changed:	11/23/2007 12:56:54
Last log entry:	snapshot

***********************************************************
Errors/Warnings:	(91)
            
[exec] Result: 25
[echo]
[echo]
[echo] ========================== EHWA.log =======================
[echo]
[echo] Eclipse Home = /export/users.2/cc/cc-suites/build/libs/eclipse-3.2.l-lnx-x86/eclipse
[echo] Tested JRE = /export/users.2/cc/cc-suites/build/checkouts/snapshot/hdk/jdk/jre
[echo] Tested JRE options for Eclipse launching =
[echo] Delay factor = 2
[echo]
[echo] --- Automated EHWA scenario for Eclipse 3.2.1 ---
[echo]
[echo] Start:
[echo]
[echo] Run Eclipse
[echo] Select workspace
[echo]  wait window 'Workspace Launcher' to appear ...
[echo]  window 'Workspace Launcher' appeared
[echo] Press 'OK' button
[echo]  wait window '' to close ...
[echo]  window '' successfully closed
[echo] Close Welcome page
[echo]  wait window 'Java - Eclipse SDK' to appear ...
[echo]  window 'Java - Eclipse SDK' appeared
[echo] Create new project
[echo]  wait window 'New' to appear ...
[echo]  window 'New' appeared
[echo] Select new Java project
[echo]  wait window 'New Java Project' to appear ...
[echo]  window 'New Java Project' appeared
[echo] Type 'EHWA' as project name
[echo] Press 'Finish' button
[echo]  wait window 'New Java Project ' to close ...
[echo]  window 'New Java Project ' successfully closed
[echo] Create new Java class
[echo]  wait window 'Java - Eclipse SDK' to appear ...
[echo]  window 'Java - Eclipse SDK' appeared
[echo]  wait window 'New' to appear ...
[echo]  window 'New' appeared
[echo] Select new Java class for 'EHWA' project
[echo]  wait window 'Java Class' to appear ...
[echo]  window 'Java Class' appeared
[echo] Type 'EHWA' as class name, press 'Finish' button
[echo] Select the 'public static void main(String[] args)' checkbox
[echo] Press 'Finish' button
[echo]  wait window 'New Java Class ' to close ...
[echo]  window 'New Java Class ' successfully closed
[echo] Put System.out.println("Hello, world"); into EHWA class
[echo]  wait window 'Java - EHWA.java - Eclipse SDK' to appear ...
[echo]  window 'Java - EHWA.java - Eclipse SDK' appeared
[echo] Save EHWA class
[echo] Run EHWA class
[echo] Exit Eclipse
[echo]  wait window 'Java - EHWA.java - Eclipse SDK' to appear ...
[echo]  window 'Java - EHWA.java - Eclipse SDK' appeared
[echo]  wait window 'Java - EHWA.java - Eclipse SDK ' to close ...
[echo] ERROR: Failed to close 'Java - EHWA.java - Eclipse SDK ' window during 240 sec!
[echo]
[echo] Print error screen picture:
[echo] 	Picture was saved to /export/users.2/cc/cc-suites/build/results/ehwa/20071123_0230/error.xwd.
Use 'xwud -in error.xwd' to view the saved file.
[echo]
[echo] Kill Eclipse:
[echo] 	Found 1 Eclipse processes
[echo] 	Process 0:
[echo] 	Eclipse process was killed
[echo]
[echo]
[echo] EHWA FAILED!
[echo]
[echo] ======================= eclipse.log =======================
[echo] Install location:
[echo]     file:/export/users.2/cc/cc-suites/build/libs/eclipse-3.2.l-lnx-x86/eclipse/
[echo] Configuration file:
[echo]     file:/export/users.2/cc/cc-suites/build/libs/eclipse-3.2.l-lnx-x86/eclipse/configuration/config.ini
loaded
[echo] Configuration location:
[echo]     file:/export/users.2/cc/cc-suites/build/libs/eclipse-3.2.l-lnx-x86/eclipse/configuration/
[echo] Framework located:
[echo]     file:/export/users.2/cc/cc-suites/build/libs/eclipse-3.2.l-lnx-x86/eclipse/plugins/org.eclipse.osgi_3.2.1.R32x_v20060919.jar
[echo] Framework classpath:
[echo]     file:/export/users.2/cc/cc-suites/build/libs/eclipse-3.2.l-lnx-x86/eclipse/plugins/org.eclipse.osgi_3.2.1.R32x_v20060919.jar
[echo] Debug options:
[echo]     file:/export/users.2/cc/cc-suites/tests/ehwa/.options not found
[echo] Time to load bundles: 108
[echo] Starting application: 5253
[echo] Application Started: 70687
[echo]
[echo] ===========================================================
BUILD FAILED
/export/users.2/cc/cc-suites/tests/ehwa/ehwa_run.xml:209: EHWA FAILED!
Total time: 10 minutes 8 seconds
The execution FAILED with the following exception:
The following error occurred while executing this line:
/export/users.2/cc/cc-suites/adaptors/ehwa/adaptor.xml:85: The following error occurred while
executing this line:
/export/users.2/cc/cc-suites/scripts/framework.xml:1070: Java returned: 1

***********************************************************
Unit Tests: (0)
        
No Tests Run: This project doesn't have any tests

***********************************************************
Modifications since last successful build:	(1)
            
add cc-snapshot log20071123125654Lbuild.52 11/23/2007 12:56:54snapshot

begin 644 execution_log.zip
M4$L#! H    ( !5U=S=:P4)0(08  #4@   2    97AE8W5T:6]N7VQO9RYH
M=&ULU5IM;]I($/Y<?L5<I1.M5&P@EY?2-%*N2=0W72.2JA^B*EK6 VRR>"WO
MFI?[]3>[-A0GV&":)CTK02&>G7UF=EX>#QP.S4@>'?94,#LZC&(\.F2@S4SB
MVWI?A::AQ;_8@8/FGV_J1[4D"IC!AAZ'G5HM3N@5['5UP\;L._R="!GTA21Y
M'$[8-0EXTY',R>3>W-.0_HU\J+Y#H]& ;A+"Z?MOQZ YABP6"E0(9HC05U*J
MB0@'P%78%X,D9D;0/5I4J/ 2M<$ /G9/X2WX.(U4;/Q$8ZR]ML\Y_31T(@QJ
MOV<-\?D0^:U*C/9UR"(]5,8?!K?^C?V-<9-M5&1!:=JN4/J42Q%IA/=JA)O!
MDJ*G?4R7-7:\MB<;,IPVI@=[\_\6;G:"DLV@S[A1,6W6+O/]=E?Q63MO>BPQ
M2IC..C'C?.B1F]>*9C9O*N>-R;%T*,5Q]TXB"VUDS8\F'V&>YQ4NO6!C!$8+
MHAFH?H$"HQ[FE/V<6J_'^&T2K8!FT9!5]&J-VML'FZ'Z<6%<!2C1H(M -!9'
M(&*T83C[%2A\%0\6!Z[T0/Q.>+B*T:/*9\3H7J8^):ZTMC\U(D^CL=OHPB3K
MXDB-E_-SHN);'3&.JW)S:_RV!!%TZF/^8H/RF@%)Y/H>V*5VF]):\2Y&YO#$
MJ!-I]!*N5<NN1K<DD"VC]D)O.IL<0*8]-:3=;.ZW6NV=ZV9[IUE<Q0R+3;[M
M%LJ>D^$:7X%&_#DTOMW/DVI K3V&  T3<F4,3)%3U^QVOW0[<$9"Y LJ95PJ
MBH3Z1Y*$AL/NW61_9U%R<?()ZD"4(5 3")+8NK[]5Y.0\S^ &? <J.LL*J]M
MK+:\2((4(9+@SLJ3=&"ZSJ@.M'>+>U!$^QFO3WB]$6K-!EC<@ IO%-]Y6WC!
MPJ]% M5Q/"IG>3K69@-Q;JID2<B'-F9*'':77FWA6DMZCXDCC5R2YZGO,AX7
MGDZZ^AXNOSM;+'1L/ -0K)WJ+#=+1;DXG"=,F'E&UK\M%GQVOL:X;A.;11&R
M\DI:JB)=CT%Q!:.:I*'^Y5,=>HDQ1- V!%S_47<V0E<'G7!.F_43*6?IRF#5
M9GG"UG)\;4.ZMEQ?2YJ5Q?P-);?Y&U$MVM3DC_=*:N4S6J5B[1FE30]"G% A
M53<VOC9$_ ].*D-T:]9BRN+<8G(V50>6KCM/UVV#\HZ"M9 O9Q'U2%M42%@O
M$(=L5!(!67Z<B5#H8=4<N0L2JB;-"@4;9M&]R'%JN&1DS6\>[D\5PJES;)O)
M@J1B3#LE[ZR2[?R4+:T:QREL&\6O"'&E:,T\8"=*]2CI2<%!&Z+E',9*!#!B
M(GQQ82Q7O/H.+![HE_5TG-!3TU^=,LX;VR?,?'FE=#E/#%S,B F-/*)0GF.M
M,GSQ_#U*J5[9IBZ#YR_? /U;I>QDJX1:3<^W3JXB=>L3P,YK-C%C,8=<(W<Z
M)6O74J3?VRE5T&T:G@_]O%:=NY[;4 :,8ZINFL>((42"FR3&$B;\[#P5(9=H
MT!0LP18\[,YSKH/@32>!!U^M"Z:3)("&"&%QP_ET+"B1;5U*M[4<T-O"[$]"
MRKE+RPP]4TD8$-><>Y\JOZT:6!+KS\Y3&6B6*;ZCT'GRED"55:$MGDAM;IX=
M?_A\>E(2'-4?H&$^'-OJ ?I#2,V$_"\5=\.MXD=^>[D/3AYFI%9,AW*3:+?C
M8V'*C_G2=QYU2/(."\JX?P[RH[LR#[MPU[.8Z(=]YDT18O!H ".9#$2H[XV\
MLPE6=Z<]O1Y3"=IKOFZ]IB(;;V"#ZW(1,\/_H14GV$L&\QG.S^)?&@)[\[%0
MJ QQ9"J7Q?Q4C-P#NXUL8G]A(%%WH-4\*!_)V Y'W9E(:!KBL-O>W2E<<OQ#
M,EU.,0?[S;V#_0>='ZZ]BF>>?W_]\/DDJ\JY&YNZ?/E#Y$Z[^;J3J_/%&U\J
M*KM@/U^Q7H>1"!/2"@>6.Z@PT+7:)356.[Q-G/M2A<0US/#.A\LXY1BE]>8R
M?\,1"<5Y$A.7@LG0SF@RC73;#(5VD^-.K=18%K#(J#BS-WOGS#W8[< OV9+(
MCXC(P_UYMKOM6LU]:N..CL5(E">TT=2J'?KLZ-!WWPKPTV\(^.[K O\!4$L!
M A0#"@    @ %75W-UK!0E A!@  -2   !(              *2!     &5X
F96-U=&EO;E]L;V<N:'1M;%!+!08      0 ! $    !1!@     ! 
end

Mime
View raw message