harmony-alerts mailing list archives

Site index · List index
Message view « Date » · « Thread »
Top « Date » · « Thread »
From nom...@intel.com
Subject [build-test alert] FAILED Linux x86_64: drlvm-test debug
Date Thu, 22 Nov 2007 11:44:12 GMT

BUILD FAILED:
	Ant Error Message:
/export/users/cc/cc-common/scripts/cc-exec-adaptor.xml:104: The following error occurred while executing this line: /export/users/cc/cc-common/adaptors/drlvm-test/adaptor.xml:76: There were drlvm-test failures

Date of build:	2007-11-22 16:35:18 +0600
Time to build:	68 minutes 44 seconds
Last changed:	11/22/2007 14:30:49
Last log entry:	hdk

***********************************************************
Errors/Warnings:	(21)
            
[java] Java Result: 1
[java] Java Result: 1
[java] Java Result: 130
[java] Java Result: 1
[java] Java Result: 1
[java] Java Result: 130
[java] Java Result: 1
[java] Java Result: 1
[java] Java Result: 130
[java] Java Result: 1
[java] Java Result: 1
[java] Java Result: 130
[java] Java Result: 1
[java] Java Result: 1
[java] Java Result: 130
[junit] Tests FAILED
BUILD FAILED
/export/users/cc/cc-common/build/checkouts/hdk/working_vm/build/make/build.xml:501: Some tests failed
Total time: 68 minutes 37 seconds
The execution FAILED with the following exception:
The following error occurred while executing this line:
/export/users/cc/cc-common/adaptors/drlvm-test/adaptor.xml:76: There were drlvm-test failures

***********************************************************
Unit Tests: (4068)
        
error: test_10 java.lang.ClassAnnotationsTest
error: test_11 java.lang.ClassAnnotationsTest
error: testGetAnnotation java.lang.Package5Test
error: testGetAnnotation2 java.lang.Package5Test
error: testGetAnnotation_Negative java.lang.Package5Test
error: testGetDeclaredAnnotations java.lang.Package5Test
error: testGetDeclaredAnnotations2 java.lang.Package5Test
error: testGetDeclaredAnnotationsImmutable java.lang.Package5Test
error: testGetAnnotations java.lang.Package5Test
error: testGetAnnotations2 java.lang.Package5Test
error: testGetAnnotations5 java.lang.Package5Test
error: testGetAnnotationsImmutable java.lang.Package5Test
error: testIsAnnotationPresent java.lang.Package5Test
error: testIsAnnotationPresent_Negative java.lang.Package5Test
error: testGetParameterAnnotations2 java.lang.reflect.Ctor5Test
error: testGetParameterAnnotations3 java.lang.reflect.Ctor5Test
error: testGetParameterAnnotationsImmutable java.lang.reflect.Ctor5Test
error: testGetAnnotation java.lang.reflect.Ctor5Test
error: testGetAnnotation2 java.lang.reflect.Ctor5Test
error: testGetAnnotation_Negative java.lang.reflect.Ctor5Test
error: testGetDeclaredAnnotations java.lang.reflect.Ctor5Test
error: testGetDeclaredAnnotations2 java.lang.reflect.Ctor5Test
error: testGetDeclaredAnnotationsImmutable java.lang.reflect.Ctor5Test
error: testGetAnnotations java.lang.reflect.Ctor5Test
error: testGetAnnotations2 java.lang.reflect.Ctor5Test
error: testGetAnnotations5 java.lang.reflect.Ctor5Test
error: testGetAnnotationsImmutable java.lang.reflect.Ctor5Test
error: testIsAnnotationPresent java.lang.reflect.Ctor5Test
error: testIsAnnotationPresent_Negative java.lang.reflect.Ctor5Test
error: testGetAnnotation java.lang.reflect.Field5Test
error: testGetAnnotation2 java.lang.reflect.Field5Test
error: testGetAnnotation_Negative java.lang.reflect.Field5Test
error: testGetDeclaredAnnotations java.lang.reflect.Field5Test
error: testGetDeclaredAnnotations2 java.lang.reflect.Field5Test
error: testGetDeclaredAnnotationsImmutable java.lang.reflect.Field5Test
error: testGetAnnotations java.lang.reflect.Field5Test
error: testGetAnnotations2 java.lang.reflect.Field5Test
error: testGetAnnotations5 java.lang.reflect.Field5Test
error: testGetAnnotationsImmutable java.lang.reflect.Field5Test
error: testIsAnnotationPresent java.lang.reflect.Field5Test
error: testIsAnnotationPresent_Negative java.lang.reflect.Field5Test
error: testGetParameterAnnotations2 java.lang.reflect.Method5Test
error: testGetParameterAnnotations3 java.lang.reflect.Method5Test
error: testGetParameterAnnotationsImmutable java.lang.reflect.Method5Test
error: testGetAnnotation java.lang.reflect.Method5Test
error: testGetAnnotation2 java.lang.reflect.Method5Test
error: testGetAnnotation_Negative java.lang.reflect.Method5Test
error: testGetDeclaredAnnotations java.lang.reflect.Method5Test
error: testGetDeclaredAnnotations2 java.lang.reflect.Method5Test
error: testGetDeclaredAnnotationsImmutable java.lang.reflect.Method5Test
error: testGetAnnotations java.lang.reflect.Method5Test
error: testGetAnnotations2 java.lang.reflect.Method5Test
error: testGetAnnotations5 java.lang.reflect.Method5Test
error: testGetAnnotationsImmutable java.lang.reflect.Method5Test
error: testIsAnnotationPresent java.lang.reflect.Method5Test
error: testIsAnnotationPresent_Negative java.lang.reflect.Method5Test
error: testGetAnnotation_ByDefault org.apache.harmony.lang.annotation.AllTypesTest
error: testGetAnnotation_NoDefault org.apache.harmony.lang.annotation.AllTypesTest
error: testEquals org.apache.harmony.lang.annotation.AllTypesTest
error: testEquals_ForeignImpl org.apache.harmony.lang.annotation.AllTypesTest
error: testToString org.apache.harmony.lang.annotation.AllTypesTest
error: testAnnotationType org.apache.harmony.lang.annotation.AllTypesTest
error: testAnnotation_ElementError org.apache.harmony.lang.annotation.AllTypesTest
error: testSerialization org.apache.harmony.lang.annotation.AllTypesTest
Unit Test Error Details:	(64)
                
Test: test_10Class: java.lang.ClassAnnotationsTestjava.lang.AssertionError
	at java.lang.reflect.Proxy.getProxyClass(Proxy.java:169)
	at java.lang.reflect.Proxy.newProxyInstance(Proxy.java:201)
	at org.apache.harmony.lang.annotation.AnnotationFactory.createAnnotation(AnnotationFactory.java:101)
	at org.apache.harmony.vm.VMGenericsAndAnnotations.getDeclaredAnnotations(VMGenericsAndAnnotations.java)
	at java.lang.reflect.Method$MethodData.getDeclaredAnnotations(Method.java:426)
	at java.lang.reflect.Method.getDeclaredAnnotations(Method.java:71)
	at java.lang.reflect.AccessibleObject.getAnnotations(AccessibleObject.java)
	at java.lang.ClassAnnotationsTest.test_10(ClassAnnotationsTest.java:2027)
	at java.lang.reflect.VMReflection.invokeMethod(VMReflection.java)
	at java.lang.reflect.Method.invoke(Method.java:317)
	at junit.framework.TestCase.runTest(TestCase.java:164)
	at junit.framework.TestCase.runBare(TestCase.java)
	at junit.framework.TestResult$1.protect(TestResult.java)
	at junit.framework.TestResult.runProtected(TestResult.java)
	at junit.framework.TestResult.run(TestResult.java:109)
	at junit.framework.TestCase.run(TestCase.java:120)
	at junit.framework.TestSuite.runTest(TestSuite.java:230)
	at junit.framework.TestSuite.run(TestSuite.java)
	at org.apache.tools.ant.taskdefs.optional.junit.JUnitTestRunner.run(JUnitTestRunner.java)
	at org.apache.tools.ant.taskdefs.optional.junit.JUnitTestRunner.launch(JUnitTestRunner.java:672)
	at org.apache.tools.ant.taskdefs.optional.junit.JUnitTestRunner.main(JUnitTestRunner.java:546)
Test: test_11Class: java.lang.ClassAnnotationsTestjava.lang.AssertionError
	at java.lang.reflect.Proxy.getProxyClass(Proxy.java:169)
	at java.lang.reflect.Proxy.newProxyInstance(Proxy.java:201)
	at org.apache.harmony.lang.annotation.AnnotationFactory.createAnnotation(AnnotationFactory.java:101)
	at org.apache.harmony.vm.VMGenericsAndAnnotations.getDeclaredAnnotations(VMGenericsAndAnnotations.java)
	at java.lang.reflect.Method$MethodData.getDeclaredAnnotations(Method.java:426)
	at java.lang.reflect.Method.getDeclaredAnnotations(Method.java:71)
	at java.lang.reflect.AccessibleObject.getAnnotations(AccessibleObject.java)
	at java.lang.ClassAnnotationsTest.test_11(ClassAnnotationsTest.java:2300)
	at java.lang.reflect.VMReflection.invokeMethod(VMReflection.java)
	at java.lang.reflect.Method.invoke(Method.java:317)
	at junit.framework.TestCase.runTest(TestCase.java:164)
	at junit.framework.TestCase.runBare(TestCase.java)
	at junit.framework.TestResult$1.protect(TestResult.java)
	at junit.framework.TestResult.runProtected(TestResult.java)
	at junit.framework.TestResult.run(TestResult.java:109)
	at junit.framework.TestCase.run(TestCase.java:120)
	at junit.framework.TestSuite.runTest(TestSuite.java:230)
	at junit.framework.TestSuite.run(TestSuite.java)
	at org.apache.tools.ant.taskdefs.optional.junit.JUnitTestRunner.run(JUnitTestRunner.java)
	at org.apache.tools.ant.taskdefs.optional.junit.JUnitTestRunner.launch(JUnitTestRunner.java:672)
	at org.apache.tools.ant.taskdefs.optional.junit.JUnitTestRunner.main(JUnitTestRunner.java:546)
Test: testGetAnnotationClass: java.lang.Package5Testjava.lang.AssertionError
	at java.lang.reflect.Proxy.getProxyClass(Proxy.java:169)
	at java.lang.reflect.Proxy.newProxyInstance(Proxy.java:201)
	at org.apache.harmony.lang.annotation.AnnotationFactory.createAnnotation(AnnotationFactory.java:101)
	at org.apache.harmony.vm.VMGenericsAndAnnotations.getDeclaredAnnotations(VMGenericsAndAnnotations.java)
	at java.lang.Package.getDeclaredAnnotations(Package.java:56)
	at java.lang.Package.getAnnotations(Package.java:65)
	at java.lang.Package.getAnnotation(Package.java:78)
	at org.apache.harmony.lang.AnnotatedElementTestFrame.testGetAnnotation(AnnotatedElementTestFrame.java)
	at java.lang.reflect.VMReflection.invokeMethod(VMReflection.java)
	at java.lang.reflect.Method.invoke(Method.java:317)
	at junit.framework.TestCase.runTest(TestCase.java:164)
	at junit.framework.TestCase.runBare(TestCase.java)
	at junit.framework.TestResult$1.protect(TestResult.java)
	at junit.framework.TestResult.runProtected(TestResult.java)
	at junit.framework.TestResult.run(TestResult.java:109)
	at junit.framework.TestCase.run(TestCase.java:120)
	at junit.framework.TestSuite.runTest(TestSuite.java:230)
	at junit.framework.TestSuite.run(TestSuite.java)
	at org.apache.tools.ant.taskdefs.optional.junit.JUnitTestRunner.run(JUnitTestRunner.java)
	at org.apache.tools.ant.taskdefs.optional.junit.JUnitTestRunner.launch(JUnitTestRunner.java:672)
	at org.apache.tools.ant.taskdefs.optional.junit.JUnitTestRunner.main(JUnitTestRunner.java:546)
Test: testGetAnnotation2Class: java.lang.Package5Testjava.lang.AssertionError
	at java.lang.reflect.Proxy.getProxyClass(Proxy.java:169)
	at java.lang.reflect.Proxy.newProxyInstance(Proxy.java:201)
	at org.apache.harmony.lang.annotation.AnnotationFactory.createAnnotation(AnnotationFactory.java:101)
	at org.apache.harmony.vm.VMGenericsAndAnnotations.getDeclaredAnnotations(VMGenericsAndAnnotations.java)
	at java.lang.Package.getDeclaredAnnotations(Package.java:56)
	at java.lang.Package.getAnnotations(Package.java:65)
	at java.lang.Package.getAnnotation(Package.java:78)
	at org.apache.harmony.lang.AnnotatedElementTestFrame.testGetAnnotation2(AnnotatedElementTestFrame.java)
	at java.lang.reflect.VMReflection.invokeMethod(VMReflection.java)
	at java.lang.reflect.Method.invoke(Method.java:317)
	at junit.framework.TestCase.runTest(TestCase.java:164)
	at junit.framework.TestCase.runBare(TestCase.java)
	at junit.framework.TestResult$1.protect(TestResult.java)
	at junit.framework.TestResult.runProtected(TestResult.java)
	at junit.framework.TestResult.run(TestResult.java:109)
	at junit.framework.TestCase.run(TestCase.java:120)
	at junit.framework.TestSuite.runTest(TestSuite.java:230)
	at junit.framework.TestSuite.run(TestSuite.java)
	at org.apache.tools.ant.taskdefs.optional.junit.JUnitTestRunner.run(JUnitTestRunner.java)
	at org.apache.tools.ant.taskdefs.optional.junit.JUnitTestRunner.launch(JUnitTestRunner.java:672)
	at org.apache.tools.ant.taskdefs.optional.junit.JUnitTestRunner.main(JUnitTestRunner.java:546)
Test: testGetAnnotation_NegativeClass: java.lang.Package5Testjava.lang.AssertionError
	at java.lang.reflect.Proxy.getProxyClass(Proxy.java:169)
	at java.lang.reflect.Proxy.newProxyInstance(Proxy.java:201)
	at org.apache.harmony.lang.annotation.AnnotationFactory.createAnnotation(AnnotationFactory.java:101)
	at org.apache.harmony.vm.VMGenericsAndAnnotations.getDeclaredAnnotations(VMGenericsAndAnnotations.java)
	at java.lang.Package.getDeclaredAnnotations(Package.java:56)
	at java.lang.Package.getAnnotations(Package.java:65)
	at java.lang.Package.getAnnotation(Package.java:78)
	at org.apache.harmony.lang.AnnotatedElementTestFrame.testGetAnnotation_Negative(AnnotatedElementTestFrame.java)
	at java.lang.reflect.VMReflection.invokeMethod(VMReflection.java)
	at java.lang.reflect.Method.invoke(Method.java:317)
	at junit.framework.TestCase.runTest(TestCase.java:164)
	at junit.framework.TestCase.runBare(TestCase.java)
	at junit.framework.TestResult$1.protect(TestResult.java)
	at junit.framework.TestResult.runProtected(TestResult.java)
	at junit.framework.TestResult.run(TestResult.java:109)
	at junit.framework.TestCase.run(TestCase.java:120)
	at junit.framework.TestSuite.runTest(TestSuite.java:230)
	at junit.framework.TestSuite.run(TestSuite.java)
	at org.apache.tools.ant.taskdefs.optional.junit.JUnitTestRunner.run(JUnitTestRunner.java)
	at org.apache.tools.ant.taskdefs.optional.junit.JUnitTestRunner.launch(JUnitTestRunner.java:672)
	at org.apache.tools.ant.taskdefs.optional.junit.JUnitTestRunner.main(JUnitTestRunner.java:546)
Test: testGetDeclaredAnnotationsClass: java.lang.Package5Testjava.lang.AssertionError
	at java.lang.reflect.Proxy.getProxyClass(Proxy.java:169)
	at java.lang.reflect.Proxy.newProxyInstance(Proxy.java:201)
	at org.apache.harmony.lang.annotation.AnnotationFactory.createAnnotation(AnnotationFactory.java:101)
	at org.apache.harmony.vm.VMGenericsAndAnnotations.getDeclaredAnnotations(VMGenericsAndAnnotations.java)
	at java.lang.Package.getDeclaredAnnotations(Package.java:56)
	at org.apache.harmony.lang.AnnotatedElementTestFrame.testGetDeclaredAnnotations(AnnotatedElementTestFrame.java)
	at java.lang.reflect.VMReflection.invokeMethod(VMReflection.java)
	at java.lang.reflect.Method.invoke(Method.java:317)
	at junit.framework.TestCase.runTest(TestCase.java:164)
	at junit.framework.TestCase.runBare(TestCase.java)
	at junit.framework.TestResult$1.protect(TestResult.java)
	at junit.framework.TestResult.runProtected(TestResult.java)
	at junit.framework.TestResult.run(TestResult.java:109)
	at junit.framework.TestCase.run(TestCase.java:120)
	at junit.framework.TestSuite.runTest(TestSuite.java:230)
	at junit.framework.TestSuite.run(TestSuite.java)
	at org.apache.tools.ant.taskdefs.optional.junit.JUnitTestRunner.run(JUnitTestRunner.java)
	at org.apache.tools.ant.taskdefs.optional.junit.JUnitTestRunner.launch(JUnitTestRunner.java:672)
	at org.apache.tools.ant.taskdefs.optional.junit.JUnitTestRunner.main(JUnitTestRunner.java:546)
Test: testGetDeclaredAnnotations2Class: java.lang.Package5Testjava.lang.AssertionError
	at java.lang.reflect.Proxy.getProxyClass(Proxy.java:169)
	at java.lang.reflect.Proxy.newProxyInstance(Proxy.java:201)
	at org.apache.harmony.lang.annotation.AnnotationFactory.createAnnotation(AnnotationFactory.java:101)
	at org.apache.harmony.vm.VMGenericsAndAnnotations.getDeclaredAnnotations(VMGenericsAndAnnotations.java)
	at java.lang.Package.getDeclaredAnnotations(Package.java:56)
	at org.apache.harmony.lang.AnnotatedElementTestFrame.testGetDeclaredAnnotations2(AnnotatedElementTestFrame.java)
	at java.lang.reflect.VMReflection.invokeMethod(VMReflection.java)
	at java.lang.reflect.Method.invoke(Method.java:317)
	at junit.framework.TestCase.runTest(TestCase.java:164)
	at junit.framework.TestCase.runBare(TestCase.java)
	at junit.framework.TestResult$1.protect(TestResult.java)
	at junit.framework.TestResult.runProtected(TestResult.java)
	at junit.framework.TestResult.run(TestResult.java:109)
	at junit.framework.TestCase.run(TestCase.java:120)
	at junit.framework.TestSuite.runTest(TestSuite.java:230)
	at junit.framework.TestSuite.run(TestSuite.java)
	at org.apache.tools.ant.taskdefs.optional.junit.JUnitTestRunner.run(JUnitTestRunner.java)
	at org.apache.tools.ant.taskdefs.optional.junit.JUnitTestRunner.launch(JUnitTestRunner.java:672)
	at org.apache.tools.ant.taskdefs.optional.junit.JUnitTestRunner.main(JUnitTestRunner.java:546)
Test: testGetDeclaredAnnotationsImmutableClass: java.lang.Package5Testjava.lang.AssertionError
	at java.lang.reflect.Proxy.getProxyClass(Proxy.java:169)
	at java.lang.reflect.Proxy.newProxyInstance(Proxy.java:201)
	at org.apache.harmony.lang.annotation.AnnotationFactory.createAnnotation(AnnotationFactory.java:101)
	at org.apache.harmony.vm.VMGenericsAndAnnotations.getDeclaredAnnotations(VMGenericsAndAnnotations.java)
	at java.lang.Package.getDeclaredAnnotations(Package.java:56)
	at org.apache.harmony.lang.AnnotatedElementTestFrame.testGetDeclaredAnnotationsImmutable(AnnotatedElementTestFrame.java)
	at java.lang.reflect.VMReflection.invokeMethod(VMReflection.java)
	at java.lang.reflect.Method.invoke(Method.java:317)
	at junit.framework.TestCase.runTest(TestCase.java:164)
	at junit.framework.TestCase.runBare(TestCase.java)
	at junit.framework.TestResult$1.protect(TestResult.java)
	at junit.framework.TestResult.runProtected(TestResult.java)
	at junit.framework.TestResult.run(TestResult.java:109)
	at junit.framework.TestCase.run(TestCase.java:120)
	at junit.framework.TestSuite.runTest(TestSuite.java:230)
	at junit.framework.TestSuite.run(TestSuite.java)
	at org.apache.tools.ant.taskdefs.optional.junit.JUnitTestRunner.run(JUnitTestRunner.java)
	at org.apache.tools.ant.taskdefs.optional.junit.JUnitTestRunner.launch(JUnitTestRunner.java:672)
	at org.apache.tools.ant.taskdefs.optional.junit.JUnitTestRunner.main(JUnitTestRunner.java:546)
Test: testGetAnnotationsClass: java.lang.Package5Testjava.lang.AssertionError
	at java.lang.reflect.Proxy.getProxyClass(Proxy.java:169)
	at java.lang.reflect.Proxy.newProxyInstance(Proxy.java:201)
	at org.apache.harmony.lang.annotation.AnnotationFactory.createAnnotation(AnnotationFactory.java:101)
	at org.apache.harmony.vm.VMGenericsAndAnnotations.getDeclaredAnnotations(VMGenericsAndAnnotations.java)
	at java.lang.Package.getDeclaredAnnotations(Package.java:56)
	at java.lang.Package.getAnnotations(Package.java:65)
	at org.apache.harmony.lang.AnnotatedElementTestFrame.testGetAnnotations(AnnotatedElementTestFrame.java)
	at java.lang.reflect.VMReflection.invokeMethod(VMReflection.java)
	at java.lang.reflect.Method.invoke(Method.java:317)
	at junit.framework.TestCase.runTest(TestCase.java:164)
	at junit.framework.TestCase.runBare(TestCase.java)
	at junit.framework.TestResult$1.protect(TestResult.java)
	at junit.framework.TestResult.runProtected(TestResult.java)
	at junit.framework.TestResult.run(TestResult.java:109)
	at junit.framework.TestCase.run(TestCase.java:120)
	at junit.framework.TestSuite.runTest(TestSuite.java:230)
	at junit.framework.TestSuite.run(TestSuite.java)
	at org.apache.tools.ant.taskdefs.optional.junit.JUnitTestRunner.run(JUnitTestRunner.java)
	at org.apache.tools.ant.taskdefs.optional.junit.JUnitTestRunner.launch(JUnitTestRunner.java:672)
	at org.apache.tools.ant.taskdefs.optional.junit.JUnitTestRunner.main(JUnitTestRunner.java:546)
Test: testGetAnnotations2Class: java.lang.Package5Testjava.lang.AssertionError
	at java.lang.reflect.Proxy.getProxyClass(Proxy.java:169)
	at java.lang.reflect.Proxy.newProxyInstance(Proxy.java:201)
	at org.apache.harmony.lang.annotation.AnnotationFactory.createAnnotation(AnnotationFactory.java:101)
	at org.apache.harmony.vm.VMGenericsAndAnnotations.getDeclaredAnnotations(VMGenericsAndAnnotations.java)
	at java.lang.Package.getDeclaredAnnotations(Package.java:56)
	at java.lang.Package.getAnnotations(Package.java:65)
	at org.apache.harmony.lang.AnnotatedElementTestFrame.testGetAnnotations2(AnnotatedElementTestFrame.java)
	at java.lang.reflect.VMReflection.invokeMethod(VMReflection.java)
	at java.lang.reflect.Method.invoke(Method.java:317)
	at junit.framework.TestCase.runTest(TestCase.java:164)
	at junit.framework.TestCase.runBare(TestCase.java)
	at junit.framework.TestResult$1.protect(TestResult.java)
	at junit.framework.TestResult.runProtected(TestResult.java)
	at junit.framework.TestResult.run(TestResult.java:109)
	at junit.framework.TestCase.run(TestCase.java:120)
	at junit.framework.TestSuite.runTest(TestSuite.java:230)
	at junit.framework.TestSuite.run(TestSuite.java)
	at org.apache.tools.ant.taskdefs.optional.junit.JUnitTestRunner.run(JUnitTestRunner.java)
	at org.apache.tools.ant.taskdefs.optional.junit.JUnitTestRunner.launch(JUnitTestRunner.java:672)
	at org.apache.tools.ant.taskdefs.optional.junit.JUnitTestRunner.main(JUnitTestRunner.java:546)
Test: testGetAnnotations5Class: java.lang.Package5Testjava.lang.AssertionError
	at java.lang.reflect.Proxy.getProxyClass(Proxy.java:169)
	at java.lang.reflect.Proxy.newProxyInstance(Proxy.java:201)
	at org.apache.harmony.lang.annotation.AnnotationFactory.createAnnotation(AnnotationFactory.java:101)
	at org.apache.harmony.vm.VMGenericsAndAnnotations.getDeclaredAnnotations(VMGenericsAndAnnotations.java)
	at java.lang.Package.getDeclaredAnnotations(Package.java:56)
	at java.lang.Package.getAnnotations(Package.java:65)
	at org.apache.harmony.lang.AnnotatedElementTestFrame.testGetAnnotations5(AnnotatedElementTestFrame.java)
	at java.lang.reflect.VMReflection.invokeMethod(VMReflection.java)
	at java.lang.reflect.Method.invoke(Method.java:317)
	at junit.framework.TestCase.runTest(TestCase.java:164)
	at junit.framework.TestCase.runBare(TestCase.java)
	at junit.framework.TestResult$1.protect(TestResult.java)
	at junit.framework.TestResult.runProtected(TestResult.java)
	at junit.framework.TestResult.run(TestResult.java:109)
	at junit.framework.TestCase.run(TestCase.java:120)
	at junit.framework.TestSuite.runTest(TestSuite.java:230)
	at junit.framework.TestSuite.run(TestSuite.java)
	at org.apache.tools.ant.taskdefs.optional.junit.JUnitTestRunner.run(JUnitTestRunner.java)
	at org.apache.tools.ant.taskdefs.optional.junit.JUnitTestRunner.launch(JUnitTestRunner.java:672)
	at org.apache.tools.ant.taskdefs.optional.junit.JUnitTestRunner.main(JUnitTestRunner.java:546)
Test: testGetAnnotationsImmutableClass: java.lang.Package5Testjava.lang.AssertionError
	at java.lang.reflect.Proxy.getProxyClass(Proxy.java:169)
	at java.lang.reflect.Proxy.newProxyInstance(Proxy.java:201)
	at org.apache.harmony.lang.annotation.AnnotationFactory.createAnnotation(AnnotationFactory.java:101)
	at org.apache.harmony.vm.VMGenericsAndAnnotations.getDeclaredAnnotations(VMGenericsAndAnnotations.java)
	at java.lang.Package.getDeclaredAnnotations(Package.java:56)
	at java.lang.Package.getAnnotations(Package.java:65)
	at org.apache.harmony.lang.AnnotatedElementTestFrame.testGetAnnotationsImmutable(AnnotatedElementTestFrame.java)
	at java.lang.reflect.VMReflection.invokeMethod(VMReflection.java)
	at java.lang.reflect.Method.invoke(Method.java:317)
	at junit.framework.TestCase.runTest(TestCase.java:164)
	at junit.framework.TestCase.runBare(TestCase.java)
	at junit.framework.TestResult$1.protect(TestResult.java)
	at junit.framework.TestResult.runProtected(TestResult.java)
	at junit.framework.TestResult.run(TestResult.java:109)
	at junit.framework.TestCase.run(TestCase.java:120)
	at junit.framework.TestSuite.runTest(TestSuite.java:230)
	at junit.framework.TestSuite.run(TestSuite.java)
	at org.apache.tools.ant.taskdefs.optional.junit.JUnitTestRunner.run(JUnitTestRunner.java)
	at org.apache.tools.ant.taskdefs.optional.junit.JUnitTestRunner.launch(JUnitTestRunner.java:672)
	at org.apache.tools.ant.taskdefs.optional.junit.JUnitTestRunner.main(JUnitTestRunner.java:546)
Test: testIsAnnotationPresentClass: java.lang.Package5Testjava.lang.AssertionError
	at java.lang.reflect.Proxy.getProxyClass(Proxy.java:169)
	at java.lang.reflect.Proxy.newProxyInstance(Proxy.java:201)
	at org.apache.harmony.lang.annotation.AnnotationFactory.createAnnotation(AnnotationFactory.java:101)
	at org.apache.harmony.vm.VMGenericsAndAnnotations.getDeclaredAnnotations(VMGenericsAndAnnotations.java)
	at java.lang.Package.getDeclaredAnnotations(Package.java:56)
	at java.lang.Package.getAnnotations(Package.java:65)
	at java.lang.Package.getAnnotation(Package.java:78)
	at java.lang.Package.isAnnotationPresent(Package.java:93)
	at org.apache.harmony.lang.AnnotatedElementTestFrame.testIsAnnotationPresent(AnnotatedElementTestFrame.java)
	at java.lang.reflect.VMReflection.invokeMethod(VMReflection.java)
	at java.lang.reflect.Method.invoke(Method.java:317)
	at junit.framework.TestCase.runTest(TestCase.java:164)
	at junit.framework.TestCase.runBare(TestCase.java)
	at junit.framework.TestResult$1.protect(TestResult.java)
	at junit.framework.TestResult.runProtected(TestResult.java)
	at junit.framework.TestResult.run(TestResult.java:109)
	at junit.framework.TestCase.run(TestCase.java:120)
	at junit.framework.TestSuite.runTest(TestSuite.java:230)
	at junit.framework.TestSuite.run(TestSuite.java)
	at org.apache.tools.ant.taskdefs.optional.junit.JUnitTestRunner.run(JUnitTestRunner.java)
	at org.apache.tools.ant.taskdefs.optional.junit.JUnitTestRunner.launch(JUnitTestRunner.java:672)
	at org.apache.tools.ant.taskdefs.optional.junit.JUnitTestRunner.main(JUnitTestRunner.java:546)
Test: testIsAnnotationPresent_NegativeClass: java.lang.Package5Testjava.lang.AssertionError
	at java.lang.reflect.Proxy.getProxyClass(Proxy.java:169)
	at java.lang.reflect.Proxy.newProxyInstance(Proxy.java:201)
	at org.apache.harmony.lang.annotation.AnnotationFactory.createAnnotation(AnnotationFactory.java:101)
	at org.apache.harmony.vm.VMGenericsAndAnnotations.getDeclaredAnnotations(VMGenericsAndAnnotations.java)
	at java.lang.Package.getDeclaredAnnotations(Package.java:56)
	at java.lang.Package.getAnnotations(Package.java:65)
	at java.lang.Package.getAnnotation(Package.java:78)
	at java.lang.Package.isAnnotationPresent(Package.java:93)
	at org.apache.harmony.lang.AnnotatedElementTestFrame.testIsAnnotationPresent_Negative(AnnotatedElementTestFrame.java)
	at java.lang.reflect.VMReflection.invokeMethod(VMReflection.java)
	at java.lang.reflect.Method.invoke(Method.java:317)
	at junit.framework.TestCase.runTest(TestCase.java:164)
	at junit.framework.TestCase.runBare(TestCase.java)
	at junit.framework.TestResult$1.protect(TestResult.java)
	at junit.framework.TestResult.runProtected(TestResult.java)
	at junit.framework.TestResult.run(TestResult.java:109)
	at junit.framework.TestCase.run(TestCase.java:120)
	at junit.framework.TestSuite.runTest(TestSuite.java:230)
	at junit.framework.TestSuite.run(TestSuite.java)
	at org.apache.tools.ant.taskdefs.optional.junit.JUnitTestRunner.run(JUnitTestRunner.java)
	at org.apache.tools.ant.taskdefs.optional.junit.JUnitTestRunner.launch(JUnitTestRunner.java:672)
	at org.apache.tools.ant.taskdefs.optional.junit.JUnitTestRunner.main(JUnitTestRunner.java:546)
Test: testGetParameterAnnotations2Class: java.lang.reflect.Ctor5Testjava.lang.reflect.InvocationTargetException
	at java.lang.reflect.VMReflection.invokeMethod(VMReflection.java)
	at java.lang.reflect.Method.invoke(Method.java:317)
	at java.lang.reflect.Method5Test.getParamAnnotations(Method5Test.java:81)
	at java.lang.reflect.Method5Test.testGetParameterAnnotations2(Method5Test.java:113)
	at java.lang.reflect.VMReflection.invokeMethod(VMReflection.java)
	at java.lang.reflect.Method.invoke(Method.java:317)
	at junit.framework.TestCase.runTest(TestCase.java:164)
	at junit.framework.TestCase.runBare(TestCase.java)
	at junit.framework.TestResult$1.protect(TestResult.java)
	at junit.framework.TestResult.runProtected(TestResult.java)
	at junit.framework.TestResult.run(TestResult.java:109)
	at junit.framework.TestCase.run(TestCase.java:120)
	at junit.framework.TestSuite.runTest(TestSuite.java:230)
	at junit.framework.TestSuite.run(TestSuite.java)
	at org.apache.tools.ant.taskdefs.optional.junit.JUnitTestRunner.run(JUnitTestRunner.java)
	at org.apache.tools.ant.taskdefs.optional.junit.JUnitTestRunner.launch(JUnitTestRunner.java:672)
	at org.apache.tools.ant.taskdefs.optional.junit.JUnitTestRunner.main(JUnitTestRunner.java:546)
Caused by: java.lang.AssertionError
	at java.lang.reflect.Proxy.getProxyClass(Proxy.java:169)
	at java.lang.reflect.Proxy.newProxyInstance(Proxy.java:201)
	at org.apache.harmony.lang.annotation.AnnotationFactory.createAnnotation(AnnotationFactory.java:101)
	at org.apache.harmony.vm.VMGenericsAndAnnotations.getParameterAnnotations(VMGenericsAndAnnotations.java)
	at java.lang.reflect.Constructor$ConstructorData.getParameterAnnotations(Constructor.java:395)
	at java.lang.reflect.Constructor.getParameterAnnotations(Constructor.java:50)
	at java.lang.reflect.VMReflection.invokeMethod(VMReflection.java)
	... 16 more
Test: testGetParameterAnnotations3Class: java.lang.reflect.Ctor5Testjava.lang.reflect.InvocationTargetException
	at java.lang.reflect.VMReflection.invokeMethod(VMReflection.java)
	at java.lang.reflect.Method.invoke(Method.java:317)
	at java.lang.reflect.Method5Test.getParamAnnotations(Method5Test.java:81)
	at java.lang.reflect.Method5Test.testGetParameterAnnotations3(Method5Test.java:140)
	at java.lang.reflect.VMReflection.invokeMethod(VMReflection.java)
	at java.lang.reflect.Method.invoke(Method.java:317)
	at junit.framework.TestCase.runTest(TestCase.java:164)
	at junit.framework.TestCase.runBare(TestCase.java)
	at junit.framework.TestResult$1.protect(TestResult.java)
	at junit.framework.TestResult.runProtected(TestResult.java)
	at junit.framework.TestResult.run(TestResult.java:109)
	at junit.framework.TestCase.run(TestCase.java:120)
	at junit.framework.TestSuite.runTest(TestSuite.java:230)
	at junit.framework.TestSuite.run(TestSuite.java)
	at org.apache.tools.ant.taskdefs.optional.junit.JUnitTestRunner.run(JUnitTestRunner.java)
	at org.apache.tools.ant.taskdefs.optional.junit.JUnitTestRunner.launch(JUnitTestRunner.java:672)
	at org.apache.tools.ant.taskdefs.optional.junit.JUnitTestRunner.main(JUnitTestRunner.java:546)
Caused by: java.lang.AssertionError
	at java.lang.reflect.Proxy.getProxyClass(Proxy.java:169)
	at java.lang.reflect.Proxy.newProxyInstance(Proxy.java:201)
	at org.apache.harmony.lang.annotation.AnnotationFactory.createAnnotation(AnnotationFactory.java:101)
	at org.apache.harmony.vm.VMGenericsAndAnnotations.getParameterAnnotations(VMGenericsAndAnnotations.java)
	at java.lang.reflect.Constructor$ConstructorData.getParameterAnnotations(Constructor.java:395)
	at java.lang.reflect.Constructor.getParameterAnnotations(Constructor.java:50)
	at java.lang.reflect.VMReflection.invokeMethod(VMReflection.java)
	... 16 more
Test: testGetParameterAnnotationsImmutableClass: java.lang.reflect.Ctor5Testjava.lang.reflect.InvocationTargetException
	at java.lang.reflect.VMReflection.invokeMethod(VMReflection.java)
	at java.lang.reflect.Method.invoke(Method.java:317)
	at java.lang.reflect.Method5Test.getParamAnnotations(Method5Test.java:81)
	at java.lang.reflect.Method5Test.testGetParameterAnnotationsImmutable(Method5Test.java:157)
	at java.lang.reflect.VMReflection.invokeMethod(VMReflection.java)
	at java.lang.reflect.Method.invoke(Method.java:317)
	at junit.framework.TestCase.runTest(TestCase.java:164)
	at junit.framework.TestCase.runBare(TestCase.java)
	at junit.framework.TestResult$1.protect(TestResult.java)
	at junit.framework.TestResult.runProtected(TestResult.java)
	at junit.framework.TestResult.run(TestResult.java:109)
	at junit.framework.TestCase.run(TestCase.java:120)
	at junit.framework.TestSuite.runTest(TestSuite.java:230)
	at junit.framework.TestSuite.run(TestSuite.java)
	at org.apache.tools.ant.taskdefs.optional.junit.JUnitTestRunner.run(JUnitTestRunner.java)
	at org.apache.tools.ant.taskdefs.optional.junit.JUnitTestRunner.launch(JUnitTestRunner.java:672)
	at org.apache.tools.ant.taskdefs.optional.junit.JUnitTestRunner.main(JUnitTestRunner.java:546)
Caused by: java.lang.AssertionError
	at java.lang.reflect.Proxy.getProxyClass(Proxy.java:169)
	at java.lang.reflect.Proxy.newProxyInstance(Proxy.java:201)
	at org.apache.harmony.lang.annotation.AnnotationFactory.createAnnotation(AnnotationFactory.java:101)
	at org.apache.harmony.vm.VMGenericsAndAnnotations.getParameterAnnotations(VMGenericsAndAnnotations.java)
	at java.lang.reflect.Constructor$ConstructorData.getParameterAnnotations(Constructor.java:395)
	at java.lang.reflect.Constructor.getParameterAnnotations(Constructor.java:50)
	at java.lang.reflect.VMReflection.invokeMethod(VMReflection.java)
	... 16 more
Test: testGetAnnotationClass: java.lang.reflect.Ctor5Testjava.lang.AssertionError
	at java.lang.reflect.Proxy.getProxyClass(Proxy.java:169)
	at java.lang.reflect.Proxy.newProxyInstance(Proxy.java:201)
	at org.apache.harmony.lang.annotation.AnnotationFactory.createAnnotation(AnnotationFactory.java:101)
	at org.apache.harmony.vm.VMGenericsAndAnnotations.getDeclaredAnnotations(VMGenericsAndAnnotations.java)
	at java.lang.reflect.Constructor$ConstructorData.getDeclaredAnnotations(Constructor.java:377)
	at java.lang.reflect.Constructor.getAnnotation(Constructor.java:77)
	at org.apache.harmony.lang.AnnotatedElementTestFrame.testGetAnnotation(AnnotatedElementTestFrame.java)
	at java.lang.reflect.VMReflection.invokeMethod(VMReflection.java)
	at java.lang.reflect.Method.invoke(Method.java:317)
	at junit.framework.TestCase.runTest(TestCase.java:164)
	at junit.framework.TestCase.runBare(TestCase.java)
	at junit.framework.TestResult$1.protect(TestResult.java)
	at junit.framework.TestResult.runProtected(TestResult.java)
	at junit.framework.TestResult.run(TestResult.java:109)
	at junit.framework.TestCase.run(TestCase.java:120)
	at junit.framework.TestSuite.runTest(TestSuite.java:230)
	at junit.framework.TestSuite.run(TestSuite.java)
	at org.apache.tools.ant.taskdefs.optional.junit.JUnitTestRunner.run(JUnitTestRunner.java)
	at org.apache.tools.ant.taskdefs.optional.junit.JUnitTestRunner.launch(JUnitTestRunner.java:672)
	at org.apache.tools.ant.taskdefs.optional.junit.JUnitTestRunner.main(JUnitTestRunner.java:546)
Test: testGetAnnotation2Class: java.lang.reflect.Ctor5Testjava.lang.AssertionError
	at java.lang.reflect.Proxy.getProxyClass(Proxy.java:169)
	at java.lang.reflect.Proxy.newProxyInstance(Proxy.java:201)
	at org.apache.harmony.lang.annotation.AnnotationFactory.createAnnotation(AnnotationFactory.java:101)
	at org.apache.harmony.vm.VMGenericsAndAnnotations.getDeclaredAnnotations(VMGenericsAndAnnotations.java)
	at java.lang.reflect.Constructor$ConstructorData.getDeclaredAnnotations(Constructor.java:377)
	at java.lang.reflect.Constructor.getAnnotation(Constructor.java:77)
	at org.apache.harmony.lang.AnnotatedElementTestFrame.testGetAnnotation2(AnnotatedElementTestFrame.java)
	at java.lang.reflect.VMReflection.invokeMethod(VMReflection.java)
	at java.lang.reflect.Method.invoke(Method.java:317)
	at junit.framework.TestCase.runTest(TestCase.java:164)
	at junit.framework.TestCase.runBare(TestCase.java)
	at junit.framework.TestResult$1.protect(TestResult.java)
	at junit.framework.TestResult.runProtected(TestResult.java)
	at junit.framework.TestResult.run(TestResult.java:109)
	at junit.framework.TestCase.run(TestCase.java:120)
	at junit.framework.TestSuite.runTest(TestSuite.java:230)
	at junit.framework.TestSuite.run(TestSuite.java)
	at org.apache.tools.ant.taskdefs.optional.junit.JUnitTestRunner.run(JUnitTestRunner.java)
	at org.apache.tools.ant.taskdefs.optional.junit.JUnitTestRunner.launch(JUnitTestRunner.java:672)
	at org.apache.tools.ant.taskdefs.optional.junit.JUnitTestRunner.main(JUnitTestRunner.java:546)
Test: testGetAnnotation_NegativeClass: java.lang.reflect.Ctor5Testjava.lang.AssertionError
	at java.lang.reflect.Proxy.getProxyClass(Proxy.java:169)
	at java.lang.reflect.Proxy.newProxyInstance(Proxy.java:201)
	at org.apache.harmony.lang.annotation.AnnotationFactory.createAnnotation(AnnotationFactory.java:101)
	at org.apache.harmony.vm.VMGenericsAndAnnotations.getDeclaredAnnotations(VMGenericsAndAnnotations.java)
	at java.lang.reflect.Constructor$ConstructorData.getDeclaredAnnotations(Constructor.java:377)
	at java.lang.reflect.Constructor.getAnnotation(Constructor.java:77)
	at org.apache.harmony.lang.AnnotatedElementTestFrame.testGetAnnotation_Negative(AnnotatedElementTestFrame.java)
	at java.lang.reflect.VMReflection.invokeMethod(VMReflection.java)
	at java.lang.reflect.Method.invoke(Method.java:317)
	at junit.framework.TestCase.runTest(TestCase.java:164)
	at junit.framework.TestCase.runBare(TestCase.java)
	at junit.framework.TestResult$1.protect(TestResult.java)
	at junit.framework.TestResult.runProtected(TestResult.java)
	at junit.framework.TestResult.run(TestResult.java:109)
	at junit.framework.TestCase.run(TestCase.java:120)
	at junit.framework.TestSuite.runTest(TestSuite.java:230)
	at junit.framework.TestSuite.run(TestSuite.java)
	at org.apache.tools.ant.taskdefs.optional.junit.JUnitTestRunner.run(JUnitTestRunner.java)
	at org.apache.tools.ant.taskdefs.optional.junit.JUnitTestRunner.launch(JUnitTestRunner.java:672)
	at org.apache.tools.ant.taskdefs.optional.junit.JUnitTestRunner.main(JUnitTestRunner.java:546)
Test: testGetDeclaredAnnotationsClass: java.lang.reflect.Ctor5Testjava.lang.AssertionError
	at java.lang.reflect.Proxy.getProxyClass(Proxy.java:169)
	at java.lang.reflect.Proxy.newProxyInstance(Proxy.java:201)
	at org.apache.harmony.lang.annotation.AnnotationFactory.createAnnotation(AnnotationFactory.java:101)
	at org.apache.harmony.vm.VMGenericsAndAnnotations.getDeclaredAnnotations(VMGenericsAndAnnotations.java)
	at java.lang.reflect.Constructor$ConstructorData.getDeclaredAnnotations(Constructor.java:377)
	at java.lang.reflect.Constructor.getDeclaredAnnotations(Constructor.java:63)
	at org.apache.harmony.lang.AnnotatedElementTestFrame.testGetDeclaredAnnotations(AnnotatedElementTestFrame.java)
	at java.lang.reflect.VMReflection.invokeMethod(VMReflection.java)
	at java.lang.reflect.Method.invoke(Method.java:317)
	at junit.framework.TestCase.runTest(TestCase.java:164)
	at junit.framework.TestCase.runBare(TestCase.java)
	at junit.framework.TestResult$1.protect(TestResult.java)
	at junit.framework.TestResult.runProtected(TestResult.java)
	at junit.framework.TestResult.run(TestResult.java:109)
	at junit.framework.TestCase.run(TestCase.java:120)
	at junit.framework.TestSuite.runTest(TestSuite.java:230)
	at junit.framework.TestSuite.run(TestSuite.java)
	at org.apache.tools.ant.taskdefs.optional.junit.JUnitTestRunner.run(JUnitTestRunner.java)
	at org.apache.tools.ant.taskdefs.optional.junit.JUnitTestRunner.launch(JUnitTestRunner.java:672)
	at org.apache.tools.ant.taskdefs.optional.junit.JUnitTestRunner.main(JUnitTestRunner.java:546)
Test: testGetDeclaredAnnotations2Class: java.lang.reflect.Ctor5Testjava.lang.AssertionError
	at java.lang.reflect.Proxy.getProxyClass(Proxy.java:169)
	at java.lang.reflect.Proxy.newProxyInstance(Proxy.java:201)
	at org.apache.harmony.lang.annotation.AnnotationFactory.createAnnotation(AnnotationFactory.java:101)
	at org.apache.harmony.vm.VMGenericsAndAnnotations.getDeclaredAnnotations(VMGenericsAndAnnotations.java)
	at java.lang.reflect.Constructor$ConstructorData.getDeclaredAnnotations(Constructor.java:377)
	at java.lang.reflect.Constructor.getDeclaredAnnotations(Constructor.java:63)
	at org.apache.harmony.lang.AnnotatedElementTestFrame.testGetDeclaredAnnotations2(AnnotatedElementTestFrame.java)
	at java.lang.reflect.VMReflection.invokeMethod(VMReflection.java)
	at java.lang.reflect.Method.invoke(Method.java:317)
	at junit.framework.TestCase.runTest(TestCase.java:164)
	at junit.framework.TestCase.runBare(TestCase.java)
	at junit.framework.TestResult$1.protect(TestResult.java)
	at junit.framework.TestResult.runProtected(TestResult.java)
	at junit.framework.TestResult.run(TestResult.java:109)
	at junit.framework.TestCase.run(TestCase.java:120)
	at junit.framework.TestSuite.runTest(TestSuite.java:230)
	at junit.framework.TestSuite.run(TestSuite.java)
	at org.apache.tools.ant.taskdefs.optional.junit.JUnitTestRunner.run(JUnitTestRunner.java)
	at org.apache.tools.ant.taskdefs.optional.junit.JUnitTestRunner.launch(JUnitTestRunner.java:672)
	at org.apache.tools.ant.taskdefs.optional.junit.JUnitTestRunner.main(JUnitTestRunner.java:546)
Test: testGetDeclaredAnnotationsImmutableClass: java.lang.reflect.Ctor5Testjava.lang.AssertionError
	at java.lang.reflect.Proxy.getProxyClass(Proxy.java:169)
	at java.lang.reflect.Proxy.newProxyInstance(Proxy.java:201)
	at org.apache.harmony.lang.annotation.AnnotationFactory.createAnnotation(AnnotationFactory.java:101)
	at org.apache.harmony.vm.VMGenericsAndAnnotations.getDeclaredAnnotations(VMGenericsAndAnnotations.java)
	at java.lang.reflect.Constructor$ConstructorData.getDeclaredAnnotations(Constructor.java:377)
	at java.lang.reflect.Constructor.getDeclaredAnnotations(Constructor.java:63)
	at org.apache.harmony.lang.AnnotatedElementTestFrame.testGetDeclaredAnnotationsImmutable(AnnotatedElementTestFrame.java)
	at java.lang.reflect.VMReflection.invokeMethod(VMReflection.java)
	at java.lang.reflect.Method.invoke(Method.java:317)
	at junit.framework.TestCase.runTest(TestCase.java:164)
	at junit.framework.TestCase.runBare(TestCase.java)
	at junit.framework.TestResult$1.protect(TestResult.java)
	at junit.framework.TestResult.runProtected(TestResult.java)
	at junit.framework.TestResult.run(TestResult.java:109)
	at junit.framework.TestCase.run(TestCase.java:120)
	at junit.framework.TestSuite.runTest(TestSuite.java:230)
	at junit.framework.TestSuite.run(TestSuite.java)
	at org.apache.tools.ant.taskdefs.optional.junit.JUnitTestRunner.run(JUnitTestRunner.java)
	at org.apache.tools.ant.taskdefs.optional.junit.JUnitTestRunner.launch(JUnitTestRunner.java:672)
	at org.apache.tools.ant.taskdefs.optional.junit.JUnitTestRunner.main(JUnitTestRunner.java:546)
Test: testGetAnnotationsClass: java.lang.reflect.Ctor5Testjava.lang.AssertionError
	at java.lang.reflect.Proxy.getProxyClass(Proxy.java:169)
	at java.lang.reflect.Proxy.newProxyInstance(Proxy.java:201)
	at org.apache.harmony.lang.annotation.AnnotationFactory.createAnnotation(AnnotationFactory.java:101)
	at org.apache.harmony.vm.VMGenericsAndAnnotations.getDeclaredAnnotations(VMGenericsAndAnnotations.java)
	at java.lang.reflect.Constructor$ConstructorData.getDeclaredAnnotations(Constructor.java:377)
	at java.lang.reflect.Constructor.getDeclaredAnnotations(Constructor.java:63)
	at java.lang.reflect.AccessibleObject.getAnnotations(AccessibleObject.java)
	at org.apache.harmony.lang.AnnotatedElementTestFrame.testGetAnnotations(AnnotatedElementTestFrame.java)
	at java.lang.reflect.VMReflection.invokeMethod(VMReflection.java)
	at java.lang.reflect.Method.invoke(Method.java:317)
	at junit.framework.TestCase.runTest(TestCase.java:164)
	at junit.framework.TestCase.runBare(TestCase.java)
	at junit.framework.TestResult$1.protect(TestResult.java)
	at junit.framework.TestResult.runProtected(TestResult.java)
	at junit.framework.TestResult.run(TestResult.java:109)
	at junit.framework.TestCase.run(TestCase.java:120)
	at junit.framework.TestSuite.runTest(TestSuite.java:230)
	at junit.framework.TestSuite.run(TestSuite.java)
	at org.apache.tools.ant.taskdefs.optional.junit.JUnitTestRunner.run(JUnitTestRunner.java)
	at org.apache.tools.ant.taskdefs.optional.junit.JUnitTestRunner.launch(JUnitTestRunner.java:672)
	at org.apache.tools.ant.taskdefs.optional.junit.JUnitTestRunner.main(JUnitTestRunner.java:546)
Test: testGetAnnotations2Class: java.lang.reflect.Ctor5Testjava.lang.AssertionError
	at java.lang.reflect.Proxy.getProxyClass(Proxy.java:169)
	at java.lang.reflect.Proxy.newProxyInstance(Proxy.java:201)
	at org.apache.harmony.lang.annotation.AnnotationFactory.createAnnotation(AnnotationFactory.java:101)
	at org.apache.harmony.vm.VMGenericsAndAnnotations.getDeclaredAnnotations(VMGenericsAndAnnotations.java)
	at java.lang.reflect.Constructor$ConstructorData.getDeclaredAnnotations(Constructor.java:377)
	at java.lang.reflect.Constructor.getDeclaredAnnotations(Constructor.java:63)
	at java.lang.reflect.AccessibleObject.getAnnotations(AccessibleObject.java)
	at org.apache.harmony.lang.AnnotatedElementTestFrame.testGetAnnotations2(AnnotatedElementTestFrame.java)
	at java.lang.reflect.VMReflection.invokeMethod(VMReflection.java)
	at java.lang.reflect.Method.invoke(Method.java:317)
	at junit.framework.TestCase.runTest(TestCase.java:164)
	at junit.framework.TestCase.runBare(TestCase.java)
	at junit.framework.TestResult$1.protect(TestResult.java)
	at junit.framework.TestResult.runProtected(TestResult.java)
	at junit.framework.TestResult.run(TestResult.java:109)
	at junit.framework.TestCase.run(TestCase.java:120)
	at junit.framework.TestSuite.runTest(TestSuite.java:230)
	at junit.framework.TestSuite.run(TestSuite.java)
	at org.apache.tools.ant.taskdefs.optional.junit.JUnitTestRunner.run(JUnitTestRunner.java)
	at org.apache.tools.ant.taskdefs.optional.junit.JUnitTestRunner.launch(JUnitTestRunner.java:672)
	at org.apache.tools.ant.taskdefs.optional.junit.JUnitTestRunner.main(JUnitTestRunner.java:546)
Test: testGetAnnotations5Class: java.lang.reflect.Ctor5Testjava.lang.AssertionError
	at java.lang.reflect.Proxy.getProxyClass(Proxy.java:169)
	at java.lang.reflect.Proxy.newProxyInstance(Proxy.java:201)
	at org.apache.harmony.lang.annotation.AnnotationFactory.createAnnotation(AnnotationFactory.java:101)
	at org.apache.harmony.vm.VMGenericsAndAnnotations.getDeclaredAnnotations(VMGenericsAndAnnotations.java)
	at java.lang.reflect.Constructor$ConstructorData.getDeclaredAnnotations(Constructor.java:377)
	at java.lang.reflect.Constructor.getDeclaredAnnotations(Constructor.java:63)
	at java.lang.reflect.AccessibleObject.getAnnotations(AccessibleObject.java)
	at org.apache.harmony.lang.AnnotatedElementTestFrame.testGetAnnotations5(AnnotatedElementTestFrame.java)
	at java.lang.reflect.VMReflection.invokeMethod(VMReflection.java)
	at java.lang.reflect.Method.invoke(Method.java:317)
	at junit.framework.TestCase.runTest(TestCase.java:164)
	at junit.framework.TestCase.runBare(TestCase.java)
	at junit.framework.TestResult$1.protect(TestResult.java)
	at junit.framework.TestResult.runProtected(TestResult.java)
	at junit.framework.TestResult.run(TestResult.java:109)
	at junit.framework.TestCase.run(TestCase.java:120)
	at junit.framework.TestSuite.runTest(TestSuite.java:230)
	at junit.framework.TestSuite.run(TestSuite.java)
	at org.apache.tools.ant.taskdefs.optional.junit.JUnitTestRunner.run(JUnitTestRunner.java)
	at org.apache.tools.ant.taskdefs.optional.junit.JUnitTestRunner.launch(JUnitTestRunner.java:672)
	at org.apache.tools.ant.taskdefs.optional.junit.JUnitTestRunner.main(JUnitTestRunner.java:546)
Test: testGetAnnotationsImmutableClass: java.lang.reflect.Ctor5Testjava.lang.AssertionError
	at java.lang.reflect.Proxy.getProxyClass(Proxy.java:169)
	at java.lang.reflect.Proxy.newProxyInstance(Proxy.java:201)
	at org.apache.harmony.lang.annotation.AnnotationFactory.createAnnotation(AnnotationFactory.java:101)
	at org.apache.harmony.vm.VMGenericsAndAnnotations.getDeclaredAnnotations(VMGenericsAndAnnotations.java)
	at java.lang.reflect.Constructor$ConstructorData.getDeclaredAnnotations(Constructor.java:377)
	at java.lang.reflect.Constructor.getDeclaredAnnotations(Constructor.java:63)
	at java.lang.reflect.AccessibleObject.getAnnotations(AccessibleObject.java)
	at org.apache.harmony.lang.AnnotatedElementTestFrame.testGetAnnotationsImmutable(AnnotatedElementTestFrame.java)
	at java.lang.reflect.VMReflection.invokeMethod(VMReflection.java)
	at java.lang.reflect.Method.invoke(Method.java:317)
	at junit.framework.TestCase.runTest(TestCase.java:164)
	at junit.framework.TestCase.runBare(TestCase.java)
	at junit.framework.TestResult$1.protect(TestResult.java)
	at junit.framework.TestResult.runProtected(TestResult.java)
	at junit.framework.TestResult.run(TestResult.java:109)
	at junit.framework.TestCase.run(TestCase.java:120)
	at junit.framework.TestSuite.runTest(TestSuite.java:230)
	at junit.framework.TestSuite.run(TestSuite.java)
	at org.apache.tools.ant.taskdefs.optional.junit.JUnitTestRunner.run(JUnitTestRunner.java)
	at org.apache.tools.ant.taskdefs.optional.junit.JUnitTestRunner.launch(JUnitTestRunner.java:672)
	at org.apache.tools.ant.taskdefs.optional.junit.JUnitTestRunner.main(JUnitTestRunner.java:546)
Test: testIsAnnotationPresentClass: java.lang.reflect.Ctor5Testjava.lang.AssertionError
	at java.lang.reflect.Proxy.getProxyClass(Proxy.java:169)
	at java.lang.reflect.Proxy.newProxyInstance(Proxy.java:201)
	at org.apache.harmony.lang.annotation.AnnotationFactory.createAnnotation(AnnotationFactory.java:101)
	at org.apache.harmony.vm.VMGenericsAndAnnotations.getDeclaredAnnotations(VMGenericsAndAnnotations.java)
	at java.lang.reflect.Constructor$ConstructorData.getDeclaredAnnotations(Constructor.java:377)
	at java.lang.reflect.Constructor.getAnnotation(Constructor.java:77)
	at java.lang.reflect.AccessibleObject.isAnnotationPresent(AccessibleObject.java)
	at org.apache.harmony.lang.AnnotatedElementTestFrame.testIsAnnotationPresent(AnnotatedElementTestFrame.java)
	at java.lang.reflect.VMReflection.invokeMethod(VMReflection.java)
	at java.lang.reflect.Method.invoke(Method.java:317)
	at junit.framework.TestCase.runTest(TestCase.java:164)
	at junit.framework.TestCase.runBare(TestCase.java)
	at junit.framework.TestResult$1.protect(TestResult.java)
	at junit.framework.TestResult.runProtected(TestResult.java)
	at junit.framework.TestResult.run(TestResult.java:109)
	at junit.framework.TestCase.run(TestCase.java:120)
	at junit.framework.TestSuite.runTest(TestSuite.java:230)
	at junit.framework.TestSuite.run(TestSuite.java)
	at org.apache.tools.ant.taskdefs.optional.junit.JUnitTestRunner.run(JUnitTestRunner.java)
	at org.apache.tools.ant.taskdefs.optional.junit.JUnitTestRunner.launch(JUnitTestRunner.java:672)
	at org.apache.tools.ant.taskdefs.optional.junit.JUnitTestRunner.main(JUnitTestRunner.java:546)
Test: testIsAnnotationPresent_NegativeClass: java.lang.reflect.Ctor5Testjava.lang.AssertionError
	at java.lang.reflect.Proxy.getProxyClass(Proxy.java:169)
	at java.lang.reflect.Proxy.newProxyInstance(Proxy.java:201)
	at org.apache.harmony.lang.annotation.AnnotationFactory.createAnnotation(AnnotationFactory.java:101)
	at org.apache.harmony.vm.VMGenericsAndAnnotations.getDeclaredAnnotations(VMGenericsAndAnnotations.java)
	at java.lang.reflect.Constructor$ConstructorData.getDeclaredAnnotations(Constructor.java:377)
	at java.lang.reflect.Constructor.getAnnotation(Constructor.java:77)
	at java.lang.reflect.AccessibleObject.isAnnotationPresent(AccessibleObject.java)
	at org.apache.harmony.lang.AnnotatedElementTestFrame.testIsAnnotationPresent_Negative(AnnotatedElementTestFrame.java)
	at java.lang.reflect.VMReflection.invokeMethod(VMReflection.java)
	at java.lang.reflect.Method.invoke(Method.java:317)
	at junit.framework.TestCase.runTest(TestCase.java:164)
	at junit.framework.TestCase.runBare(TestCase.java)
	at junit.framework.TestResult$1.protect(TestResult.java)
	at junit.framework.TestResult.runProtected(TestResult.java)
	at junit.framework.TestResult.run(TestResult.java:109)
	at junit.framework.TestCase.run(TestCase.java:120)
	at junit.framework.TestSuite.runTest(TestSuite.java:230)
	at junit.framework.TestSuite.run(TestSuite.java)
	at org.apache.tools.ant.taskdefs.optional.junit.JUnitTestRunner.run(JUnitTestRunner.java)
	at org.apache.tools.ant.taskdefs.optional.junit.JUnitTestRunner.launch(JUnitTestRunner.java:672)
	at org.apache.tools.ant.taskdefs.optional.junit.JUnitTestRunner.main(JUnitTestRunner.java:546)
Test: testGetAnnotationClass: java.lang.reflect.Field5Testjava.lang.AssertionError
	at java.lang.reflect.Proxy.getProxyClass(Proxy.java:169)
	at java.lang.reflect.Proxy.newProxyInstance(Proxy.java:201)
	at org.apache.harmony.lang.annotation.AnnotationFactory.createAnnotation(AnnotationFactory.java:101)
	at org.apache.harmony.vm.VMGenericsAndAnnotations.getDeclaredAnnotations(VMGenericsAndAnnotations.java)
	at java.lang.reflect.Field$FieldData.getAnnotations(Field.java:458)
	at java.lang.reflect.Field.getAnnotation(Field.java:56)
	at org.apache.harmony.lang.AnnotatedElementTestFrame.testGetAnnotation(AnnotatedElementTestFrame.java)
	at java.lang.reflect.VMReflection.invokeMethod(VMReflection.java)
	at java.lang.reflect.Method.invoke(Method.java:317)
	at junit.framework.TestCase.runTest(TestCase.java:164)
	at junit.framework.TestCase.runBare(TestCase.java)
	at junit.framework.TestResult$1.protect(TestResult.java)
	at junit.framework.TestResult.runProtected(TestResult.java)
	at junit.framework.TestResult.run(TestResult.java:109)
	at junit.framework.TestCase.run(TestCase.java:120)
	at junit.framework.TestSuite.runTest(TestSuite.java:230)
	at junit.framework.TestSuite.run(TestSuite.java)
	at org.apache.tools.ant.taskdefs.optional.junit.JUnitTestRunner.run(JUnitTestRunner.java)
	at org.apache.tools.ant.taskdefs.optional.junit.JUnitTestRunner.launch(JUnitTestRunner.java:672)
	at org.apache.tools.ant.taskdefs.optional.junit.JUnitTestRunner.main(JUnitTestRunner.java:546)
Test: testGetAnnotation2Class: java.lang.reflect.Field5Testjava.lang.AssertionError
	at java.lang.reflect.Proxy.getProxyClass(Proxy.java:169)
	at java.lang.reflect.Proxy.newProxyInstance(Proxy.java:201)
	at org.apache.harmony.lang.annotation.AnnotationFactory.createAnnotation(AnnotationFactory.java:101)
	at org.apache.harmony.vm.VMGenericsAndAnnotations.getDeclaredAnnotations(VMGenericsAndAnnotations.java)
	at java.lang.reflect.Field$FieldData.getAnnotations(Field.java:458)
	at java.lang.reflect.Field.getAnnotation(Field.java:56)
	at org.apache.harmony.lang.AnnotatedElementTestFrame.testGetAnnotation2(AnnotatedElementTestFrame.java)
	at java.lang.reflect.VMReflection.invokeMethod(VMReflection.java)
	at java.lang.reflect.Method.invoke(Method.java:317)
	at junit.framework.TestCase.runTest(TestCase.java:164)
	at junit.framework.TestCase.runBare(TestCase.java)
	at junit.framework.TestResult$1.protect(TestResult.java)
	at junit.framework.TestResult.runProtected(TestResult.java)
	at junit.framework.TestResult.run(TestResult.java:109)
	at junit.framework.TestCase.run(TestCase.java:120)
	at junit.framework.TestSuite.runTest(TestSuite.java:230)
	at junit.framework.TestSuite.run(TestSuite.java)
	at org.apache.tools.ant.taskdefs.optional.junit.JUnitTestRunner.run(JUnitTestRunner.java)
	at org.apache.tools.ant.taskdefs.optional.junit.JUnitTestRunner.launch(JUnitTestRunner.java:672)
	at org.apache.tools.ant.taskdefs.optional.junit.JUnitTestRunner.main(JUnitTestRunner.java:546)
Test: testGetAnnotation_NegativeClass: java.lang.reflect.Field5Testjava.lang.AssertionError
	at java.lang.reflect.Proxy.getProxyClass(Proxy.java:169)
	at java.lang.reflect.Proxy.newProxyInstance(Proxy.java:201)
	at org.apache.harmony.lang.annotation.AnnotationFactory.createAnnotation(AnnotationFactory.java:101)
	at org.apache.harmony.vm.VMGenericsAndAnnotations.getDeclaredAnnotations(VMGenericsAndAnnotations.java)
	at java.lang.reflect.Field$FieldData.getAnnotations(Field.java:458)
	at java.lang.reflect.Field.getAnnotation(Field.java:56)
	at org.apache.harmony.lang.AnnotatedElementTestFrame.testGetAnnotation_Negative(AnnotatedElementTestFrame.java)
	at java.lang.reflect.VMReflection.invokeMethod(VMReflection.java)
	at java.lang.reflect.Method.invoke(Method.java:317)
	at junit.framework.TestCase.runTest(TestCase.java:164)
	at junit.framework.TestCase.runBare(TestCase.java)
	at junit.framework.TestResult$1.protect(TestResult.java)
	at junit.framework.TestResult.runProtected(TestResult.java)
	at junit.framework.TestResult.run(TestResult.java:109)
	at junit.framework.TestCase.run(TestCase.java:120)
	at junit.framework.TestSuite.runTest(TestSuite.java:230)
	at junit.framework.TestSuite.run(TestSuite.java)
	at org.apache.tools.ant.taskdefs.optional.junit.JUnitTestRunner.run(JUnitTestRunner.java)
	at org.apache.tools.ant.taskdefs.optional.junit.JUnitTestRunner.launch(JUnitTestRunner.java:672)
	at org.apache.tools.ant.taskdefs.optional.junit.JUnitTestRunner.main(JUnitTestRunner.java:546)
Test: testGetDeclaredAnnotationsClass: java.lang.reflect.Field5Testjava.lang.AssertionError
	at java.lang.reflect.Proxy.getProxyClass(Proxy.java:169)
	at java.lang.reflect.Proxy.newProxyInstance(Proxy.java:201)
	at org.apache.harmony.lang.annotation.AnnotationFactory.createAnnotation(AnnotationFactory.java:101)
	at org.apache.harmony.vm.VMGenericsAndAnnotations.getDeclaredAnnotations(VMGenericsAndAnnotations.java)
	at java.lang.reflect.Field$FieldData.getAnnotations(Field.java:458)
	at java.lang.reflect.Field.getDeclaredAnnotations(Field.java:42)
	at org.apache.harmony.lang.AnnotatedElementTestFrame.testGetDeclaredAnnotations(AnnotatedElementTestFrame.java)
	at java.lang.reflect.VMReflection.invokeMethod(VMReflection.java)
	at java.lang.reflect.Method.invoke(Method.java:317)
	at junit.framework.TestCase.runTest(TestCase.java:164)
	at junit.framework.TestCase.runBare(TestCase.java)
	at junit.framework.TestResult$1.protect(TestResult.java)
	at junit.framework.TestResult.runProtected(TestResult.java)
	at junit.framework.TestResult.run(TestResult.java:109)
	at junit.framework.TestCase.run(TestCase.java:120)
	at junit.framework.TestSuite.runTest(TestSuite.java:230)
	at junit.framework.TestSuite.run(TestSuite.java)
	at org.apache.tools.ant.taskdefs.optional.junit.JUnitTestRunner.run(JUnitTestRunner.java)
	at org.apache.tools.ant.taskdefs.optional.junit.JUnitTestRunner.launch(JUnitTestRunner.java:672)
	at org.apache.tools.ant.taskdefs.optional.junit.JUnitTestRunner.main(JUnitTestRunner.java:546)
Test: testGetDeclaredAnnotations2Class: java.lang.reflect.Field5Testjava.lang.AssertionError
	at java.lang.reflect.Proxy.getProxyClass(Proxy.java:169)
	at java.lang.reflect.Proxy.newProxyInstance(Proxy.java:201)
	at org.apache.harmony.lang.annotation.AnnotationFactory.createAnnotation(AnnotationFactory.java:101)
	at org.apache.harmony.vm.VMGenericsAndAnnotations.getDeclaredAnnotations(VMGenericsAndAnnotations.java)
	at java.lang.reflect.Field$FieldData.getAnnotations(Field.java:458)
	at java.lang.reflect.Field.getDeclaredAnnotations(Field.java:42)
	at org.apache.harmony.lang.AnnotatedElementTestFrame.testGetDeclaredAnnotations2(AnnotatedElementTestFrame.java)
	at java.lang.reflect.VMReflection.invokeMethod(VMReflection.java)
	at java.lang.reflect.Method.invoke(Method.java:317)
	at junit.framework.TestCase.runTest(TestCase.java:164)
	at junit.framework.TestCase.runBare(TestCase.java)
	at junit.framework.TestResult$1.protect(TestResult.java)
	at junit.framework.TestResult.runProtected(TestResult.java)
	at junit.framework.TestResult.run(TestResult.java:109)
	at junit.framework.TestCase.run(TestCase.java:120)
	at junit.framework.TestSuite.runTest(TestSuite.java:230)
	at junit.framework.TestSuite.run(TestSuite.java)
	at org.apache.tools.ant.taskdefs.optional.junit.JUnitTestRunner.run(JUnitTestRunner.java)
	at org.apache.tools.ant.taskdefs.optional.junit.JUnitTestRunner.launch(JUnitTestRunner.java:672)
	at org.apache.tools.ant.taskdefs.optional.junit.JUnitTestRunner.main(JUnitTestRunner.java:546)
Test: testGetDeclaredAnnotationsImmutableClass: java.lang.reflect.Field5Testjava.lang.AssertionError
	at java.lang.reflect.Proxy.getProxyClass(Proxy.java:169)
	at java.lang.reflect.Proxy.newProxyInstance(Proxy.java:201)
	at org.apache.harmony.lang.annotation.AnnotationFactory.createAnnotation(AnnotationFactory.java:101)
	at org.apache.harmony.vm.VMGenericsAndAnnotations.getDeclaredAnnotations(VMGenericsAndAnnotations.java)
	at java.lang.reflect.Field$FieldData.getAnnotations(Field.java:458)
	at java.lang.reflect.Field.getDeclaredAnnotations(Field.java:42)
	at org.apache.harmony.lang.AnnotatedElementTestFrame.testGetDeclaredAnnotationsImmutable(AnnotatedElementTestFrame.java)
	at java.lang.reflect.VMReflection.invokeMethod(VMReflection.java)
	at java.lang.reflect.Method.invoke(Method.java:317)
	at junit.framework.TestCase.runTest(TestCase.java:164)
	at junit.framework.TestCase.runBare(TestCase.java)
	at junit.framework.TestResult$1.protect(TestResult.java)
	at junit.framework.TestResult.runProtected(TestResult.java)
	at junit.framework.TestResult.run(TestResult.java:109)
	at junit.framework.TestCase.run(TestCase.java:120)
	at junit.framework.TestSuite.runTest(TestSuite.java:230)
	at junit.framework.TestSuite.run(TestSuite.java)
	at org.apache.tools.ant.taskdefs.optional.junit.JUnitTestRunner.run(JUnitTestRunner.java)
	at org.apache.tools.ant.taskdefs.optional.junit.JUnitTestRunner.launch(JUnitTestRunner.java:672)
	at org.apache.tools.ant.taskdefs.optional.junit.JUnitTestRunner.main(JUnitTestRunner.java:546)
Test: testGetAnnotationsClass: java.lang.reflect.Field5Testjava.lang.AssertionError
	at java.lang.reflect.Proxy.getProxyClass(Proxy.java:169)
	at java.lang.reflect.Proxy.newProxyInstance(Proxy.java:201)
	at org.apache.harmony.lang.annotation.AnnotationFactory.createAnnotation(AnnotationFactory.java:101)
	at org.apache.harmony.vm.VMGenericsAndAnnotations.getDeclaredAnnotations(VMGenericsAndAnnotations.java)
	at java.lang.reflect.Field$FieldData.getAnnotations(Field.java:458)
	at java.lang.reflect.Field.getDeclaredAnnotations(Field.java:42)
	at java.lang.reflect.AccessibleObject.getAnnotations(AccessibleObject.java)
	at org.apache.harmony.lang.AnnotatedElementTestFrame.testGetAnnotations(AnnotatedElementTestFrame.java)
	at java.lang.reflect.VMReflection.invokeMethod(VMReflection.java)
	at java.lang.reflect.Method.invoke(Method.java:317)
	at junit.framework.TestCase.runTest(TestCase.java:164)
	at junit.framework.TestCase.runBare(TestCase.java)
	at junit.framework.TestResult$1.protect(TestResult.java)
	at junit.framework.TestResult.runProtected(TestResult.java)
	at junit.framework.TestResult.run(TestResult.java:109)
	at junit.framework.TestCase.run(TestCase.java:120)
	at junit.framework.TestSuite.runTest(TestSuite.java:230)
	at junit.framework.TestSuite.run(TestSuite.java)
	at org.apache.tools.ant.taskdefs.optional.junit.JUnitTestRunner.run(JUnitTestRunner.java)
	at org.apache.tools.ant.taskdefs.optional.junit.JUnitTestRunner.launch(JUnitTestRunner.java:672)
	at org.apache.tools.ant.taskdefs.optional.junit.JUnitTestRunner.main(JUnitTestRunner.java:546)
Test: testGetAnnotations2Class: java.lang.reflect.Field5Testjava.lang.AssertionError
	at java.lang.reflect.Proxy.getProxyClass(Proxy.java:169)
	at java.lang.reflect.Proxy.newProxyInstance(Proxy.java:201)
	at org.apache.harmony.lang.annotation.AnnotationFactory.createAnnotation(AnnotationFactory.java:101)
	at org.apache.harmony.vm.VMGenericsAndAnnotations.getDeclaredAnnotations(VMGenericsAndAnnotations.java)
	at java.lang.reflect.Field$FieldData.getAnnotations(Field.java:458)
	at java.lang.reflect.Field.getDeclaredAnnotations(Field.java:42)
	at java.lang.reflect.AccessibleObject.getAnnotations(AccessibleObject.java)
	at org.apache.harmony.lang.AnnotatedElementTestFrame.testGetAnnotations2(AnnotatedElementTestFrame.java)
	at java.lang.reflect.VMReflection.invokeMethod(VMReflection.java)
	at java.lang.reflect.Method.invoke(Method.java:317)
	at junit.framework.TestCase.runTest(TestCase.java:164)
	at junit.framework.TestCase.runBare(TestCase.java)
	at junit.framework.TestResult$1.protect(TestResult.java)
	at junit.framework.TestResult.runProtected(TestResult.java)
	at junit.framework.TestResult.run(TestResult.java:109)
	at junit.framework.TestCase.run(TestCase.java:120)
	at junit.framework.TestSuite.runTest(TestSuite.java:230)
	at junit.framework.TestSuite.run(TestSuite.java)
	at org.apache.tools.ant.taskdefs.optional.junit.JUnitTestRunner.run(JUnitTestRunner.java)
	at org.apache.tools.ant.taskdefs.optional.junit.JUnitTestRunner.launch(JUnitTestRunner.java:672)
	at org.apache.tools.ant.taskdefs.optional.junit.JUnitTestRunner.main(JUnitTestRunner.java:546)
Test: testGetAnnotations5Class: java.lang.reflect.Field5Testjava.lang.AssertionError
	at java.lang.reflect.Proxy.getProxyClass(Proxy.java:169)
	at java.lang.reflect.Proxy.newProxyInstance(Proxy.java:201)
	at org.apache.harmony.lang.annotation.AnnotationFactory.createAnnotation(AnnotationFactory.java:101)
	at org.apache.harmony.vm.VMGenericsAndAnnotations.getDeclaredAnnotations(VMGenericsAndAnnotations.java)
	at java.lang.reflect.Field$FieldData.getAnnotations(Field.java:458)
	at java.lang.reflect.Field.getDeclaredAnnotations(Field.java:42)
	at java.lang.reflect.AccessibleObject.getAnnotations(AccessibleObject.java)
	at org.apache.harmony.lang.AnnotatedElementTestFrame.testGetAnnotations5(AnnotatedElementTestFrame.java)
	at java.lang.reflect.VMReflection.invokeMethod(VMReflection.java)
	at java.lang.reflect.Method.invoke(Method.java:317)
	at junit.framework.TestCase.runTest(TestCase.java:164)
	at junit.framework.TestCase.runBare(TestCase.java)
	at junit.framework.TestResult$1.protect(TestResult.java)
	at junit.framework.TestResult.runProtected(TestResult.java)
	at junit.framework.TestResult.run(TestResult.java:109)
	at junit.framework.TestCase.run(TestCase.java:120)
	at junit.framework.TestSuite.runTest(TestSuite.java:230)
	at junit.framework.TestSuite.run(TestSuite.java)
	at org.apache.tools.ant.taskdefs.optional.junit.JUnitTestRunner.run(JUnitTestRunner.java)
	at org.apache.tools.ant.taskdefs.optional.junit.JUnitTestRunner.launch(JUnitTestRunner.java:672)
	at org.apache.tools.ant.taskdefs.optional.junit.JUnitTestRunner.main(JUnitTestRunner.java:546)
Test: testGetAnnotationsImmutableClass: java.lang.reflect.Field5Testjava.lang.AssertionError
	at java.lang.reflect.Proxy.getProxyClass(Proxy.java:169)
	at java.lang.reflect.Proxy.newProxyInstance(Proxy.java:201)
	at org.apache.harmony.lang.annotation.AnnotationFactory.createAnnotation(AnnotationFactory.java:101)
	at org.apache.harmony.vm.VMGenericsAndAnnotations.getDeclaredAnnotations(VMGenericsAndAnnotations.java)
	at java.lang.reflect.Field$FieldData.getAnnotations(Field.java:458)
	at java.lang.reflect.Field.getDeclaredAnnotations(Field.java:42)
	at java.lang.reflect.AccessibleObject.getAnnotations(AccessibleObject.java)
	at org.apache.harmony.lang.AnnotatedElementTestFrame.testGetAnnotationsImmutable(AnnotatedElementTestFrame.java)
	at java.lang.reflect.VMReflection.invokeMethod(VMReflection.java)
	at java.lang.reflect.Method.invoke(Method.java:317)
	at junit.framework.TestCase.runTest(TestCase.java:164)
	at junit.framework.TestCase.runBare(TestCase.java)
	at junit.framework.TestResult$1.protect(TestResult.java)
	at junit.framework.TestResult.runProtected(TestResult.java)
	at junit.framework.TestResult.run(TestResult.java:109)
	at junit.framework.TestCase.run(TestCase.java:120)
	at junit.framework.TestSuite.runTest(TestSuite.java:230)
	at junit.framework.TestSuite.run(TestSuite.java)
	at org.apache.tools.ant.taskdefs.optional.junit.JUnitTestRunner.run(JUnitTestRunner.java)
	at org.apache.tools.ant.taskdefs.optional.junit.JUnitTestRunner.launch(JUnitTestRunner.java:672)
	at org.apache.tools.ant.taskdefs.optional.junit.JUnitTestRunner.main(JUnitTestRunner.java:546)
Test: testIsAnnotationPresentClass: java.lang.reflect.Field5Testjava.lang.AssertionError
	at java.lang.reflect.Proxy.getProxyClass(Proxy.java:169)
	at java.lang.reflect.Proxy.newProxyInstance(Proxy.java:201)
	at org.apache.harmony.lang.annotation.AnnotationFactory.createAnnotation(AnnotationFactory.java:101)
	at org.apache.harmony.vm.VMGenericsAndAnnotations.getDeclaredAnnotations(VMGenericsAndAnnotations.java)
	at java.lang.reflect.Field$FieldData.getAnnotations(Field.java:458)
	at java.lang.reflect.Field.getAnnotation(Field.java:56)
	at java.lang.reflect.AccessibleObject.isAnnotationPresent(AccessibleObject.java)
	at org.apache.harmony.lang.AnnotatedElementTestFrame.testIsAnnotationPresent(AnnotatedElementTestFrame.java)
	at java.lang.reflect.VMReflection.invokeMethod(VMReflection.java)
	at java.lang.reflect.Method.invoke(Method.java:317)
	at junit.framework.TestCase.runTest(TestCase.java:164)
	at junit.framework.TestCase.runBare(TestCase.java)
	at junit.framework.TestResult$1.protect(TestResult.java)
	at junit.framework.TestResult.runProtected(TestResult.java)
	at junit.framework.TestResult.run(TestResult.java:109)
	at junit.framework.TestCase.run(TestCase.java:120)
	at junit.framework.TestSuite.runTest(TestSuite.java:230)
	at junit.framework.TestSuite.run(TestSuite.java)
	at org.apache.tools.ant.taskdefs.optional.junit.JUnitTestRunner.run(JUnitTestRunner.java)
	at org.apache.tools.ant.taskdefs.optional.junit.JUnitTestRunner.launch(JUnitTestRunner.java:672)
	at org.apache.tools.ant.taskdefs.optional.junit.JUnitTestRunner.main(JUnitTestRunner.java:546)
Test: testIsAnnotationPresent_NegativeClass: java.lang.reflect.Field5Testjava.lang.AssertionError
	at java.lang.reflect.Proxy.getProxyClass(Proxy.java:169)
	at java.lang.reflect.Proxy.newProxyInstance(Proxy.java:201)
	at org.apache.harmony.lang.annotation.AnnotationFactory.createAnnotation(AnnotationFactory.java:101)
	at org.apache.harmony.vm.VMGenericsAndAnnotations.getDeclaredAnnotations(VMGenericsAndAnnotations.java)
	at java.lang.reflect.Field$FieldData.getAnnotations(Field.java:458)
	at java.lang.reflect.Field.getAnnotation(Field.java:56)
	at java.lang.reflect.AccessibleObject.isAnnotationPresent(AccessibleObject.java)
	at org.apache.harmony.lang.AnnotatedElementTestFrame.testIsAnnotationPresent_Negative(AnnotatedElementTestFrame.java)
	at java.lang.reflect.VMReflection.invokeMethod(VMReflection.java)
	at java.lang.reflect.Method.invoke(Method.java:317)
	at junit.framework.TestCase.runTest(TestCase.java:164)
	at junit.framework.TestCase.runBare(TestCase.java)
	at junit.framework.TestResult$1.protect(TestResult.java)
	at junit.framework.TestResult.runProtected(TestResult.java)
	at junit.framework.TestResult.run(TestResult.java:109)
	at junit.framework.TestCase.run(TestCase.java:120)
	at junit.framework.TestSuite.runTest(TestSuite.java:230)
	at junit.framework.TestSuite.run(TestSuite.java)
	at org.apache.tools.ant.taskdefs.optional.junit.JUnitTestRunner.run(JUnitTestRunner.java)
	at org.apache.tools.ant.taskdefs.optional.junit.JUnitTestRunner.launch(JUnitTestRunner.java:672)
	at org.apache.tools.ant.taskdefs.optional.junit.JUnitTestRunner.main(JUnitTestRunner.java:546)
Test: testGetParameterAnnotations2Class: java.lang.reflect.Method5Testjava.lang.reflect.InvocationTargetException
	at java.lang.reflect.VMReflection.invokeMethod(VMReflection.java)
	at java.lang.reflect.Method.invoke(Method.java:317)
	at java.lang.reflect.Method5Test.getParamAnnotations(Method5Test.java:81)
	at java.lang.reflect.Method5Test.testGetParameterAnnotations2(Method5Test.java:113)
	at java.lang.reflect.VMReflection.invokeMethod(VMReflection.java)
	at java.lang.reflect.Method.invoke(Method.java:317)
	at junit.framework.TestCase.runTest(TestCase.java:164)
	at junit.framework.TestCase.runBare(TestCase.java)
	at junit.framework.TestResult$1.protect(TestResult.java)
	at junit.framework.TestResult.runProtected(TestResult.java)
	at junit.framework.TestResult.run(TestResult.java:109)
	at junit.framework.TestCase.run(TestCase.java:120)
	at junit.framework.TestSuite.runTest(TestSuite.java:230)
	at junit.framework.TestSuite.run(TestSuite.java)
	at org.apache.tools.ant.taskdefs.optional.junit.JUnitTestRunner.run(JUnitTestRunner.java)
	at org.apache.tools.ant.taskdefs.optional.junit.JUnitTestRunner.launch(JUnitTestRunner.java:672)
	at org.apache.tools.ant.taskdefs.optional.junit.JUnitTestRunner.main(JUnitTestRunner.java:546)
Caused by: java.lang.AssertionError
	at java.lang.reflect.Proxy.getProxyClass(Proxy.java:169)
	at java.lang.reflect.Proxy.newProxyInstance(Proxy.java:201)
	at org.apache.harmony.lang.annotation.AnnotationFactory.createAnnotation(AnnotationFactory.java:101)
	at org.apache.harmony.vm.VMGenericsAndAnnotations.getParameterAnnotations(VMGenericsAndAnnotations.java)
	at java.lang.reflect.Method$MethodData.getParameterAnnotations(Method.java:444)
	at java.lang.reflect.Method.getParameterAnnotations(Method.java:58)
	at java.lang.reflect.VMReflection.invokeMethod(VMReflection.java)
	... 16 more
Test: testGetParameterAnnotations3Class: java.lang.reflect.Method5Testjava.lang.reflect.InvocationTargetException
	at java.lang.reflect.VMReflection.invokeMethod(VMReflection.java)
	at java.lang.reflect.Method.invoke(Method.java:317)
	at java.lang.reflect.Method5Test.getParamAnnotations(Method5Test.java:81)
	at java.lang.reflect.Method5Test.testGetParameterAnnotations3(Method5Test.java:140)
	at java.lang.reflect.VMReflection.invokeMethod(VMReflection.java)
	at java.lang.reflect.Method.invoke(Method.java:317)
	at junit.framework.TestCase.runTest(TestCase.java:164)
	at junit.framework.TestCase.runBare(TestCase.java)
	at junit.framework.TestResult$1.protect(TestResult.java)
	at junit.framework.TestResult.runProtected(TestResult.java)
	at junit.framework.TestResult.run(TestResult.java:109)
	at junit.framework.TestCase.run(TestCase.java:120)
	at junit.framework.TestSuite.runTest(TestSuite.java:230)
	at junit.framework.TestSuite.run(TestSuite.java)
	at org.apache.tools.ant.taskdefs.optional.junit.JUnitTestRunner.run(JUnitTestRunner.java)
	at org.apache.tools.ant.taskdefs.optional.junit.JUnitTestRunner.launch(JUnitTestRunner.java:672)
	at org.apache.tools.ant.taskdefs.optional.junit.JUnitTestRunner.main(JUnitTestRunner.java:546)
Caused by: java.lang.AssertionError
	at java.lang.reflect.Proxy.getProxyClass(Proxy.java:169)
	at java.lang.reflect.Proxy.newProxyInstance(Proxy.java:201)
	at org.apache.harmony.lang.annotation.AnnotationFactory.createAnnotation(AnnotationFactory.java:101)
	at org.apache.harmony.vm.VMGenericsAndAnnotations.getParameterAnnotations(VMGenericsAndAnnotations.java)
	at java.lang.reflect.Method$MethodData.getParameterAnnotations(Method.java:444)
	at java.lang.reflect.Method.getParameterAnnotations(Method.java:58)
	at java.lang.reflect.VMReflection.invokeMethod(VMReflection.java)
	... 16 more
Test: testGetParameterAnnotationsImmutableClass: java.lang.reflect.Method5Testjava.lang.reflect.InvocationTargetException
	at java.lang.reflect.VMReflection.invokeMethod(VMReflection.java)
	at java.lang.reflect.Method.invoke(Method.java:317)
	at java.lang.reflect.Method5Test.getParamAnnotations(Method5Test.java:81)
	at java.lang.reflect.Method5Test.testGetParameterAnnotationsImmutable(Method5Test.java:157)
	at java.lang.reflect.VMReflection.invokeMethod(VMReflection.java)
	at java.lang.reflect.Method.invoke(Method.java:317)
	at junit.framework.TestCase.runTest(TestCase.java:164)
	at junit.framework.TestCase.runBare(TestCase.java)
	at junit.framework.TestResult$1.protect(TestResult.java)
	at junit.framework.TestResult.runProtected(TestResult.java)
	at junit.framework.TestResult.run(TestResult.java:109)
	at junit.framework.TestCase.run(TestCase.java:120)
	at junit.framework.TestSuite.runTest(TestSuite.java:230)
	at junit.framework.TestSuite.run(TestSuite.java)
	at org.apache.tools.ant.taskdefs.optional.junit.JUnitTestRunner.run(JUnitTestRunner.java)
	at org.apache.tools.ant.taskdefs.optional.junit.JUnitTestRunner.launch(JUnitTestRunner.java:672)
	at org.apache.tools.ant.taskdefs.optional.junit.JUnitTestRunner.main(JUnitTestRunner.java:546)
Caused by: java.lang.AssertionError
	at java.lang.reflect.Proxy.getProxyClass(Proxy.java:169)
	at java.lang.reflect.Proxy.newProxyInstance(Proxy.java:201)
	at org.apache.harmony.lang.annotation.AnnotationFactory.createAnnotation(AnnotationFactory.java:101)
	at org.apache.harmony.vm.VMGenericsAndAnnotations.getParameterAnnotations(VMGenericsAndAnnotations.java)
	at java.lang.reflect.Method$MethodData.getParameterAnnotations(Method.java:444)
	at java.lang.reflect.Method.getParameterAnnotations(Method.java:58)
	at java.lang.reflect.VMReflection.invokeMethod(VMReflection.java)
	... 16 more
Test: testGetAnnotationClass: java.lang.reflect.Method5Testjava.lang.AssertionError
	at java.lang.reflect.Proxy.getProxyClass(Proxy.java:169)
	at java.lang.reflect.Proxy.newProxyInstance(Proxy.java:201)
	at org.apache.harmony.lang.annotation.AnnotationFactory.createAnnotation(AnnotationFactory.java:101)
	at org.apache.harmony.vm.VMGenericsAndAnnotations.getDeclaredAnnotations(VMGenericsAndAnnotations.java)
	at java.lang.reflect.Method$MethodData.getDeclaredAnnotations(Method.java:426)
	at java.lang.reflect.Method.getAnnotation(Method.java:85)
	at org.apache.harmony.lang.AnnotatedElementTestFrame.testGetAnnotation(AnnotatedElementTestFrame.java)
	at java.lang.reflect.VMReflection.invokeMethod(VMReflection.java)
	at java.lang.reflect.Method.invoke(Method.java:317)
	at junit.framework.TestCase.runTest(TestCase.java:164)
	at junit.framework.TestCase.runBare(TestCase.java)
	at junit.framework.TestResult$1.protect(TestResult.java)
	at junit.framework.TestResult.runProtected(TestResult.java)
	at junit.framework.TestResult.run(TestResult.java:109)
	at junit.framework.TestCase.run(TestCase.java:120)
	at junit.framework.TestSuite.runTest(TestSuite.java:230)
	at junit.framework.TestSuite.run(TestSuite.java)
	at org.apache.tools.ant.taskdefs.optional.junit.JUnitTestRunner.run(JUnitTestRunner.java)
	at org.apache.tools.ant.taskdefs.optional.junit.JUnitTestRunner.launch(JUnitTestRunner.java:672)
	at org.apache.tools.ant.taskdefs.optional.junit.JUnitTestRunner.main(JUnitTestRunner.java:546)
Test: testGetAnnotation2Class: java.lang.reflect.Method5Testjava.lang.AssertionError
	at java.lang.reflect.Proxy.getProxyClass(Proxy.java:169)
	at java.lang.reflect.Proxy.newProxyInstance(Proxy.java:201)
	at org.apache.harmony.lang.annotation.AnnotationFactory.createAnnotation(AnnotationFactory.java:101)
	at org.apache.harmony.vm.VMGenericsAndAnnotations.getDeclaredAnnotations(VMGenericsAndAnnotations.java)
	at java.lang.reflect.Method$MethodData.getDeclaredAnnotations(Method.java:426)
	at java.lang.reflect.Method.getAnnotation(Method.java:85)
	at org.apache.harmony.lang.AnnotatedElementTestFrame.testGetAnnotation2(AnnotatedElementTestFrame.java)
	at java.lang.reflect.VMReflection.invokeMethod(VMReflection.java)
	at java.lang.reflect.Method.invoke(Method.java:317)
	at junit.framework.TestCase.runTest(TestCase.java:164)
	at junit.framework.TestCase.runBare(TestCase.java)
	at junit.framework.TestResult$1.protect(TestResult.java)
	at junit.framework.TestResult.runProtected(TestResult.java)
	at junit.framework.TestResult.run(TestResult.java:109)
	at junit.framework.TestCase.run(TestCase.java:120)
	at junit.framework.TestSuite.runTest(TestSuite.java:230)
	at junit.framework.TestSuite.run(TestSuite.java)
	at org.apache.tools.ant.taskdefs.optional.junit.JUnitTestRunner.run(JUnitTestRunner.java)
	at org.apache.tools.ant.taskdefs.optional.junit.JUnitTestRunner.launch(JUnitTestRunner.java:672)
	at org.apache.tools.ant.taskdefs.optional.junit.JUnitTestRunner.main(JUnitTestRunner.java:546)
Test: testGetAnnotation_NegativeClass: java.lang.reflect.Method5Testjava.lang.AssertionError
	at java.lang.reflect.Proxy.getProxyClass(Proxy.java:169)
	at java.lang.reflect.Proxy.newProxyInstance(Proxy.java:201)
	at org.apache.harmony.lang.annotation.AnnotationFactory.createAnnotation(AnnotationFactory.java:101)
	at org.apache.harmony.vm.VMGenericsAndAnnotations.getDeclaredAnnotations(VMGenericsAndAnnotations.java)
	at java.lang.reflect.Method$MethodData.getDeclaredAnnotations(Method.java:426)
	at java.lang.reflect.Method.getAnnotation(Method.java:85)
	at org.apache.harmony.lang.AnnotatedElementTestFrame.testGetAnnotation_Negative(AnnotatedElementTestFrame.java)
	at java.lang.reflect.VMReflection.invokeMethod(VMReflection.java)
	at java.lang.reflect.Method.invoke(Method.java:317)
	at junit.framework.TestCase.runTest(TestCase.java:164)
	at junit.framework.TestCase.runBare(TestCase.java)
	at junit.framework.TestResult$1.protect(TestResult.java)
	at junit.framework.TestResult.runProtected(TestResult.java)
	at junit.framework.TestResult.run(TestResult.java:109)
	at junit.framework.TestCase.run(TestCase.java:120)
	at junit.framework.TestSuite.runTest(TestSuite.java:230)
	at junit.framework.TestSuite.run(TestSuite.java)
	at org.apache.tools.ant.taskdefs.optional.junit.JUnitTestRunner.run(JUnitTestRunner.java)
	at org.apache.tools.ant.taskdefs.optional.junit.JUnitTestRunner.launch(JUnitTestRunner.java:672)
	at org.apache.tools.ant.taskdefs.optional.junit.JUnitTestRunner.main(JUnitTestRunner.java:546)
Test: testGetDeclaredAnnotationsClass: java.lang.reflect.Method5Testjava.lang.AssertionError
	at java.lang.reflect.Proxy.getProxyClass(Proxy.java:169)
	at java.lang.reflect.Proxy.newProxyInstance(Proxy.java:201)
	at org.apache.harmony.lang.annotation.AnnotationFactory.createAnnotation(AnnotationFactory.java:101)
	at org.apache.harmony.vm.VMGenericsAndAnnotations.getDeclaredAnnotations(VMGenericsAndAnnotations.java)
	at java.lang.reflect.Method$MethodData.getDeclaredAnnotations(Method.java:426)
	at java.lang.reflect.Method.getDeclaredAnnotations(Method.java:71)
	at org.apache.harmony.lang.AnnotatedElementTestFrame.testGetDeclaredAnnotations(AnnotatedElementTestFrame.java)
	at java.lang.reflect.VMReflection.invokeMethod(VMReflection.java)
	at java.lang.reflect.Method.invoke(Method.java:317)
	at junit.framework.TestCase.runTest(TestCase.java:164)
	at junit.framework.TestCase.runBare(TestCase.java)
	at junit.framework.TestResult$1.protect(TestResult.java)
	at junit.framework.TestResult.runProtected(TestResult.java)
	at junit.framework.TestResult.run(TestResult.java:109)
	at junit.framework.TestCase.run(TestCase.java:120)
	at junit.framework.TestSuite.runTest(TestSuite.java:230)
	at junit.framework.TestSuite.run(TestSuite.java)
	at org.apache.tools.ant.taskdefs.optional.junit.JUnitTestRunner.run(JUnitTestRunner.java)
	at org.apache.tools.ant.taskdefs.optional.junit.JUnitTestRunner.launch(JUnitTestRunner.java:672)
	at org.apache.tools.ant.taskdefs.optional.junit.JUnitTestRunner.main(JUnitTestRunner.java:546)
Test: testGetDeclaredAnnotations2Class: java.lang.reflect.Method5Testjava.lang.AssertionError
	at java.lang.reflect.Proxy.getProxyClass(Proxy.java:169)
	at java.lang.reflect.Proxy.newProxyInstance(Proxy.java:201)
	at org.apache.harmony.lang.annotation.AnnotationFactory.createAnnotation(AnnotationFactory.java:101)
	at org.apache.harmony.vm.VMGenericsAndAnnotations.getDeclaredAnnotations(VMGenericsAndAnnotations.java)
	at java.lang.reflect.Method$MethodData.getDeclaredAnnotations(Method.java:426)
	at java.lang.reflect.Method.getDeclaredAnnotations(Method.java:71)
	at org.apache.harmony.lang.AnnotatedElementTestFrame.testGetDeclaredAnnotations2(AnnotatedElementTestFrame.java)
	at java.lang.reflect.VMReflection.invokeMethod(VMReflection.java)
	at java.lang.reflect.Method.invoke(Method.java:317)
	at junit.framework.TestCase.runTest(TestCase.java:164)
	at junit.framework.TestCase.runBare(TestCase.java)
	at junit.framework.TestResult$1.protect(TestResult.java)
	at junit.framework.TestResult.runProtected(TestResult.java)
	at junit.framework.TestResult.run(TestResult.java:109)
	at junit.framework.TestCase.run(TestCase.java:120)
	at junit.framework.TestSuite.runTest(TestSuite.java:230)
	at junit.framework.TestSuite.run(TestSuite.java)
	at org.apache.tools.ant.taskdefs.optional.junit.JUnitTestRunner.run(JUnitTestRunner.java)
	at org.apache.tools.ant.taskdefs.optional.junit.JUnitTestRunner.launch(JUnitTestRunner.java:672)
	at org.apache.tools.ant.taskdefs.optional.junit.JUnitTestRunner.main(JUnitTestRunner.java:546)
Test: testGetDeclaredAnnotationsImmutableClass: java.lang.reflect.Method5Testjava.lang.AssertionError
	at java.lang.reflect.Proxy.getProxyClass(Proxy.java:169)
	at java.lang.reflect.Proxy.newProxyInstance(Proxy.java:201)
	at org.apache.harmony.lang.annotation.AnnotationFactory.createAnnotation(AnnotationFactory.java:101)
	at org.apache.harmony.vm.VMGenericsAndAnnotations.getDeclaredAnnotations(VMGenericsAndAnnotations.java)
	at java.lang.reflect.Method$MethodData.getDeclaredAnnotations(Method.java:426)
	at java.lang.reflect.Method.getDeclaredAnnotations(Method.java:71)
	at org.apache.harmony.lang.AnnotatedElementTestFrame.testGetDeclaredAnnotationsImmutable(AnnotatedElementTestFrame.java)
	at java.lang.reflect.VMReflection.invokeMethod(VMReflection.java)
	at java.lang.reflect.Method.invoke(Method.java:317)
	at junit.framework.TestCase.runTest(TestCase.java:164)
	at junit.framework.TestCase.runBare(TestCase.java)
	at junit.framework.TestResult$1.protect(TestResult.java)
	at junit.framework.TestResult.runProtected(TestResult.java)
	at junit.framework.TestResult.run(TestResult.java:109)
	at junit.framework.TestCase.run(TestCase.java:120)
	at junit.framework.TestSuite.runTest(TestSuite.java:230)
	at junit.framework.TestSuite.run(TestSuite.java)
	at org.apache.tools.ant.taskdefs.optional.junit.JUnitTestRunner.run(JUnitTestRunner.java)
	at org.apache.tools.ant.taskdefs.optional.junit.JUnitTestRunner.launch(JUnitTestRunner.java:672)
	at org.apache.tools.ant.taskdefs.optional.junit.JUnitTestRunner.main(JUnitTestRunner.java:546)
Test: testGetAnnotationsClass: java.lang.reflect.Method5Testjava.lang.AssertionError
	at java.lang.reflect.Proxy.getProxyClass(Proxy.java:169)
	at java.lang.reflect.Proxy.newProxyInstance(Proxy.java:201)
	at org.apache.harmony.lang.annotation.AnnotationFactory.createAnnotation(AnnotationFactory.java:101)
	at org.apache.harmony.vm.VMGenericsAndAnnotations.getDeclaredAnnotations(VMGenericsAndAnnotations.java)
	at java.lang.reflect.Method$MethodData.getDeclaredAnnotations(Method.java:426)
	at java.lang.reflect.Method.getDeclaredAnnotations(Method.java:71)
	at java.lang.reflect.AccessibleObject.getAnnotations(AccessibleObject.java)
	at org.apache.harmony.lang.AnnotatedElementTestFrame.testGetAnnotations(AnnotatedElementTestFrame.java)
	at java.lang.reflect.VMReflection.invokeMethod(VMReflection.java)
	at java.lang.reflect.Method.invoke(Method.java:317)
	at junit.framework.TestCase.runTest(TestCase.java:164)
	at junit.framework.TestCase.runBare(TestCase.java)
	at junit.framework.TestResult$1.protect(TestResult.java)
	at junit.framework.TestResult.runProtected(TestResult.java)
	at junit.framework.TestResult.run(TestResult.java:109)
	at junit.framework.TestCase.run(TestCase.java:120)
	at junit.framework.TestSuite.runTest(TestSuite.java:230)
	at junit.framework.TestSuite.run(TestSuite.java)
	at org.apache.tools.ant.taskdefs.optional.junit.JUnitTestRunner.run(JUnitTestRunner.java)
	at org.apache.tools.ant.taskdefs.optional.junit.JUnitTestRunner.launch(JUnitTestRunner.java:672)
	at org.apache.tools.ant.taskdefs.optional.junit.JUnitTestRunner.main(JUnitTestRunner.java:546)
Test: testGetAnnotations2Class: java.lang.reflect.Method5Testjava.lang.AssertionError
	at java.lang.reflect.Proxy.getProxyClass(Proxy.java:169)
	at java.lang.reflect.Proxy.newProxyInstance(Proxy.java:201)
	at org.apache.harmony.lang.annotation.AnnotationFactory.createAnnotation(AnnotationFactory.java:101)
	at org.apache.harmony.vm.VMGenericsAndAnnotations.getDeclaredAnnotations(VMGenericsAndAnnotations.java)
	at java.lang.reflect.Method$MethodData.getDeclaredAnnotations(Method.java:426)
	at java.lang.reflect.Method.getDeclaredAnnotations(Method.java:71)
	at java.lang.reflect.AccessibleObject.getAnnotations(AccessibleObject.java)
	at org.apache.harmony.lang.AnnotatedElementTestFrame.testGetAnnotations2(AnnotatedElementTestFrame.java)
	at java.lang.reflect.VMReflection.invokeMethod(VMReflection.java)
	at java.lang.reflect.Method.invoke(Method.java:317)
	at junit.framework.TestCase.runTest(TestCase.java:164)
	at junit.framework.TestCase.runBare(TestCase.java)
	at junit.framework.TestResult$1.protect(TestResult.java)
	at junit.framework.TestResult.runProtected(TestResult.java)
	at junit.framework.TestResult.run(TestResult.java:109)
	at junit.framework.TestCase.run(TestCase.java:120)
	at junit.framework.TestSuite.runTest(TestSuite.java:230)
	at junit.framework.TestSuite.run(TestSuite.java)
	at org.apache.tools.ant.taskdefs.optional.junit.JUnitTestRunner.run(JUnitTestRunner.java)
	at org.apache.tools.ant.taskdefs.optional.junit.JUnitTestRunner.launch(JUnitTestRunner.java:672)
	at org.apache.tools.ant.taskdefs.optional.junit.JUnitTestRunner.main(JUnitTestRunner.java:546)
Test: testGetAnnotations5Class: java.lang.reflect.Method5Testjava.lang.AssertionError
	at java.lang.reflect.Proxy.getProxyClass(Proxy.java:169)
	at java.lang.reflect.Proxy.newProxyInstance(Proxy.java:201)
	at org.apache.harmony.lang.annotation.AnnotationFactory.createAnnotation(AnnotationFactory.java:101)
	at org.apache.harmony.vm.VMGenericsAndAnnotations.getDeclaredAnnotations(VMGenericsAndAnnotations.java)
	at java.lang.reflect.Method$MethodData.getDeclaredAnnotations(Method.java:426)
	at java.lang.reflect.Method.getDeclaredAnnotations(Method.java:71)
	at java.lang.reflect.AccessibleObject.getAnnotations(AccessibleObject.java)
	at org.apache.harmony.lang.AnnotatedElementTestFrame.testGetAnnotations5(AnnotatedElementTestFrame.java)
	at java.lang.reflect.VMReflection.invokeMethod(VMReflection.java)
	at java.lang.reflect.Method.invoke(Method.java:317)
	at junit.framework.TestCase.runTest(TestCase.java:164)
	at junit.framework.TestCase.runBare(TestCase.java)
	at junit.framework.TestResult$1.protect(TestResult.java)
	at junit.framework.TestResult.runProtected(TestResult.java)
	at junit.framework.TestResult.run(TestResult.java:109)
	at junit.framework.TestCase.run(TestCase.java:120)
	at junit.framework.TestSuite.runTest(TestSuite.java:230)
	at junit.framework.TestSuite.run(TestSuite.java)
	at org.apache.tools.ant.taskdefs.optional.junit.JUnitTestRunner.run(JUnitTestRunner.java)
	at org.apache.tools.ant.taskdefs.optional.junit.JUnitTestRunner.launch(JUnitTestRunner.java:672)
	at org.apache.tools.ant.taskdefs.optional.junit.JUnitTestRunner.main(JUnitTestRunner.java:546)
Test: testGetAnnotationsImmutableClass: java.lang.reflect.Method5Testjava.lang.AssertionError
	at java.lang.reflect.Proxy.getProxyClass(Proxy.java:169)
	at java.lang.reflect.Proxy.newProxyInstance(Proxy.java:201)
	at org.apache.harmony.lang.annotation.AnnotationFactory.createAnnotation(AnnotationFactory.java:101)
	at org.apache.harmony.vm.VMGenericsAndAnnotations.getDeclaredAnnotations(VMGenericsAndAnnotations.java)
	at java.lang.reflect.Method$MethodData.getDeclaredAnnotations(Method.java:426)
	at java.lang.reflect.Method.getDeclaredAnnotations(Method.java:71)
	at java.lang.reflect.AccessibleObject.getAnnotations(AccessibleObject.java)
	at org.apache.harmony.lang.AnnotatedElementTestFrame.testGetAnnotationsImmutable(AnnotatedElementTestFrame.java)
	at java.lang.reflect.VMReflection.invokeMethod(VMReflection.java)
	at java.lang.reflect.Method.invoke(Method.java:317)
	at junit.framework.TestCase.runTest(TestCase.java:164)
	at junit.framework.TestCase.runBare(TestCase.java)
	at junit.framework.TestResult$1.protect(TestResult.java)
	at junit.framework.TestResult.runProtected(TestResult.java)
	at junit.framework.TestResult.run(TestResult.java:109)
	at junit.framework.TestCase.run(TestCase.java:120)
	at junit.framework.TestSuite.runTest(TestSuite.java:230)
	at junit.framework.TestSuite.run(TestSuite.java)
	at org.apache.tools.ant.taskdefs.optional.junit.JUnitTestRunner.run(JUnitTestRunner.java)
	at org.apache.tools.ant.taskdefs.optional.junit.JUnitTestRunner.launch(JUnitTestRunner.java:672)
	at org.apache.tools.ant.taskdefs.optional.junit.JUnitTestRunner.main(JUnitTestRunner.java:546)
Test: testIsAnnotationPresentClass: java.lang.reflect.Method5Testjava.lang.AssertionError
	at java.lang.reflect.Proxy.getProxyClass(Proxy.java:169)
	at java.lang.reflect.Proxy.newProxyInstance(Proxy.java:201)
	at org.apache.harmony.lang.annotation.AnnotationFactory.createAnnotation(AnnotationFactory.java:101)
	at org.apache.harmony.vm.VMGenericsAndAnnotations.getDeclaredAnnotations(VMGenericsAndAnnotations.java)
	at java.lang.reflect.Method$MethodData.getDeclaredAnnotations(Method.java:426)
	at java.lang.reflect.Method.getAnnotation(Method.java:85)
	at java.lang.reflect.AccessibleObject.isAnnotationPresent(AccessibleObject.java)
	at org.apache.harmony.lang.AnnotatedElementTestFrame.testIsAnnotationPresent(AnnotatedElementTestFrame.java)
	at java.lang.reflect.VMReflection.invokeMethod(VMReflection.java)
	at java.lang.reflect.Method.invoke(Method.java:317)
	at junit.framework.TestCase.runTest(TestCase.java:164)
	at junit.framework.TestCase.runBare(TestCase.java)
	at junit.framework.TestResult$1.protect(TestResult.java)
	at junit.framework.TestResult.runProtected(TestResult.java)
	at junit.framework.TestResult.run(TestResult.java:109)
	at junit.framework.TestCase.run(TestCase.java:120)
	at junit.framework.TestSuite.runTest(TestSuite.java:230)
	at junit.framework.TestSuite.run(TestSuite.java)
	at org.apache.tools.ant.taskdefs.optional.junit.JUnitTestRunner.run(JUnitTestRunner.java)
	at org.apache.tools.ant.taskdefs.optional.junit.JUnitTestRunner.launch(JUnitTestRunner.java:672)
	at org.apache.tools.ant.taskdefs.optional.junit.JUnitTestRunner.main(JUnitTestRunner.java:546)
Test: testIsAnnotationPresent_NegativeClass: java.lang.reflect.Method5Testjava.lang.AssertionError
	at java.lang.reflect.Proxy.getProxyClass(Proxy.java:169)
	at java.lang.reflect.Proxy.newProxyInstance(Proxy.java:201)
	at org.apache.harmony.lang.annotation.AnnotationFactory.createAnnotation(AnnotationFactory.java:101)
	at org.apache.harmony.vm.VMGenericsAndAnnotations.getDeclaredAnnotations(VMGenericsAndAnnotations.java)
	at java.lang.reflect.Method$MethodData.getDeclaredAnnotations(Method.java:426)
	at java.lang.reflect.Method.getAnnotation(Method.java:85)
	at java.lang.reflect.AccessibleObject.isAnnotationPresent(AccessibleObject.java)
	at org.apache.harmony.lang.AnnotatedElementTestFrame.testIsAnnotationPresent_Negative(AnnotatedElementTestFrame.java)
	at java.lang.reflect.VMReflection.invokeMethod(VMReflection.java)
	at java.lang.reflect.Method.invoke(Method.java:317)
	at junit.framework.TestCase.runTest(TestCase.java:164)
	at junit.framework.TestCase.runBare(TestCase.java)
	at junit.framework.TestResult$1.protect(TestResult.java)
	at junit.framework.TestResult.runProtected(TestResult.java)
	at junit.framework.TestResult.run(TestResult.java:109)
	at junit.framework.TestCase.run(TestCase.java:120)
	at junit.framework.TestSuite.runTest(TestSuite.java:230)
	at junit.framework.TestSuite.run(TestSuite.java)
	at org.apache.tools.ant.taskdefs.optional.junit.JUnitTestRunner.run(JUnitTestRunner.java)
	at org.apache.tools.ant.taskdefs.optional.junit.JUnitTestRunner.launch(JUnitTestRunner.java:672)
	at org.apache.tools.ant.taskdefs.optional.junit.JUnitTestRunner.main(JUnitTestRunner.java:546)
Test: testGetAnnotation_ByDefaultClass: org.apache.harmony.lang.annotation.AllTypesTestjava.lang.AssertionError
	at java.lang.reflect.Proxy.getProxyClass(Proxy.java:169)
	at java.lang.reflect.Proxy.newProxyInstance(Proxy.java:201)
	at org.apache.harmony.lang.annotation.AnnotationFactory.createAnnotation(AnnotationFactory.java:101)
	at org.apache.harmony.vm.VMGenericsAndAnnotations.getDeclaredAnnotations(VMGenericsAndAnnotations.java)
	at java.lang.Class$GACache.getAllAnnotations(Class.java:1338)
	at java.lang.Class.getAnnotation(Class.java:890)
	at org.apache.harmony.lang.annotation.AllTypesTest.testGetAnnotation_ByDefault(AllTypesTest.java:51)
	at java.lang.reflect.VMReflection.invokeMethod(VMReflection.java)
	at java.lang.reflect.Method.invoke(Method.java:317)
	at junit.framework.TestCase.runTest(TestCase.java:164)
	at junit.framework.TestCase.runBare(TestCase.java)
	at junit.framework.TestResult$1.protect(TestResult.java)
	at junit.framework.TestResult.runProtected(TestResult.java)
	at junit.framework.TestResult.run(TestResult.java:109)
	at junit.framework.TestCase.run(TestCase.java:120)
	at junit.framework.TestSuite.runTest(TestSuite.java:230)
	at junit.framework.TestSuite.run(TestSuite.java)
	at org.apache.tools.ant.taskdefs.optional.junit.JUnitTestRunner.run(JUnitTestRunner.java)
	at org.apache.tools.ant.taskdefs.optional.junit.JUnitTestRunner.launch(JUnitTestRunner.java:672)
	at org.apache.tools.ant.taskdefs.optional.junit.JUnitTestRunner.main(JUnitTestRunner.java:546)
Test: testGetAnnotation_NoDefaultClass: org.apache.harmony.lang.annotation.AllTypesTestjava.lang.AssertionError
	at java.lang.reflect.Proxy.getProxyClass(Proxy.java:169)
	at java.lang.reflect.Proxy.newProxyInstance(Proxy.java:201)
	at org.apache.harmony.lang.annotation.AnnotationFactory.createAnnotation(AnnotationFactory.java:101)
	at org.apache.harmony.vm.VMGenericsAndAnnotations.getDeclaredAnnotations(VMGenericsAndAnnotations.java)
	at java.lang.Class$GACache.getAllAnnotations(Class.java:1338)
	at java.lang.Class.getAnnotation(Class.java:890)
	at org.apache.harmony.lang.annotation.AllTypesTest.testGetAnnotation_NoDefault(AllTypesTest.java:87)
	at java.lang.reflect.VMReflection.invokeMethod(VMReflection.java)
	at java.lang.reflect.Method.invoke(Method.java:317)
	at junit.framework.TestCase.runTest(TestCase.java:164)
	at junit.framework.TestCase.runBare(TestCase.java)
	at junit.framework.TestResult$1.protect(TestResult.java)
	at junit.framework.TestResult.runProtected(TestResult.java)
	at junit.framework.TestResult.run(TestResult.java:109)
	at junit.framework.TestCase.run(TestCase.java:120)
	at junit.framework.TestSuite.runTest(TestSuite.java:230)
	at junit.framework.TestSuite.run(TestSuite.java)
	at org.apache.tools.ant.taskdefs.optional.junit.JUnitTestRunner.run(JUnitTestRunner.java)
	at org.apache.tools.ant.taskdefs.optional.junit.JUnitTestRunner.launch(JUnitTestRunner.java:672)
	at org.apache.tools.ant.taskdefs.optional.junit.JUnitTestRunner.main(JUnitTestRunner.java:546)
Test: testEqualsClass: org.apache.harmony.lang.annotation.AllTypesTestjava.lang.AssertionError
	at java.lang.reflect.Proxy.getProxyClass(Proxy.java:169)
	at java.lang.reflect.Proxy.newProxyInstance(Proxy.java:201)
	at org.apache.harmony.lang.annotation.AnnotationFactory.createAnnotation(AnnotationFactory.java:101)
	at org.apache.harmony.vm.VMGenericsAndAnnotations.getDeclaredAnnotations(VMGenericsAndAnnotations.java)
	at java.lang.Class$GACache.getAllAnnotations(Class.java:1338)
	at java.lang.Class.getAnnotation(Class.java:890)
	at org.apache.harmony.lang.annotation.AllTypesTest.testEquals(AllTypesTest.java:114)
	at java.lang.reflect.VMReflection.invokeMethod(VMReflection.java)
	at java.lang.reflect.Method.invoke(Method.java:317)
	at junit.framework.TestCase.runTest(TestCase.java:164)
	at junit.framework.TestCase.runBare(TestCase.java)
	at junit.framework.TestResult$1.protect(TestResult.java)
	at junit.framework.TestResult.runProtected(TestResult.java)
	at junit.framework.TestResult.run(TestResult.java:109)
	at junit.framework.TestCase.run(TestCase.java:120)
	at junit.framework.TestSuite.runTest(TestSuite.java:230)
	at junit.framework.TestSuite.run(TestSuite.java)
	at org.apache.tools.ant.taskdefs.optional.junit.JUnitTestRunner.run(JUnitTestRunner.java)
	at org.apache.tools.ant.taskdefs.optional.junit.JUnitTestRunner.launch(JUnitTestRunner.java:672)
	at org.apache.tools.ant.taskdefs.optional.junit.JUnitTestRunner.main(JUnitTestRunner.java:546)
Test: testEquals_ForeignImplClass: org.apache.harmony.lang.annotation.AllTypesTestjava.lang.AssertionError
	at java.lang.reflect.Proxy.getProxyClass(Proxy.java:169)
	at java.lang.reflect.Proxy.newProxyInstance(Proxy.java:201)
	at org.apache.harmony.lang.annotation.AnnotationFactory.createAnnotation(AnnotationFactory.java:101)
	at org.apache.harmony.vm.VMGenericsAndAnnotations.getDeclaredAnnotations(VMGenericsAndAnnotations.java)
	at java.lang.Class$GACache.getAllAnnotations(Class.java:1338)
	at java.lang.Class.getAnnotation(Class.java:890)
	at org.apache.harmony.lang.annotation.AllTypesTest.testEquals_ForeignImpl(AllTypesTest.java:131)
	at java.lang.reflect.VMReflection.invokeMethod(VMReflection.java)
	at java.lang.reflect.Method.invoke(Method.java:317)
	at junit.framework.TestCase.runTest(TestCase.java:164)
	at junit.framework.TestCase.runBare(TestCase.java)
	at junit.framework.TestResult$1.protect(TestResult.java)
	at junit.framework.TestResult.runProtected(TestResult.java)
	at junit.framework.TestResult.run(TestResult.java:109)
	at junit.framework.TestCase.run(TestCase.java:120)
	at junit.framework.TestSuite.runTest(TestSuite.java:230)
	at junit.framework.TestSuite.run(TestSuite.java)
	at org.apache.tools.ant.taskdefs.optional.junit.JUnitTestRunner.run(JUnitTestRunner.java)
	at org.apache.tools.ant.taskdefs.optional.junit.JUnitTestRunner.launch(JUnitTestRunner.java:672)
	at org.apache.tools.ant.taskdefs.optional.junit.JUnitTestRunner.main(JUnitTestRunner.java:546)
Test: testToStringClass: org.apache.harmony.lang.annotation.AllTypesTestjava.lang.AssertionError
	at java.lang.reflect.Proxy.getProxyClass(Proxy.java:169)
	at java.lang.reflect.Proxy.newProxyInstance(Proxy.java:201)
	at org.apache.harmony.lang.annotation.AnnotationFactory.createAnnotation(AnnotationFactory.java:101)
	at org.apache.harmony.vm.VMGenericsAndAnnotations.getDeclaredAnnotations(VMGenericsAndAnnotations.java)
	at java.lang.Class$GACache.getAllAnnotations(Class.java:1338)
	at java.lang.Class.getAnnotation(Class.java:890)
	at org.apache.harmony.lang.annotation.AllTypesTest.testToString(AllTypesTest.java:140)
	at java.lang.reflect.VMReflection.invokeMethod(VMReflection.java)
	at java.lang.reflect.Method.invoke(Method.java:317)
	at junit.framework.TestCase.runTest(TestCase.java:164)
	at junit.framework.TestCase.runBare(TestCase.java)
	at junit.framework.TestResult$1.protect(TestResult.java)
	at junit.framework.TestResult.runProtected(TestResult.java)
	at junit.framework.TestResult.run(TestResult.java:109)
	at junit.framework.TestCase.run(TestCase.java:120)
	at junit.framework.TestSuite.runTest(TestSuite.java:230)
	at junit.framework.TestSuite.run(TestSuite.java)
	at org.apache.tools.ant.taskdefs.optional.junit.JUnitTestRunner.run(JUnitTestRunner.java)
	at org.apache.tools.ant.taskdefs.optional.junit.JUnitTestRunner.launch(JUnitTestRunner.java:672)
	at org.apache.tools.ant.taskdefs.optional.junit.JUnitTestRunner.main(JUnitTestRunner.java:546)
Test: testAnnotationTypeClass: org.apache.harmony.lang.annotation.AllTypesTestjava.lang.AssertionError
	at java.lang.reflect.Proxy.getProxyClass(Proxy.java:169)
	at java.lang.reflect.Proxy.newProxyInstance(Proxy.java:201)
	at org.apache.harmony.lang.annotation.AnnotationFactory.createAnnotation(AnnotationFactory.java:101)
	at org.apache.harmony.vm.VMGenericsAndAnnotations.getDeclaredAnnotations(VMGenericsAndAnnotations.java)
	at java.lang.Class$GACache.getAllAnnotations(Class.java:1338)
	at java.lang.Class.getAnnotation(Class.java:890)
	at org.apache.harmony.lang.annotation.AllTypesTest.testAnnotationType(AllTypesTest.java:152)
	at java.lang.reflect.VMReflection.invokeMethod(VMReflection.java)
	at java.lang.reflect.Method.invoke(Method.java:317)
	at junit.framework.TestCase.runTest(TestCase.java:164)
	at junit.framework.TestCase.runBare(TestCase.java)
	at junit.framework.TestResult$1.protect(TestResult.java)
	at junit.framework.TestResult.runProtected(TestResult.java)
	at junit.framework.TestResult.run(TestResult.java:109)
	at junit.framework.TestCase.run(TestCase.java:120)
	at junit.framework.TestSuite.runTest(TestSuite.java:230)
	at junit.framework.TestSuite.run(TestSuite.java)
	at org.apache.tools.ant.taskdefs.optional.junit.JUnitTestRunner.run(JUnitTestRunner.java)
	at org.apache.tools.ant.taskdefs.optional.junit.JUnitTestRunner.launch(JUnitTestRunner.java:672)
	at org.apache.tools.ant.taskdefs.optional.junit.JUnitTestRunner.main(JUnitTestRunner.java:546)
Test: testAnnotation_ElementErrorClass: org.apache.harmony.lang.annotation.AllTypesTestjava.lang.AssertionError
	at java.lang.reflect.Proxy.getProxyClass(Proxy.java:169)
	at java.lang.reflect.Proxy.newProxyInstance(Proxy.java:201)
	at org.apache.harmony.lang.annotation.AnnotationFactory.createAnnotation(AnnotationFactory.java:101)
	at org.apache.harmony.vm.VMGenericsAndAnnotations.getDeclaredAnnotations(VMGenericsAndAnnotations.java)
	at java.lang.reflect.Method$MethodData.getDeclaredAnnotations(Method.java:426)
	at java.lang.reflect.Method.getAnnotation(Method.java:85)
	at org.apache.harmony.lang.annotation.AllTypesTest.testAnnotation_ElementError(AllTypesTest.java:162)
	at java.lang.reflect.VMReflection.invokeMethod(VMReflection.java)
	at java.lang.reflect.Method.invoke(Method.java:317)
	at junit.framework.TestCase.runTest(TestCase.java:164)
	at junit.framework.TestCase.runBare(TestCase.java)
	at junit.framework.TestResult$1.protect(TestResult.java)
	at junit.framework.TestResult.runProtected(TestResult.java)
	at junit.framework.TestResult.run(TestResult.java:109)
	at junit.framework.TestCase.run(TestCase.java:120)
	at junit.framework.TestSuite.runTest(TestSuite.java:230)
	at junit.framework.TestSuite.run(TestSuite.java)
	at org.apache.tools.ant.taskdefs.optional.junit.JUnitTestRunner.run(JUnitTestRunner.java)
	at org.apache.tools.ant.taskdefs.optional.junit.JUnitTestRunner.launch(JUnitTestRunner.java:672)
	at org.apache.tools.ant.taskdefs.optional.junit.JUnitTestRunner.main(JUnitTestRunner.java:546)
Test: testSerializationClass: org.apache.harmony.lang.annotation.AllTypesTestjava.lang.AssertionError
	at java.lang.reflect.Proxy.getProxyClass(Proxy.java:169)
	at java.lang.reflect.Proxy.newProxyInstance(Proxy.java:201)
	at org.apache.harmony.lang.annotation.AnnotationFactory.createAnnotation(AnnotationFactory.java:101)
	at org.apache.harmony.vm.VMGenericsAndAnnotations.getDeclaredAnnotations(VMGenericsAndAnnotations.java)
	at java.lang.Class$GACache.getAllAnnotations(Class.java:1338)
	at java.lang.Class.getAnnotation(Class.java:890)
	at org.apache.harmony.lang.annotation.AllTypesTest.testSerialization(AllTypesTest.java:189)
	at java.lang.reflect.VMReflection.invokeMethod(VMReflection.java)
	at java.lang.reflect.Method.invoke(Method.java:317)
	at junit.framework.TestCase.runTest(TestCase.java:164)
	at junit.framework.TestCase.runBare(TestCase.java)
	at junit.framework.TestResult$1.protect(TestResult.java)
	at junit.framework.TestResult.runProtected(TestResult.java)
	at junit.framework.TestResult.run(TestResult.java:109)
	at junit.framework.TestCase.run(TestCase.java:120)
	at junit.framework.TestSuite.runTest(TestSuite.java:230)
	at junit.framework.TestSuite.run(TestSuite.java)
	at org.apache.tools.ant.taskdefs.optional.junit.JUnitTestRunner.run(JUnitTestRunner.java)
	at org.apache.tools.ant.taskdefs.optional.junit.JUnitTestRunner.launch(JUnitTestRunner.java:672)
	at org.apache.tools.ant.taskdefs.optional.junit.JUnitTestRunner.main(JUnitTestRunner.java:546)

***********************************************************
Modifications since last successful build:	(2)
            
add cc-hdk log20071122143049Lbuild.401 11/22/2007 14:30:49hdk
add cc-hdk log20071122143049Lbuild.401 11/22/2007 14:30:49hdk

begin 644 execution_log.zip
M4$L#! H    ( (*-=C?NTY] I1P  '_C 0 2    97AE8W5T:6]N7VQO9RYH
M=&UL[5U[<^,VDO]_/@6NLE<[V8HID7I[LZGRS'B2\=FQ;^1DZRHUI:))R*)-
MD5H^/'8^_35(R7J18+<L2'(&KI0CC='H1J/1:*!_;/XX2L;^3S_>A.[33S].
M(O[3CS:+DR>?_^OOPS!(CF+O3W[,NO7__N???WJ33EP[X4?Q0W#\YLU1_@T^
M12E\9XS]X7*?)_P+^R#^[P6WK-UKLJ'G\Y@-HW#,:OQQ$D9)+8UY%-<<!_X[
M<L+Q. QJ-ZGGN[6(QZF?Q#4W\A_&1PF/$]$O]'QG/]A?V#O12/1WS,;V/<^)
MC,>QO]1JZ0O(>N2"4$YR+&\TB<*)I E_3'@4#%R^TBC_S)U1")]_B\6@WY^?
M]/OGG]ZQ?U4/V!EQYSY,8<@C][[V-8SNH8>!X]MQ['LWY>+D0S+"V+ C9V0X
MCX^&,[R5R.\%7F*D@?=8U>:K%U0U@1& I<0Q=XUQZ'*98GEBQ'SLQ8;K17%%
MPUS%MB]K-_'36R\P["!QP#HC[Z:ZK3.9)'9\+^M5C*I\6M^'P="[32,[\<) 
M,OOBYY<PS@S_#/X,\V\:+:,^J/?8VWX:L O/B<+X*4[X.&:? L?X7MK9S I8
M%(;)EHUI3?#Y3Q@#KW,O2!]Q%,( @8*/V\T$R0/,%2AN'0?;?G@+[5U^D][*
M*6 ALX@_>#',%%"T>IU&HU[%1)AS&/ @B3,F$S]\JI1K]&0$H1%[0JXAF"R7
M4D!K/W1LW_A33&<1Q=*7NX=QXAG"^TEL5D@-GO H:YRYROA(_&7=0/\8W\/J
M SN../AKE\&7XTV-Z6$\_;,?/ ZR*1_ - ZRJ:EE0M3FTD._PO9XO"S2'Z .
M\=$12TL,0BR8)HO#-'+X=+M(PCU*6*GG %S! S\H3><BE5KA=]\MZ/KL]XOK
M3RRGB-DQ>P?BWD]"+TC,PQM232:=^.: '5E@,(GMSXWGAL\FSC5*J?J)'67>
M&K1R7[4<^?A&['=VX W7%B9:TU?AY&-DC_DAZKE<MM>FY3[\H\_["9\<HIYE
MTKTV3?]^\0E"IT/4<IED,UV9^]7P<J :+6XO![6M1%PPD6R/J%@%#HB+^^<A
MCK!VYY5'KY7AX+\J?RJ[^ P'A'QY97*Q-#]+^AX$IDP<L]C9IVOVUN5#&X[(
M\I/#ED3:3!_Y(9@_.G[JYN'<YF>7Y[G,COO3/N/9!R.[)ACDL^F+$XOQV&T/
MVDT#)I-5G-2JQO@=^^7D\\7EK_]WU*JW&Z7-IGYFYF^RP+:T\?,6.]]LY038
M,YM\*&!:@9@3:9QWEX+\7]B'TW>__7S,?N9),G?X/'CPHG ,EF@8QCJ?%5H7
M#E/_5=6H/V7@V!/[!C:7Q./QUCOG#^)4M[5N+W@R"MW3((F>0&[?O[&=>^;%
MV6=P6L,P6E2QL?A9K.FWZXMVA<$'+[9OLHUVD54V"NP@L!,+7#@+4MBB(I8 
M4PX,MM'_3/4WSX-'Z7^=C,$)/A.R55<FVIQ'2^WP,:0?.)A1Z-BET[.5^7^W
M,'C'22<>&*X7L&$:..)ZZX4&K-JZWHM=8EV_E$$_6U4E+Y_;D>"5C,0V%L7)
M M<MC4?/^4[GO(5WP OD6_6_,P<1IX[#XQC"-)9$Z=:F6I%!K482DKN"E9;2
ML[B..;81<RRHV%C\?# QQVF@>%&]OJ"FV5 ?U#0[.JC)-[B7K9#7L\$UU\^I
M94MQKH;M+L7=3/B"].M.\6#F<T'*7"5A@&!10"7&AI]C/06JIZ")WU1?]SK3
MCG6VE>J3PW9.#D5YF=>7*^"'F"NX\Y+("T+C[/1:9P>DV0&NLP-L;67J[(#.
M#KR^@[3.#NB;8IT=T'.NLP.'$^/K[, !Q1PZ._#Z@AJ='="76#H[H*^FY6/3
MV8'#G *='?C6'*O.#NCLP#P[$$X..3MP>:6S ]+L $S?2[,#"]<DBX\ORF_S
M%SSDXC-B<J*_2H)!S17"7]*]@/X.T+V 5#R:1!Q^[]6]Z&R6SF:]WHL?G<W2
MF0V=S=)SKK-9AW,FE=3LV%X<L6F(0-_]K\'084TD(YAT5^SHL:AIP-W*B" +
M>06ODUO@=9W1(VQSIA71P/#MX-;(2=E+:+/B7ZF3A!&AEP F$48K_!R"ZGFX
MMACN5%\4NEL_O+%]%O$ACW@@*AM!S"3<#+ZOF>3SX]KSI[^9% 46=F D(R]R
M!V .D[??LW$6A1'ZW,0'+H<,N+U%G#>(<Y U?YGI571A/'G<=REJFW;X[.$7
M+ $<9#SA@2N68H)18U9NHW*K*YCTI2G'<7D.#4@!04X[F^Z":VYD![EB5O2%
MU_;U@I*%J\N[0SB[*?V1^&'FLRJSXT_^K\@>0-;I]H?E^9G'*7!:&.]>36OQ
M\(<Z.6ZKAP6C*3+O8Q9SV 9FQOS[#WF]Q&-V7G#-]3?SGZ_)X"QM<"\Q%U4&
M%Z7!7\S0&B\PM&?*O&BOD"*+? >GGS]??A[\>CFXN/Q\.OCX^>3BM(^WQ7'X
ML.&6,=MM,GU.UP!>H1NO@ODD[,L]5O>@<7<:=[?:1N/N-.Y.PT-V<!6G<7??
M .A+X^[V/@4:=_>M.5:-N].XNSDP)HX>2@=:^H?9CS)@3)]'#S!?LPJ^NQ!D
M,RT< O8.IE!C[[Y1[)TCW!;BK2=@>V!?LC:BHZ-I,?>]>ZKYL.):>'-W2.+<
M>$'IM,UK_N?.S Y<-A16(7@5;=?B6_;J@@:MLOZ4W[D7W$]OML3O@6@QL),D
MBDLYU;=<PK]2G!L[]@I>6;0O<3P7XAAO6/"RHKU))$"@45J$?]^72+!DO"0\
M)"N:V%$!Q=ZD2:*!$P8%D=.^))JF,@Y"H/QE(@>T\*<"#>UD9MF')-8!3ETR
M\H*#4E7B@9N,X8PX/A1QLE?3#6)0D'U;<%3<CU#3*0-=#<-#D6D",30XR[3H
M 8S]2!397P]KAP.9LL3_H0B3>&,@VYDT!>>0V<MQ#R7H+WJCTZ(29^>UK'5A
MH+_<$!&OSPZN5R?]_ND'AJ<H8%&R%4M8R"D*6)3'U1(NE41%C,K#91FG2JH"
M5N5.0L*IDJB 47%T*V$B)2AB4!JPRIA4$14P*@UF)'RJ:);9R*/+8C8HFD(V
MTIA1R@Q#6<B2J$(D52$K>9PGY8<B768J"^**>2$HUEA4!&:EC'!T:^SD(5<I
M-Q39&C-9+%7*"D&TQD@>(I6R0I&M,2N)?4JYR-NO=5\6S93V7T!0%*)D(<%R
ME))GD?*_?&'7D1W$PS :,^B1'S/3,JUQN5ZN?&['(H<0N O7ASE.$#XGNPEU
M7GC5'(_#>UYY'PTC#:K?TFW,.S,.Y.71<XEF[TQ=G\_]BU2+1VGBAE\Q%]7[
M$:PFD+@?; YL+H-_VT5O$64[>.5L+B+VI;X'H;2/-FCC-(HD%S-:9<LJ^U1Y
MP;YGC54XOX/R>AF,?]7K_3%ZRO*RSN*,=^LL#M/(X7.U[D_$I2_9J2/;[3.R
M@])OU4U#>1PS_=D"%$(L&ACUV>\7:D;M\HD?/M7NH/U=Q$5&M2:$V<70T$8Q
M^.HEH\&=EPRR*/VY3DNYK]N%^'TAVC0Z# /]HFL$8"9?7/Z67W2=/[]2ZX]M
MWX=]P+G/GW 5*T>.4(%!A,,Q!#[14^T?\J89YJ\"(,.C(:)9Z1_F;^1H-!K=
MTF:W3NW\LB_G 6TNP/2\7!&QO/$$Y%YJWO?&$]CT-AW%T/;\;$7\=@/GW+3-
M\IF6"FM'+]>:U>E84^:9CQA[20(KTG\J)X[A?!C'M0OO\<7<FU9[O6#%K!FL
M CX1R-;:1R^P?>]/GMMII85BC*5NUI>D6/C2LZJ&GLGQ<AF:O18;V<'MJNIE
MD_[KU>G+&??,=0CM H\K$"H)QY]G)0RJ-0Y$_^;V/8$"(V:[T:MR7Q=V\#1=
M@-OA:?5Z2[-1:0I/@;-+1)_8.=DQ^\5#7 =)&JUT][RP$+U6MUWI/(MF_=!V
M>62\%Y\%\<\\^<#A+Z+&0/:/",XO[$@BUNG,U7P*!%S1R[Q-A%3("SN2B'4>
MWIYGGXA25--)F/X:)A_#%'5]3R*3L.QG:VFCH:)(5U@_;RSSZ:(L@(W(2T4 
MAT[B*6N_PN36,6#G/!%/$B!88%H7,LAM',VAHGD!BQ".X,CNI4T+NH[LV[',
MRR_W7M6ZB ''BBYKN=[QN8>RU:J6ZQVO;O[_F_*4(U?&1N3K(@!Q5A  J;GJ
MY@4LTN#9%./+X/312_!CI!*OL\^]%@B.8UC=O( %!":C* Q 2'<N+7Z0&]"O
M"Y&'9GG1BQB\%XXUFFJ%H2?2.]G-\M+N6T">?SZ#WUD!"#\Y9N6/,LQEPS,H
ME^\R&:&<):+Q:O>A<1)%]A/2-:":K[,0=]&W')54Q;1>87 7>(;8S,^]F\B.
M,%@<+,4*(W%^-_+;47&&>-[),>.BTV*9#USX,'J)"!4]% G2YP\\LOWI,0K+
M'$E5R#!S9^_#*.!1'Q80FB66#L-T(+FME;.54!8Q!@V%7\4D8?E5$TC9T$V9
M0HID33-D>@=2,39D3F,9\:'/G<2 \V=>JP7!#T^SPFR6#32JL\YK3.FT,N:R
M[.VFVRJ>0;5\DE1IH7B-]2+)%0+*.%3+=QXZ&* DGF:56>:LC'?>;3\K>?HN
M'0Y1\0:1L)@MY32()BEFE4T#)J#$M2]F@M\3D03%;'[G#@Z_B&M?S$1<T/YB
MQZ.Q/4&> HB$*VRGI>W$Z:@_M>9?PA"%$B92%C/^% Q%#,TI-DDF+6,]=1%(
M%TTB*V;9]SF?X%G)FQ>SR&V[VOVM,<,2RMA>7EY0&<I(5EBEB><;'W @SNJV
MA9V'5Y'WP'TX#6$B!3Q-$;.K*,380G7;HL[S[0'M?O$TJ_!1-H7![ Y%6@5C
M6?HB?K\VN,7L;6!GI[HBB1Q@P5\,L- X"=%8XR2V@9-8@2MHA()&*&B$0FFO
M&J$@$4LC%#9A^2TC%-;0=R0)\-0:(J$A$A6=:XB$AD@4,]00"11##9'0$ DL
M(PV1T!")#=EJB(2&2&B(A(9(;"2?ADAHB(2&2,CY:HC$04(DBIZF)G"D4&N,
MAH2'QFAHC(;X(GZ_5HS&Y97&:$@Q&N%$%\'(_Z#!'5L =Y2VT_4NMH0FV2%R
M06-8T&+N#,-2](.-:C2:1*-)RJ70:!(IZX-"DV@P1R4+#>;08 X)2PWFT& .
M#>;08 X-YM!@#CQ3#>;08 X-YB SUV .#>8H9ZO!'!K,H<$<?U$PA\92:"R%
MQE(\?Q&_7QN68D&N77#?;.B'@*4 1;T42_'=7P9,$?OAU](_;PUST.N4IX>]
ML#:[27KME2M:79,Y$813X-C^DT*0P<(A\*_BO9W<OT[!K_*\'GGQ5,?YI@-?
M'WCTE!D]UF5.YRC?WS0:0-JY1@-H-("<Y;>,!M"U)30<X57"$2[[N'YE#7>(
M<E@$Z>(8H"C6&>'64T5#C=+0*(T2GAJEL2;;-X_2T""*W8,HUI_ZP I H-3H
M#8W>*&>HT1L:O5'!7*,W-'JCG.T.T1O9#06>C;RYQFZ4<M/8#8W=T(4X-'B$
MP$R#1S1X)/]9 8_T>02'1C8.7<[./NEB'%( 21P]Z&(<V1]T,0Y=C*/"+G0Q
M#EV,HUA,78Q#WJN&WTC$TO";35A^R_ ;C7ZI9*'1+[H8AX2EAGEHF(>&>>AB
M'!I'HHMQX)EJ.(>&<V@X!YFYAG-H.$<Y6UV,0P,Z-*#C+PKHT'@*C:?0>(KG
M+UEG@[S9<MK]C[L4O$?^ER_L.K*#>!A&8Y9X8PXAA]DUK7'Y%G$]R@$0+.] 
M/!WN!8<RZ'GCX_)&]S#+W*]J!=)//)\?Y:V/UEMG'\?WKA=]8?E1UV7PY5BA
M+A8D%\J(PS1R^,I4_3%ZRA)^#DB5#4$LD ;+VV;0CY@EX9Z%W+/JIBL7H3BS
MW=J7Z@J%A$\N>-R$?V$?Q/^%C*"Y+.!ZVK%DM2!,AFLYM:4O41H<\@):]R:+
MGJY\]YC^; '.)2)6&/;9[Q=JANWRB1\^U>Z@_5W$:S=>4!/"[&)HY59QM&(6
M1S=VXHP.TCAJ=UYB"'S?7JT$XISIKC7%'J89GN^][_$@>88?LK<N']H0AGR_
M$Z$VT\C.D8C365V"(L*DOKB6E2B4P^,9&-2.X%,8R@M#B7^I^79P6X,)%='6
MB>MZXCK1]H4?J  F2D59EB0-XL2^ =6*T%2 J2HJ*E4(9IIRR2K(&\V7D?=>
M1-ZLOXS\96-O6ALCODYS,W;9#7=L6!DPAW,48*M7CAM=$ZD:!#8GZ3_!AC0^
M?4SRW.9V,&N]5@/!^ADS]8''$-*X)Q!D1%/X2I)N6N:LZ&=]I\F.1/,#91C=
M&O;$!K=CC.P(_-"3(40T;GG (\^)<WQ7#NLIO'2:=7B=K4G8[XZ99?[ /MJ>
MGT),?,SJ/[#L%CG_> VSQ+AO3V+NPA',L)H]%O-UH$M1MVULMW7#--O8;LT6
M7MJZU<5VV\7V:AGM#EH'#;P*&NT.ME>T!NI&NXU6+$'63AT_700CZ*+U:O8(
MBC5;:!4T\;;5,!6HH(Z7E:"!NM50(FL3[0KVWRO:$:!-0/2*7@9H]R)F"VU9
M! ];-]&+BZ0!=*]J9"7UBIZM#J57M-LF.-BZB5ZQ) W@/2&E5[2]DBP+K0&2
MK)8*_[IO>R5Y;24*0+M7->9*Z57-RD+W2MJUT-9*ZE6)6IOH?9LT66COJF0-
MJ#$!TO:"#]WJ2GP+R0THV5_J2B(7?*^DZ4+KE;07JE@$#;3/-M'1JVE8^.C5
MHAAL [\9$F)M\0 KMENT;AM&LX-VAI3S<0>]'>"%)9T."5<O)MZ\FH2[EWI#
MQ=V+B>^UA[\LLXQN SUCI" 6?T]"V<#::*.E"(L/82@VBY>5LG\UE<2&%OY&
M@^"ZS ;:=5F4^<+'<0U"T&GB3PAJ F12>(C?PI1<ZU#,H-[%;^.4O::%#KQ)
MX3S:N @J:'?15D ZT."]+,4*UF5]O1 $?K@0A#M/0"=#X^ST6H,.*D '7(,.
M"()IT($&'6C0P2Y!!V8+??@G@0[J^-") CIHH@,]=)#3-M"BHF-]T*NU?<B!
M99@=%;)V>RIRV,T>W@0HD(,6_MR/O@>T#*NIY+AC*<$<X*\^U-Q5D8YF2C '
M^-5%N0NVE& .\+-%NOE0<G.OY))&3:?HG8"28U"2&,<;JQH#(,FJ),F"QPJ2
M9%7C7/>[!E[3[J+&7$F]*@%'X!<!:<]2TZL2YX(6E=)I"Y\05!*VD$P K5;*
M]H(W5Q+B +\7DI"M:C88=#Q(VF#0ID6*!I2@[_!^@+(,\&N+@CC G[=)B(,6
M/H=/B+0;A)056K66T<0O!!(B7PWB )]NIR .\%$A!7" =[(4P '^L0P2X*"'
MOR4AY83Q"Y>R?RGQW7A928 #_+,IE.U+25S4Q*?:*5 I_.43"6] L%@*WH!@
M!GN'H^*Q;119F_A>*; 3 K1-S4ZCY(A T$!'#=J_JP3DV5[O]=7"#<+)X<,-
M+J\TW* ";@#3J.$&>,$TW$###33<8(=P \LP\7$Y!6_0(CS'47;NM=9.J%VC
MUZX(^$_[U]E,YVK,M'<2!"%,K*@8+=BRCR>?SD\_;#52,CM&0T%.Q330D2(!
MM-#%A[5H2;L0U*EX#H10*0(/6F@8W0)H:ID*T%>)#=)S1DJ0WY3SN)H@7 F<
M7,VSH?@G(/:/66@K.8>UE& 6.DIN>O"X.#7 =TJ> O]  >FV;\_0?U)6"2TK
MQ;+P:0HU&3"2>U62!B7<3N]]@\&7CB(!-Y0\T:_&N>!#:R6I534WJ 0--/'8
M4$JO^&?62+@%)=:*[I6RO^ GBP1;P"]8DAM SQ;IN6 E1:[PP1LI'% "L< _
M7TA8!18>T$[!+;3PU3)*<0OFVGV >#"X8I==O@ZXLIU[^Y:WB-< E)%V\7$J
MI<I"@U O$"]LAX!_HB2XT)9)@#P0[E?PF(>.T<%?,!#<DZ4$\]"BI XISI1@
M7*1]6@6:!/\@$P7ST,8'UJ1G8U1$52;AF?VRE2 N7=?FJU=A!LO.=/:BNO=)
M&%$]:BEJHLC)6U7^I%BNCQ[W7:I@>-R%:9@])5@&-7>(2F[0\/61*79H52&(
MB^<[?ULB>6\G/4&GXNQIX=58IL5N@>M!Y$G*DD_V<\+$./']ZZ<)IR9.*-X,
M7]YFZQBV@@&]6L2(%QPN8L03+_6:1!Q^:\2('#$"JM*($;Q@&C&R>\3(O-\L
MO?[S%*I  7^L$5;,@T:OK.A.HU?R:R7\(_*$D*1+>"((?8/1-*J.5QN<AZV.
MT<97RD3+VFK"(7/[F2:S;BAXZX4)BL7?X:!O6,&[-I1 ))3<-#0).!E"K_B'
MEPC'QB8>=D#I%9\4(=RR-_$/F!#@'$W\F8>4;5-1A*/94I'()MB FEX)^9MF
M6\6E*\%>21I0\0XD16N+4#F((BMZ%5#\*SZ+29DMO&51O#;^XIVTPRA9L7M>
M!*1>551.(CAMTF:HPFFWE< YVFJJG>%#%Y(-J*AK0+ !"IZC6865W] /J #A
M-?%1,2EZ4U$UA* !DJPJJAHT6_@C# 'ET,:?NPD&V\:7>L(+VS8L0D:-!,E0
M<>1J=Q7@1T3\LOWREZ;1Z>%AON@):\*.H.+=.H1S-_Y&0UR4J !0$VP+O7V9
M1AV?!J;(BO<Q%$A&#^]D"-M7#U\ZA7)CB(?-X0L0-(T&?@?'UZ$PC2[^F3\*
M'J+>4Q$@=PFO+:+TJN(.JHOWLG@S$*]84K"!"?R*B@=U" N,H((N_O!%\(=-
M):6_>@61W*N%%<31P\'""OH\>N 1$^*QLT^Z&$4%M "F4D,+\()I:($N1J'3
M^3M,Y]>-#OX))$H^O]G!AY#X?#[I-A!?A;%AM!6\2=&D .<IM204O*.R:UA*
M*GPV"*]I(-22Z. O&2FU),RZ$EPL_K:"\HP?_G$7DJQ*GG15\W9&?,Y-31EE
M2C$));EW0C5QTB/_>R[[L/]B$H27E%)Z5:( %9*J*5".?WIV_V_ :"EYJ8*:
M^JZF"O0%H:"*FC>TJM&KDO>5D$I)*-D*\1L!00$-?(A!ZE7)(L"[+#5O02&]
M4P$?9M:5[(5J7EI.JB6AY!U+^$B;-%UJ7C.F NAL$4XP!.Q!DU -CF"QIHHW
M=EA&BW T(H /+,*5!@'6@:^#1*H'@5\*!/"!A??=E((0)OXE\Y2R!7A( PU]
M@$^24SPBOE=:00@EPN)K8E#@!P1$&F$'LY0\0E['>P/*^P^:!)@792W@WP%!
M>0T&X>Z8HEDU55*55(93 #Z V<*#?DF -"75+$W\PRIH%;0,%4NVLG+59H95
M4(1YZ4N>UE\$'RQGA'/V>2L0(K*#>!A&8R82:B([4N]TQS&%HMGJ=H@4O5Z/
M2&%UJ13M^NHXEKYDF?=R+>6?9YFV?Y3_R*G8_RQB&N(LW\<JJ5"\*A*#[WV/
M!\D<.?'6Y4,[]9/OV=5)OU]0XV.9?/8&D+/3:QJ!>&5(216198+%BA$H#JM8
MD *BTAZN?&[' I81N,SE":PU[L)*B4$A,4L#%_K=+>I&('VXDX31DU$^@B1,
MG='1<.H9C@2HI,A*G7#R](6]A]\BQ6OFX),D5#>B<HD7AGHL&9?\S^]^^W3^
MH<B(M@*GR3X:CV/_N%4WCUD_',\0)L/,+,KEN@X3VY_ZEW:7C;T@!4*6WP:&
M@;NLES/XS3YG)@;NZ$W15+5[5C99,6JVIN9:R^ _F<MZ,S6 /[T):$TT$KW"
M-P2&;+VW@56'6,BTK $<.5H&=//FS?4(-I]'[J0"KC"=$O;52T8L@;\,0]\/
MOTYQ3WPBVAQG) M_$#L9"QTGC2)8<E]'PC:G/<*?DY$7,]\+P*XE$MNN/8&E
MLBCL[-^RB>RTCP5H*>+LJ_@U;\5F:^?-CS7[IQ]KX&[@]TWH/L'_1LG8_^G_
M 5!+ 0(4 PH    ( (*-=C?NTY] I1P  '_C 0 2              "D@0  
J  !E>&5C=71I;VY?;&]G+FAT;6Q02P4&      $  0!     U1P      
end

Mime
View raw message