harmony-alerts mailing list archives

Site index · List index
Message view « Date » · « Thread »
Top « Date » · « Thread »
From nom...@intel.com
Subject [build-test alert] FAILED Windows 2003 x86: jdktools-test debug
Date Mon, 19 Nov 2007 22:40:13 GMT

BUILD FAILED:
	Ant Error Message:
D:\cc\cc-common\scripts\cc-exec-adaptor.xml:104: The following error occurred while executing
this line: D:\cc\cc-common\adaptors\jdktools-test\adaptor.xml:28: The following error occurred
while executing this line: D:\cc\cc-common\build\checkouts\hdk\working_jdktools\build.xml:242:
The following error occurred while executing this line: D:\cc\cc-common\build\checkouts\hdk\working_jdktools\make\build-test.xml:98:
There were test failures.

Date of build:	2007-11-20 04:18:17 +0600
Time to build:	21 minutes 48 seconds
Last changed:	11/19/2007 23:49:08
Last log entry:	hdk

***********************************************************
Errors/Warnings:	(229)
            
Result: 1
[cc-ant]: Test Suite 'jdktools-test' execution. Repository updated: ${repository.updated}
[cc-ant]: Check for 'run' failure of hdk = ${hdk.parameters.run.failed}
[cc-ant]: Result: failed.superiors = '${failed.superiors}'
========================================
Testing jdktools binaries...
========================================
Compiling JPDA tests
Since fork is false, ignoring memoryMaximumSize setting
----------
1. WARNING in D:\cc\cc-common\build\checkouts\hdk\working_jdktools\modules\jpda\test\common\unit\org\apache\harmony\jpda\tests\framework\DebuggeeRegister.java
(at line 58)
registered.add(debuggee);
^^^^^^^^^^^^^^^^^^^^^^^^
Type safety: The method add(Object) belongs to the raw type LinkedList. References to generic
type LinkedList<E> should be parameterized
----------
----------
2. WARNING in D:\cc\cc-common\build\checkouts\hdk\working_jdktools\modules\jpda\test\common\unit\org\apache\harmony\jpda\tests\framework\TestOptions.java
(at line 505)
internalProperties.put(name, value);
^^^^^^^^^^^^^^^^^^^^^^^^^^^^^^^^^^^
Type safety: The method put(Object, Object) belongs to the raw type HashMap. References to
generic type HashMap<K,V> should be parameterized
----------
----------
3. WARNING in D:\cc\cc-common\build\checkouts\hdk\working_jdktools\modules\jpda\test\common\unit\org\apache\harmony\jpda\tests\framework\jdwp\PacketDispatcher.java
(at line 114)
eventQueue.add(eventPacket);
^^^^^^^^^^^^^^^^^^^^^^^^^^^
Type safety: The method add(Object) belongs to the raw type List. References to generic type
List<E> should be parameterized
----------
4. WARNING in D:\cc\cc-common\build\checkouts\hdk\working_jdktools\modules\jpda\test\common\unit\org\apache\harmony\jpda\tests\framework\jdwp\PacketDispatcher.java
(at line 249)
replies.put(new Integer(replyPacket.getId()),
replyPacket);
^^^^^^^^^^^^^^^^^^^^^^^^^^^^^^^^^^^^^^^^^^^^^^^^^^^^^^^^^^^^^^^^^^^^^^^^^^^^^^^^^^^^^^^^^^^
Type safety: The method put(Object, Object) belongs to the raw type Hashtable. References
to generic type Hashtable<K,V> should be parameterized
----------
5. WARNING in D:\cc\cc-common\build\checkouts\hdk\working_jdktools\modules\jpda\test\common\unit\org\apache\harmony\jpda\tests\framework\jdwp\PacketDispatcher.java
(at line 284)
commands.put(Id, command);
^^^^^^^^^^^^^^^^^^^^^^^^^
Type safety: The method put(Object, Object) belongs to the raw type Hashtable. References
to generic type Hashtable<K,V> should be parameterized
----------
6. WARNING in D:\cc\cc-common\build\checkouts\hdk\working_jdktools\modules\jpda\test\common\unit\org\apache\harmony\jpda\tests\framework\jdwp\PacketDispatcher.java
(at line 355)
commands.put(Id, command);
^^^^^^^^^^^^^^^^^^^^^^^^^
Type safety: The method put(Object, Object) belongs to the raw type Hashtable. References
to generic type Hashtable<K,V> should be parameterized
----------
----------
7. WARNING in D:\cc\cc-common\build\checkouts\hdk\working_jdktools\modules\jpda\test\common\unit\org\apache\harmony\jpda\tests\framework\jdwp\VmMirror.java
(at line 1834)
frames.add(frame);
^^^^^^^^^^^^^^^^^
Type safety: The method add(Object) belongs to the raw type ArrayList. References to generic
type ArrayList<E> should be parameterized
----------
8. WARNING in D:\cc\cc-common\build\checkouts\hdk\working_jdktools\modules\jpda\test\common\unit\org\apache\harmony\jpda\tests\framework\jdwp\VmMirror.java
(at line 1902)
vars.add(var);
^^^^^^^^^^^^^
Type safety: The method add(Object) belongs to the raw type ArrayList. References to generic
type ArrayList<E> should be parameterized
----------
9. WARNING in D:\cc\cc-common\build\checkouts\hdk\working_jdktools\modules\jpda\test\common\unit\org\apache\harmony\jpda\tests\framework\jdwp\VmMirror.java
(at line 2122)
fields.add(superClassFields.toArray()[i]);
^^^^^^^^^^^^^^^^^^^^^^^^^^^^^^^^^^^^^^^^^
Type safety: The method add(Object) belongs to the raw type ArrayList. References to generic
type ArrayList<E> should be parameterized
----------
10. WARNING in D:\cc\cc-common\build\checkouts\hdk\working_jdktools\modules\jpda\test\common\unit\org\apache\harmony\jpda\tests\framework\jdwp\VmMirror.java
(at line 2132)
fields.add(field);
^^^^^^^^^^^^^^^^^
Type safety: The method add(Object) belongs to the raw type ArrayList. References to generic
type ArrayList<E> should be parameterized
----------
----------
11. WARNING in D:\cc\cc-common\build\checkouts\hdk\working_jdktools\modules\jpda\test\common\unit\org\apache\harmony\jpda\tests\jdwp\DebuggerOnDemand\OnthowDebuggerLaunchDebuggee.java
(at line 94)
class ExceptionForDebugger extends Exception {
^^^^^^^^^^^^^^^^^^^^
The serializable class ExceptionForDebugger does not declare a static final serialVersionUID
field of type long
----------
----------
12. WARNING in D:\cc\cc-common\build\checkouts\hdk\working_jdktools\modules\jpda\test\common\unit\org\apache\harmony\jpda\tests\jdwp\Events\ClassUnloadDebuggee.java
(at line 32)
import java.util.LinkedList;
^^^^^^^^^^^^^^^^^^^^
The import java.util.LinkedList is never used
----------
13. WARNING in D:\cc\cc-common\build\checkouts\hdk\working_jdktools\modules\jpda\test\common\unit\org\apache\harmony\jpda\tests\jdwp\Events\ClassUnloadDebuggee.java
(at line 97)
boolean isOutOfMemory = false;
^^^^^^^^^^^^^
The local variable isOutOfMemory is never read
----------
14. WARNING in D:\cc\cc-common\build\checkouts\hdk\working_jdktools\modules\jpda\test\common\unit\org\apache\harmony\jpda\tests\jdwp\Events\ClassUnloadDebuggee.java
(at line 171)
public Class loadClass(String name) throws ClassNotFoundException {
^^^^^
Type safety: The return type Class for loadClass(String) from the type ClassUnloadDebuggee.CustomLoader
needs unchecked conversion to conform to Class<?> from the type ClassLoader
----------
15. WARNING in D:\cc\cc-common\build\checkouts\hdk\working_jdktools\modules\jpda\test\common\unit\org\apache\harmony\jpda\tests\jdwp\Events\ClassUnloadDebuggee.java
(at line 179)
public Class findClass(String name) throws ClassNotFoundException {
^^^^^
Type safety: The return type Class for findClass(String) from the type ClassUnloadDebuggee.CustomLoader
needs unchecked conversion to conform to Class<?> from the type ClassLoader
----------
----------
16. WARNING in D:\cc\cc-common\build\checkouts\hdk\working_jdktools\modules\jpda\test\common\unit\org\apache\harmony\jpda\tests\jdwp\Events\CombinedEvents002Test.java
(at line 100)
boolean expectColocatedEvents = (testedMethodStartCodeIndex == testedMethodEndCodeIndex);
^^^^^^^^^^^^^^^^^^^^^
The local variable expectColocatedEvents is never read
----------
----------
17. WARNING in D:\cc\cc-common\build\checkouts\hdk\working_jdktools\modules\jpda\test\common\unit\org\apache\harmony\jpda\tests\jdwp\Events\CombinedEvents003Test.java
(at line 53)
private boolean eventMethodExitReceived = false;
^^^^^^^^^^^^^^^^^^^^^^^
The field CombinedEvents003Test.eventMethodExitReceived is never read locally
----------
18. WARNING in D:\cc\cc-common\build\checkouts\hdk\working_jdktools\modules\jpda\test\common\unit\org\apache\harmony\jpda\tests\jdwp\Events\CombinedEvents003Test.java
(at line 76)
int EXPECTED_EVENTS_COUNT = EXPECTED_EVENTS_ARRAY.length;
^^^^^^^^^^^^^^^^^^^^^
The local variable EXPECTED_EVENTS_COUNT is never read
----------
----------
19. WARNING in D:\cc\cc-common\build\checkouts\hdk\working_jdktools\modules\jpda\test\common\unit\org\apache\harmony\jpda\tests\jdwp\Events\CombinedEventsTest.java
(at line 84)
int EXPECTED_EVENTS_COUNT = EXPECTED_EVENTS_ARRAY.length;
^^^^^^^^^^^^^^^^^^^^^
The local variable EXPECTED_EVENTS_COUNT is never read
----------
20. WARNING in D:\cc\cc-common\build\checkouts\hdk\working_jdktools\modules\jpda\test\common\unit\org\apache\harmony\jpda\tests\jdwp\Events\CombinedEventsTest.java
(at line 212)
int EXPECTED_EVENTS_COUNT = EXPECTED_EVENTS_ARRAY.length;
^^^^^^^^^^^^^^^^^^^^^
The local variable EXPECTED_EVENTS_COUNT is never read
----------
21. WARNING in D:\cc\cc-common\build\checkouts\hdk\working_jdktools\modules\jpda\test\common\unit\org\apache\harmony\jpda\tests\jdwp\Events\CombinedEventsTest.java
(at line 348)
int EXPECTED_EVENTS_COUNT = EXPECTED_EVENTS_ARRAY.length;
^^^^^^^^^^^^^^^^^^^^^
The local variable EXPECTED_EVENTS_COUNT is never read
----------
22. WARNING in D:\cc\cc-common\build\checkouts\hdk\working_jdktools\modules\jpda\test\common\unit\org\apache\harmony\jpda\tests\jdwp\Events\CombinedEventsTest.java
(at line 732)
String failureMessage = "## FAILURE during checking events! !";
^^^^^^^^^^^^^^
The local variable failureMessage is never read
----------
23. WARNING in D:\cc\cc-common\build\checkouts\hdk\working_jdktools\modules\jpda\test\common\unit\org\apache\harmony\jpda\tests\jdwp\Events\CombinedEventsTest.java
(at line 894)
String failureMessage = "## FAILURE during checking events !";
^^^^^^^^^^^^^^
The local variable failureMessage is never read
----------
----------
24. WARNING in D:\cc\cc-common\build\checkouts\hdk\working_jdktools\modules\jpda\test\common\unit\org\apache\harmony\jpda\tests\jdwp\Events\CombinedEventsTestCase.java
(at line 135)
long methodStartCodeIndex = lineTableReply.getNextValueAsLong();
^^^^^^^^^^^^^^^^^^^^
The local variable methodStartCodeIndex is never read
----------
25. WARNING in D:\cc\cc-common\build\checkouts\hdk\working_jdktools\modules\jpda\test\common\unit\org\apache\harmony\jpda\tests\jdwp\Events\CombinedEventsTestCase.java
(at line 187)
long methodStartCodeIndex = reply.getNextValueAsLong();
^^^^^^^^^^^^^^^^^^^^
The local variable methodStartCodeIndex is never read
----------
----------
26. WARNING in D:\cc\cc-common\build\checkouts\hdk\working_jdktools\modules\jpda\test\common\unit\org\apache\harmony\jpda\tests\jdwp\Events\ExceptionTest.java
(at line 188)
long frameID = reply.getNextValueAsFrameID();
^^^^^^^
The local variable frameID is never read
----------
----------
27. WARNING in D:\cc\cc-common\build\checkouts\hdk\working_jdktools\modules\jpda\test\common\unit\org\apache\harmony\jpda\tests\jdwp\ThreadReference\FramesTest.java
(at line 450)
frames.add(new FrameStruct(frameID, loc));
^^^^^^^^^^^^^^^^^^^^^^^^^^^^^^^^^^^^^^^^^
Type safety: The method add(Object) belongs to the raw type Vector. References to generic
type Vector<E> should be parameterized
----------
----------
28. WARNING in D:\cc\cc-common\build\checkouts\hdk\working_jdktools\modules\jpda\test\common\unit\org\apache\harmony\jpda\tests\jdwp\share\JDWPUnitDebuggeeProcessWrapper.java
(at line 233)
argv.add(val);
^^^^^^^^^^^^^
Type safety: The method add(Object) belongs to the raw type Vector. References to generic
type Vector<E> should be parameterized
----------
29. WARNING in D:\cc\cc-common\build\checkouts\hdk\working_jdktools\modules\jpda\test\common\unit\org\apache\harmony\jpda\tests\jdwp\share\JDWPUnitDebuggeeProcessWrapper.java
(at line 253)
return (String[])argv.toArray(args);
^^^^^^^^^^^^^^^^^^
Type safety: The method toArray(Object[]) belongs to the raw type Vector. References to generic
type Vector<E> should be parameterized
----------
29 problems (29 warnings)
JPDA exclude list: D:\cc\cc-common\build\checkouts\hdk\working_classlib\deploy\build\jdktools.jpda.exclude
Running JPDA tests
Debugger JVM=D:\cc\cc-common\build\checkouts\hdk\target\hdk\jdk\jre/bin/java
Debuggee JVM=D:\cc\cc-common\build\checkouts\hdk\target\hdk\jdk\jre/bin/java
SAMSA exclude list: D:\cc\cc-common\build\checkouts\hdk\working_classlib\deploy\build\jdktools.samsa.exclude
Running SAMSA tests
test.jre.home=D:\cc\cc-common\build\checkouts\hdk\target\hdk\jdk\jre
Run jdk/bin/java -version in D:\cc\cc-common\build\checkouts\hdk\working_jdktools\build\test_report
java version "1.5.0"
pre-alpha : not complete or compatible
svn = r596382, (Nov 20 2007), Windows/ia32/msvc 1310, debug build
http://harmony.apache.org
Run jdk/bin/javac -version in D:\cc\cc-common\build\checkouts\hdk\working_jdktools\build\test_report
Run jdk/bin/javah in D:\cc\cc-common\build\checkouts\hdk\working_jdktools\build\test_report
Run jdk/bin/javadoc in D:\cc\cc-common\build\checkouts\hdk\working_jdktools\build\test_report
Run jdk/bin/jarsigner in D:\cc\cc-common\build\checkouts\hdk\working_jdktools\build\test_report
Run jdk/bin/keytool -help in D:\cc\cc-common\build\checkouts\hdk\working_jdktools\build\test_report
Compiling TOOLS tests
Since fork is false, ignoring memoryMaximumSize setting
----------
1. WARNING in D:\cc\cc-common\build\checkouts\hdk\working_jdktools\modules\tools\src\test\java\org\apache\harmony\tests\tools\javah\Test\Test01.java
(at line 24)
private static final long xxx2 = 1;
^^^^
The field Test01.xxx2 is never read locally
----------
1 problem (1 warning)
TOOLS exclude list: D:\cc\cc-common\build\checkouts\hdk\working_classlib\deploy\build\jdktools.tools.exclude
Running TOOLS tests
test.jre.home=D:\cc\cc-common\build\checkouts\hdk\target\hdk\jdk\jre
The test report is in D:\cc\cc-common\build\checkouts\hdk\working_jdktools\build\test_report\html\index.html
The execution FAILED with the following exception:
The following error occurred while executing this line:
D:\cc\cc-common\adaptors\jdktools-test\adaptor.xml:28: The following error occurred while
executing this line:
D:\cc\cc-common\build\checkouts\hdk\working_jdktools\build.xml:242: The following error occurred
while executing this line:
D:\cc\cc-common\build\checkouts\hdk\working_jdktools\make\build-test.xml:98: There were test
failures.

***********************************************************
Unit Tests: (161)
        
failure: testClassUnloadEvent org.apache.harmony.jpda.tests.jdwp.Events.ClassUnloadTest
Unit Test Error Details:	(1)
                
Test: testClassUnloadEventClass: org.apache.harmony.jpda.tests.jdwp.Events.ClassUnloadTestjunit.framework.AssertionFailedError:
No ClassUnload event, but tested class not found: count=0
	at org.apache.harmony.jpda.tests.jdwp.Events.ClassUnloadTest.testClassUnloadEvent(ClassUnloadTest.java:136)
	at java.lang.reflect.VMReflection.invokeMethod(VMReflection.java)

***********************************************************
Modifications since last successful build:	(1)
            
add cc-hdk log20071119234908Lbuild.363 11/19/2007 23:49:08hdk

begin 644 execution_log.zip
M4$L#! H    (  0E=#>U41/F)1(  -%^   2    97AE8W5T:6]N7VQO9RYH
M=&UL[5W_4]NZLO^9SO1_T#UWWMPP0TR^![@I;WA ;^DII8_0GO>FZ>L(6TD,
MCN4KV4!NY_SO;U>RD]A.G "BA,[-M(PM2ZO5?G97J[4M=X;AR-OO7')GO-\)
M!-OO4"+#L<?>_*W/_; LW7^Q/;)3^8^__VW_]:LH<&C(RO+&WWO]ZO6KLF1A
M%)2OG.N0<T^6;Z4NCJMERT6$S8ZBP'-MN.Z00/ K9H?$IR-&7)^XHX"+T"*?
MXO(+'I0_L!OF8<V B7!,'-9W?3=TN2_U,9#INT*&V/YHKV?;\*]L\]&(^SUI
M"S<(92]N[3)IW8T\0GV'T '%#O-M+B/7<WKVD-G7/(*V0^>Z=\O%M>L/OB<#
MZHWH-<M0Q0&&3(8P0H*_K\P>\F_DU9L5?Z\NH#%T0I).R*7K4X'4+6MU*LB&
M[3'JEY$9688Q!%&HQ&_S8%R^$JS<=SVF$;&'(^YDR^)J>\F(RE GTE?5P$;7
MCBN^D4/!%(APLO<P*>I*V,5WP1#YI^M XF#4J99+!J5#/@I<#Z7__M/1 8E;
M/!DS/=NC4K*DBRMZ0^U9)FKM*I$\$C8C"A<2\B?JL^OZV FT(ZXD?>I)MD7<
M@<\%\C%B(R[&I_3.'46C+G@" @:/2IHF4I[\TN55B_QQ</[QY.,_'FYH6O5Z
M5^!1U#AZ<>L(G$"/BT&/!A1H](940/%X6E'V^@+<"E+L';'+:#!@[)P-7!DR
M82&#:5Y)B88$A,](<V<S?6E#Q,V88U''*3DQM<V_DTS%_UOP2U>[& <@2-IG
MX7B/7 P9B#D<<G!)0/OL$AW?)KED'O<'"O@0:@AZ2T)L]L'UKYGS =BQR#GK
M T^ GZHV8#X3KIVMUCG>)W+((\\!FB2@*!,8"F#IK ;BHO+:NH"+?O,L4#-"
M,:Z59A98UP=1^-3[-/7DX"Q+.!UMD1OJ18#QBA#?&VWL2*.]19:A_H[*X2D-
M"B&/ZW1^W_KR1(C7UP7Q*^<VZ'VB]C4+CUP9T!!:%-MTM=K(8@]AA1_^=\0B
MIHQ:G6J:]\'<I&4OM6D#UMQXN1C6&KMYQPRA9&*T[):<@#T/F"AA^5@3MP8L
M/'%*FYM;&;I+?C,D'N(#'OI[&M\1TDN/+?4>JI8!_]%\P3JVD_,3V#$L&+22
MG3A;)"Y872M^!4Q;+Q?3>C,W[_\;TZ+R]EIA_65TZ@K!E\SO._6<X2HZ4DWN
MZG YN.8F\P,AZ'CIC#ZI]>AI?><%0K9;J64ANZ%" P8'Q7"]7*AV7QY4M6HM
M!U7?99ZCP9(1+)X.,;OP5A>&7(FKM/G5_?;PX.GE0ERMO$2,ZT48J\-?V8,N
MQ/*9DU@*P3A_)<[\(X9Q2N_,!T'>)L4?:.3;PR3)50CS;CZ^1<,EQW<V4SF4
MMUPD9 F["QE$2=.+Y$>FL5XKK6"]0TP="I=Z[K\P>B$%O3H<@/9Y2!P&M00C
M>$."A@!YW_6I%]/YPH2$AI]/CHC23<+[6B50G1X)^3.GMA3DQYB/D#WE5C_[
M'J?.2OCFC5C?4R%X:D6AZUG3W&#6G,E]X"R@BZEDG]T EI%<V6<^<W;I,4+?
M;6>%?@G\,.J#(,ZB\*Q_JO+HY(U.L"\0.UDB<(_;H/T0&;G*@M*D)Q(7C*XJ
M\6?.!3U&XM5V-2OR(+KTP$<H2@0)J:-2-U1W,C"ENPDSC."W4M?YR,.W//*=
M9<Z-K#*Q"19&PM<.2'/0YR+'Q2;I"SY2\]RT9F;4AY$,^>@#% &8/F/@?M&Y
M PK,@66J?Z/]'LZ$< :]C/!04>K\Y_Z\#C2M%77BF7,WC].)7'XPI1,P>ZR!
M3F2Y6'^=6*@KSYP32ND*'UWBHP#ZM%*IX4VA8FVI5!8Y;7870&AZR-'AA@E-
M<-XE[)<YIRJ([8940!V'G?@.NR-OWI#9J\< <G(M%S7/]?<K^_WYW#W _R_$
M]9GS/T6XUI?BVJSGG(!P;T!29 (OTHIANG/#<V8S]P8,:<GL7(C:/-QT6#I_
M!(MX2,&HD??&*\+VS#F@Q\'6;LVY-TN._^?3\>'%\='WXR_''R^ZWP_//G^\
M *"RY0?GYP?_:WG,'X3#>?@]S-+F]V[2TIXY%[08LJ5XY>^3_$)XU9XY?_,(
M7&K5_ +P%P)F'9(Q#P.FWL@]5O0K ;-.*9/[ =/.ITSB]4&?NEXDV"F3D@X8
M@/+;7_]*WAZ<?/A\?DR<2-518\(#-:/+OY"__+925F4I-)G.'X+).F54[CF[
MY-.4#\=DC2!9"-4ZI6)R4!U2N63E7<_=8<<L;)SNSZZ45)L+E.@Y/F.##^A\
M9'?A%WS<[@!6IOZ@-'_)]" 7-Y>'AUC3.F5&'@#13BY'6021>$'(+$1LC?(3
MDX32\KS$3BY.4$"I>WHG1PNP>:NO%L.SW,'%?9@$81V2"1=#',CD-F)/26OY
M+-1HYE)$,\^4X/.&BA#,3)$=EF+A;:%0-]?AKO<7N,I%X>U37>7I'A%?AY2$
MA NL]_[HCT^?H4624_TD. A$_B%H$"Q[)K">2RE1,;B)GU/Q?M9S*C\/SMHZ
MI"4>#UL^$QAGY./,^]=OFPK'Y&D5.)$+<[63WT,M-NE%PPQ]KP70^%X=>/Z1
M)"4XN:7"!\'(37Q9*H!Y!B HLSO;BQR6>6%*O2857P)YR_!^+T6IV_^>>]ES
M8#+CX[ANHCT6*H,54X]?')S[VM9YY/OS7MI*KA,R>:K@_9?3-ZMP".$(3*WJ
M\ K_"[8-L=;V5--RM)DYVE^OT#RFXP([L;2=6+&=:-&HH5IH)]875X01]4ZA
M$FB]%3\6@7-;FB262()O8)+J%GFKES)RCU2VR#$^'*0/+]P1(\RC@63.'FE9
M]7:32&8_GE3#VFWMFB%ECJ.=AB&.K$J]^FN3@K"TD%1]55+5IE6K%FM";65:
M%1ABS9@ZU(N'>!_![Q9KUNK2:ECMW78AK<:JM.HMJ])HF1IB;<>0;H'@*_?@
MJEKDKV"$[7G2.NY>K.)+]6+-FKD%CURH]-+QD0FA-4UI:].J%]M0:V6MJ%KM
M8KU?V1QWK9V:(1.ZIU(4BZK1,L>5.1]1JQN;?6JM8EFM["*JNU:K9FY2K!J"
M$.1>,^CFB_WI<^CHVG*UGJ1,R:IIM1KF9C&#*FI05DNXND^L5346339;QF2U
MTS2TK !9->OKB*"Q=9/18-D45X#@KCD;-#4]F^6JMI9.QAR")DFMI0V:5(;U
MY,J47AE+SNR8\R_F<E@F29F;M]9Q@##9+%E6KIP#J36,KBM-.1AC@JHM2? \
MTTQC*CFZIJ9L-%PO!K!Y#TTW*':3,XW!(-O<XJW:-$2J:G NK1I4K:I!$)'6
MCC&?M5,M]J+WR!F:FW&J;6/9U4K#G)96S*W?JL6RND^F=HF^WX?4$@17O]G1
MMAJF5!0LNF%N)6%RL6MN?.8F:(.QJ"FN:N#>C<U?QFZ$KN=B'CQ#RYBR[ZQE
MU& N6BMP5_-N]#W\48QWW)MY0O?QK.^:N^?::H.A&I)HVVHW#.'<7AI7W(>K
MBCE2YNYUF_+_K1VK5C6T*$:Q&U,&8Z1:9FFU3=UN-4BJ:<Y%MG"I$#NVUZ]"
M'MG#<OR^BE1[N^]-RYDB,E/*)GN\[RU_\J][<-I]PD?_)!W)F6?_L%^;^S8%
MN7SDT*VK-\G7VZ+C1OX^)S[#-^])R.["+>)PM;<##X=JG_+E#P_J :D:Z0I8
M9%T)</A\Q![X@%^N2]S>?_+4'RDG6S<\]#G;!5OH0X=WS/Y&#M2,1=[I&8OH
MC:*8('ND9&^20QZ,A3L8AJ2ZNPNJ5JO :A.?68V;=7D_O,4=F-2F&%1MB,$%
M<4$[/==FO@0UVB(4< C4)QUP\\IT_VJ0R1A_JUH0J?Q&TE5 V\K4"X84F,)=
MGV#T@<="ACWA,70+=--MY(V/+T(T=UOU'5BIE#[R&V >^6]O;I$_7-_AMW+;
MI?7:]DC>V*1:KX+%J'W;B9)8FMPP#(.][>UD7H^G>9CQB]&SGQR^8]MSP;[)
M>Q2C_CP @%>QVFU JV[5+1C5%,23_SJ%,Q&@'"H*S;9%#CR/J,O@49ADXH8Y
M5O&PAD\UFO<?3\KJTR)DR-16)MJ(U9/-%!]Y3E=/GWW&=^[VYH5A\2/#R+EU
MBA_U^,KU;O#?2$=O,X8;O<C](NJ3)NEB0LJ7G(>*"BCBD'3P[[ZRD8$+L1U1
MI;<N"!D?P891,]]!5\2SA.;_\,%OA_5IY(7QEFA(L% 0P%..'_PMX D?E/\)
M+''2033W4Z10]Y"<_@;)A"7!'%<P&UVVZ]^'+1DPV^V[ZHLO.5>38\DA'=T/
M%^,)7PE+*0U,&+/C;WR #J6Z6XW#26?D=NC:PSS5/GA._6X5OL- Q7C9"%P?
M+"/;S8DJC#_F,:-ZZL4(Z(9&(1^!TU1;ARSK ?S7)0<'DX4-=T02\?R('@!6
M,<OX3=G:+#45(ZCM^7!3E BX(O^$99(&<J;1:E*6&)LH>5Z.<6= \ 5933AG
M$I07@J=B/^=P^\D\'9 _0O)Z(T,79S24(7 ]9F$16S"=#!#?)V-,='4'0^8%
MUCP7NS%EXD?L%?\D[P_.5;Q( #>:06JF >J3VQ_/:5BD.7&K#?B1F   BQ0=
M;$_R[<O7;"S!U!CI)$??E2?<4*\TZD!%*UQR/4- E:EW::84\!0HJ-(56@>H
MN;/]2PEP.$!APEU2EN=^TGBFW09)MBJ"\DE;4@+'X;C]/H0:>BNO.7UN9AE4
MT@-@M%O^C@:&':@/;<5C*Y8P7%6 SV]O==^JX-LZ@M!9.=$\I,JQ;*A1\1L7
MU@K4<=2'NZ@7SPBY+CVPD703&#*[3280. NXE/EXL&PS 0&.TB#'E8%'QP2+
MP,?@)EF2E"+@Y=:%>3%14>0^X3(KO5!2TKGH'GS_?/YA'VFFE K67:  =!2@
MJQURX8;C?'OL7=/ H^_*;&8U0Q4D2$"U678SU$ 6=V/2&7*P:1 A1'%R_\=>
M!XU[_T\E*KBL(CNP:JA$XDIJB%AKBS!K8.F*EJYH@4_9J];JC7E]:;/ OQ/<
M9VTBU6'IW<7%)PS5NV>'OW>S@HQA%-K+ZQD"R4V]/A*UQ3@(^4#0 .9-11@6
M%XD*B 4D5>-.PE]2JFAFK4W.9^->7*B]^T;4IP.<$A>XA6E/:>ZF_J" 33 X
M4WSBK*"U'6V<AI@$6-Q;FM=)BT)F45O-<SMKL@4=SC(\VZ:0XY%CGM]1O!.(
MXPY2V8-LCVD)IULM8#H7&H .X0Q/RCAQ/U5XD#[[/>XR4G%!^EK"SH]R)_YV
MAO85?\Z6Z"@ RSKZ\+OZIM;^GY9ED?+[#D9A2:5"1GQ^ZR??Z) 93C:4;@CV
MSXV-?^B5)$LI!5R))OGWF48H*%MX&QN'>)2>+@2[23P^;CT=92.>LMYT,X3&
M^F!JXB$'O\O#H586",2S31V&V0V85<[9B-\P E,>+!G4Q#[?K6R4V1U"!4V.
MU4%J>-B?FH'1"<O0X=EI=:,,"VR@#,V[#-8BBE>LK(,,5R0+<!AMMB7J&K2[
M&$(@J_0NT5VN T@" J(),-G&>H-H:'ZB=XJF*;Y+]A#6ZIM(B9+#[KG>UB)+
M WBT/>Z#N"9?#87JR+D2VYSJ*B1R$%7J#]*15+8V1%M^:"L8/^$ARE)+,,.K
M B<?(VV4)?/ZFL!$]2!RA<(X $M142YCDL $QG+4DJ@RS7]1*+DQC9V_))'S
M;)]*R$6F]0Y1+#)P[6]^9*P\DZ:"\&)O(]-$:UVV[WRV>96/<EZ<G7WHIK[*
M&;_!/JW2_/<',U,;+^@S*6R]^P)V,&_;!3U275FET-3G%-6?2G7)Y]@6;;2:
MVJU?;5YS=W=7(V](=>GN"I/?_/UJ]):J,7.*Z&,V3$TV/R"E:K+UP0H['VA=
M?++['_KOS[S_D3,N\_<_5KB9/AT]?DQ QO?5(03IHOO3^U5W*2!=>#-]Y<>6
M&B:?RUIV7WYEKBI6)7DSZK$W\72 4P9'56:C(!SKPCA-.%.4+\$475E'AW"N
MAZ-/85""^E)O, Z,P]AKK=8HHS9HJ,@-T8W01(V%JSW\6GG/Q:W"+#Q$?B6L
MP<,IPZ]?P<PS>ZH%H>0C=&;P]:M7R"3.29$*\O2#'WJ&5EE*CBE0M85@LG'7
MGFHR<P'E3[AM1T* [=T.76]"$2Z'&#*AG\0/GF>&3AT*:PPA)T:OF$N*\5OB
M>[4=O7F,D?Y6%[7NNU'[V9VKSZE/ P'%QJX6 80^M_A':51B#!; VMFF^YUM
M]<7Z;?WU^FWU*?O_!U!+ 0(4 PH    (  0E=#>U41/F)1(  -%^   2    
M          "D@0    !E>&5C=71I;VY?;&]G+FAT;6Q02P4&      $  0! 
)    51(      
end

Mime
View raw message