harmony-alerts mailing list archives

Site index · List index
Message view « Date » · « Thread »
Top « Date » · « Thread »
From nom...@intel.com
Subject [build-test alert] FAILED Linux x86_64: dacapo
Date Mon, 19 Nov 2007 21:59:30 GMT
svn.revision=596127
BUILD FAILED:
	Ant Error Message:
/export/users/cc/cc-suites/scripts/cc-exec-adaptor.xml:104: The following error occurred while
executing this line: /export/users/cc/cc-suites/adaptors/dacapo/adaptor.xml:112: Not all workloads
completed successfully

Date of build:	2007-11-20 03:59:21 +0600
Time to build:	5 seconds
Last changed:	11/20/2007 03:58:20
Last log entry:	snapshot

***********************************************************
Errors/Warnings:	(70)
            
java version "1.5.0"
pre-alpha : not complete or compatible
svn = r596127, (Nov 19 2007), Linux/em64t/gcc 4.1.0, release build
http://harmony.apache.org
===== DaCapo antlr starting =====
ANTLR Parser Generator   Version 2.7.2   1989-2003 jGuru.com
===== DaCapo antlr PASSED in 669 msec =====
===== DaCapo bloat starting =====
** Exception while optimizing simplify(LEDU/purdue/cs/bloat/tree/Node;)LEDU/purdue/cs/bloat/tree/Node;
of class EDU/purdue/cs/bloat/trans/ValueNumbering
Assert.isTrue: Null parent for class EDU.purdue.cs.bloat.tree.LocalExpr node 0
java.lang.IllegalArgumentException: Assert.isTrue: Null parent for class EDU.purdue.cs.bloat.tree.LocalExpr
node 0
at EDU.purdue.cs.bloat.util.Assert.isTrue(Assert.java:33)
at EDU.purdue.cs.bloat.tree.Node.parent(Node.java:158)
at EDU.purdue.cs.bloat.trans.ExprPropagation.propExpr(ExprPropagation.java:239)
at EDU.purdue.cs.bloat.trans.ExprPropagation$1.visitStoreExpr(ExprPropagation.java:124)
at EDU.purdue.cs.bloat.tree.StoreExpr.visit(StoreExpr.java:104)
at EDU.purdue.cs.bloat.tree.CheckExpr.visitForceChildren(CheckExpr.java:67)
at EDU.purdue.cs.bloat.tree.Node.visitChildren(Node.java)
at EDU.purdue.cs.bloat.tree.TreeVisitor.visitNode(TreeVisitor.java:369)
at EDU.purdue.cs.bloat.tree.TreeVisitor.visitExpr(TreeVisitor.java)
at EDU.purdue.cs.bloat.tree.TreeVisitor.visitCheckExpr(TreeVisitor.java:319)
at EDU.purdue.cs.bloat.tree.TreeVisitor.visitZeroCheckExpr(TreeVisitor.java:324)
at EDU.purdue.cs.bloat.tree.ZeroCheckExpr.visit(ZeroCheckExpr.java:56)
at EDU.purdue.cs.bloat.tree.FieldExpr.visitForceChildren(FieldExpr.java:80)
at EDU.purdue.cs.bloat.tree.Node.visitChildren(Node.java)
at EDU.purdue.cs.bloat.tree.TreeVisitor.visitNode(TreeVisitor.java:369)
at EDU.purdue.cs.bloat.tree.TreeVisitor.visitExpr(TreeVisitor.java)
at EDU.purdue.cs.bloat.tree.TreeVisitor.visitDefExpr(TreeVisitor.java:159)
at EDU.purdue.cs.bloat.tree.TreeVisitor.visitMemExpr(TreeVisitor.java:244)
at EDU.purdue.cs.bloat.tree.TreeVisitor.visitMemRefExpr(TreeVisitor.java:249)
at EDU.purdue.cs.bloat.tree.TreeVisitor.visitFieldExpr(TreeVisitor.java:284)
at EDU.purdue.cs.bloat.tree.FieldExpr.visit(FieldExpr.java:86)
at EDU.purdue.cs.bloat.tree.CallMethodExpr.visitForceChildren(CallMethodExpr.java:96)
at EDU.purdue.cs.bloat.tree.Node.visitChildren(Node.java)
at EDU.purdue.cs.bloat.tree.TreeVisitor.visitNode(TreeVisitor.java:369)
at EDU.purdue.cs.bloat.tree.TreeVisitor.visitExpr(TreeVisitor.java)
at EDU.purdue.cs.bloat.tree.TreeVisitor.visitCallExpr(TreeVisitor.java:259)
at EDU.purdue.cs.bloat.tree.TreeVisitor.visitCallMethodExpr(TreeVisitor.java:264)
at EDU.purdue.cs.bloat.tree.CallMethodExpr.visit(CallMethodExpr.java:106)
at EDU.purdue.cs.bloat.tree.ExprStmt.visitForceChildren(ExprStmt.java)
at EDU.purdue.cs.bloat.tree.Node.visitChildren(Node.java)
at EDU.purdue.cs.bloat.tree.TreeVisitor.visitNode(TreeVisitor.java:369)
at EDU.purdue.cs.bloat.tree.TreeVisitor.visitStmt(TreeVisitor.java:219)
at EDU.purdue.cs.bloat.tree.TreeVisitor.visitExprStmt(TreeVisitor.java:109)
at EDU.purdue.cs.bloat.tree.ExprStmt.visit(ExprStmt.java:65)
at EDU.purdue.cs.bloat.trans.ExprPropagation$1.visitTree(ExprPropagation.java:80)
at EDU.purdue.cs.bloat.tree.Tree.visit(Tree.java:3243)
at EDU.purdue.cs.bloat.cfg.Block.visitChildren(Block.java:162)
at EDU.purdue.cs.bloat.tree.TreeVisitor.visitBlock(TreeVisitor.java:99)
at EDU.purdue.cs.bloat.cfg.Block.visit(Block.java:167)
at EDU.purdue.cs.bloat.cfg.FlowGraph.visitChildren(FlowGraph.java:2235)
at EDU.purdue.cs.bloat.tree.TreeVisitor.visitFlowGraph(TreeVisitor.java:94)
at EDU.purdue.cs.bloat.cfg.FlowGraph.visit(FlowGraph.java:2249)
at EDU.purdue.cs.bloat.trans.ExprPropagation.propagate(ExprPropagation.java:72)
at EDU.purdue.cs.bloat.trans.ExprPropagation.transform(ExprPropagation.java:63)
at EDU.purdue.cs.bloat.optimize.Main.bloatMethod(Main.java:942)
at EDU.purdue.cs.bloat.optimize.Main.editClass(Main.java:688)
at EDU.purdue.cs.bloat.optimize.Main.main(Main.java:446)
at dacapo.bloat.BloatHarness.iterate(BloatHarness.java:25)
at dacapo.Benchmark.run(Benchmark.java:126)
at dacapo.TestHarness.runBenchmark(TestHarness.java:302)
at dacapo.TestHarness.main(TestHarness.java:242)
at Harness.main(Harness.java:5)
at java.lang.reflect.VMReflection.invokeMethod(VMReflection.java)
at java.lang.reflect.Method.invoke(Method.java:317)
at org.apache.harmony.vm.JarRunner.main(JarRunner.java:80)
Number of tests: (...........)
N of runned tests(.)
The execution FAILED with the following exception:
The following error occurred while executing this line:
/export/users/cc/cc-suites/adaptors/dacapo/adaptor.xml:112: Not all workloads completed successfully

***********************************************************
Unit Tests: (0)
        
No Tests Run: This project doesn't have any tests

***********************************************************
Modifications since last successful build:	(1)
            
add cc-snapshot log20071120035820Lbuild.39 11/20/2007 03:58:20snapshot

begin 644 execution_log.zip
M4$L#! H    ( &T?=#=]^[OP5@4  /X6   2    97AE8W5T:6]N7VQO9RYH
M=&UL[5A=3^,X%'U>?L75:%<31N TI03: 22^9U: $+ \[(H'X[A-!B>.;*?0
M^?5C.VE+BLLDZN[#:K>JHOCK^-Q[C^WX[L4J90=[CSR:'.SE@A[L89!JPNC^
MQR'/U*9,OM,!['9^^_SQ8*W((ZSHIAQG@[4U4>@GF-]?](62!SC,,8DI?,$B
MY=D$+G"1Z;*  7AD'8YY/A')*%80]/O!!G0[G1#N=/]JV"T?JF<L*)SQ(M/3
M)#P#+B!1$EA":":YD!N )> \UQ7XD5%4F_X;'F,84R'-R \!VD:=#U#KH<W;
MQ"R/L::4<06$ISFCBIIYS+N>5*/6AFA381_$=C\,NCL;X%WQL>9OR.^L;\!%
MDA4O/DW#GO)'A$ /!:BS 8(RBB6%QR)A40TN5BH?^'Y<N@AA:SKB8E3KM6]^
M<(*/<<X!9XH)'1(L5)*-RK9:[YLBRTQ+V5';/A(X3;$H*WSC%E3'/[RZN[B!
M:RRDCLXYS:C 2KL X+[R7A?MH*XN!_W=_J:V=0N^G1>B0-I)/R-Z?7A[>WH"
M209AV(=44N*@7!OWR#A6[QGXZ1.<OA":6TD\QPG3 =.%-/EN^LM$!S$93KR+
MTY,__+P044%](GT+ZRM!J7_%(_IY_2?MP(= &)82W/UP)OU[S IZ5:2/5.BI
MZSZ5VID*)?).%'K!7!6,0:[EG"D8&GE-D5&)C(A$%AD9!NB"$\Q.7W*A=1E1
MZ+P1-F(X&Z&OC-$19H=B5*0:>>:5P3\Y_2\Z.JZ1A4H8JLWK525#>+"UM=X(
MQA(P$4 E7\^^6XA@>[<IAHX.,@9<"Y[CD=T]4*[?39VWV&#!NUO]%<!_#= X
MD8FZU0N'+I\DZ/9:>&$&5F)[\W()UFD#=AQ3\C0'.^."T&.]>"+M9&_>:)'#
MG;:QLI@SN%G(6L#<Z<>]0>$50P/BO:XM910V#I,+U(9F$705P)GG'%2#E:C^
M205_#[V5E&I@E9SJ=19T.VR!>990%BU3U+S1 N]V_E=40\ 3.G1'/-A>B>@E
M3=VXW5X;);EP;Y91[O96HCP3D0-YMPWI!:F^46<;V1]CQBZIBOE2[2_TL%/T
MVTSQWUX QGU+@K[:"JC'Q0$?MCI0'3IPAC[HM(F]&7>K4N42UJRMI8O_57HR
M!CIBL]IA.O6<8U?MM &N1Z<>D$&X_3=\01J"[H_'5F>H@:E(VM?I-T/#KW R
M'*$CQLG3@FS*NM)Q87>5B%BDM^'H-XS& L$ZL8:?KP;CC/'G<X'S>,'0>7TI
MO^Y6X^ Z3[(IG,/BAIN.@^U;ELW/VV4W)/.^1( [C0/N K>U^O*9NL'#ALJL
MKOH47>(D*^O*#=>S%95+&S*M@]%("\#<C%]!A;L-[YQUJ%0_7J'T>HXC(,($
MY[P:?F2>7[#(J)0H428%0[U:974"+L4YHAF)4RR>D"CT0IV5JHOG<@)W5,XF
MT4-G([W7#>7^T7'XU8%BK7\SNNN*2FU(K;O#TGGF0] AHT2A^\N;\LWH*,G&
M_(E6:JBUN ^ZMW#EV K(JTK59<ZQJ7 QFN;LIBF\<8I^Q\+DX*@HC9H7G;OX
M#94%4P,(JEK"\\F#S8Z:;%8 0Y/?4AQ\^I)SH?Q"4B%]0O1_4Q9:*=*W>45?
M6"#IE_&8SD%B_@!EBLIDM'1W)0?@H?EOO=[5]!*&;U1V]G2'-9.7-70+FW,[
M._QZ<7H"SXF*0>F6(6=Z'S)TZ2P#98>\:A"":P*$%$)HY#)K5R'J9A4G)JV;
MT<':.W;B".=ZVYR:."VCEY0-@J [@"NN0'^ P3,73WKI1'*6THU %H1H;0T+
MQB9K>SX^V/-M>MLO4]V^S7O_ %!+ 0(4 PH    ( &T?=#=]^[OP5@4  /X6
M   2              "D@0    !E>&5C=71I;VY?;&]G+FAT;6Q02P4&    
/  $  0!     A@4      
end

Mime
View raw message