harmony-alerts mailing list archives

Site index · List index
Message view « Date » · « Thread »
Top « Date » · « Thread »
From nom...@intel.com
Subject [build-test alert] FAILED Windows 2003 x86: drlvm debug
Date Wed, 14 Nov 2007 21:01:05 GMT

BUILD FAILED:
	Ant Error Message:
C:\cc\cc-short\scripts\cc-exec-adaptor.xml:104: exec returned: 1

Date of build:	2007-11-15 02:59:31 +0600
Time to build:	1 minute 9 seconds
Last changed:	11/15/2007 02:50:48
Last log entry:	Applied patch from HARMONY-5033
[drlvm][jvmti] FieldModificationEvent should support compressed references on x86_64

***********************************************************
Errors/Warnings:	(3)
            
svn: PROPFIND request failed on '/repos/asf/harmony/enhanced/drlvm/trunk'
svn: PROPFIND of '/repos/asf/harmony/enhanced/drlvm/trunk': 504 Gateway Time-out (http://svn.apache.org)
The execution FAILED with the following exception:
exec returned: 1

***********************************************************
Unit Tests: (0)
        
No Tests Run: This project doesn't have any tests

***********************************************************
Modifications since last successful build:	(1)
            
modified gshimansky  /harmony/enhanced/drlvm/trunk/vm/vmcore/src/jvmti/jvmti_watch.cpp 11/15/2007
02:50:48 Applied patch from HARMONY-5033[drlvm][jvmti] FieldModificationEvent should support
compressed references on x86_64

begin 644 execution_log.zip
M4$L#! H    ( "(8;S<!\Y@V\@   &<!   2    97AE8W5T:6]N7VQO9RYH
M=&ULC9!!2\0P$(7O@?Z'N4CUT)T5%"36@K"N+(@NLC?Q$-OI)M@F,9ENK;_>
M=+TOSG'FX\U[K]3<=U7YX9JI*GV@JE00>>KH+F^=Y2*:'Y)PLSR[S:M,#+Y1
M3$4\6)D)F.>-OJE^AWD#V]>7[7KSO() 7P-%AE:9CAIP%G(,Y%U$%5O4*O3.
M3DA6*UM3@TWH#CUR&.QG?DK6M?_7D7"]O(+'Y'94$^Q,3X4;&,XULY>(27BA
MO*HU+5S87V1"[#3!_'1@D_RN[S=/#RL8#6O@=&E=U[G1V'UB:O(S(\6,IZP\
M!$N-A$N1B1)55>*Q1_SK%(\%_P)02P$"% ,*    "  B&&\W ?.8-O(   !G
M 0  $@              I($     97AE8W5T:6]N7VQO9RYH=&UL4$L%!@  
0   !  $ 0    "(!      $! 
end

Mime
View raw message