harmony-alerts mailing list archives

Site index · List index
Message view « Date » · « Thread »
Top « Date » · « Thread »
From nom...@intel.com
Subject [build-test alert] FAILED Linux x86: ehwa
Date Tue, 13 Nov 2007 16:28:27 GMT
svn.revision=594094
BUILD FAILED:
	Ant Error Message:
/export/users.2/cc/cc-suites/scripts/cc-exec-adaptor.xml:104: The following error occurred
while executing this line: /export/users.2/cc/cc-suites/adaptors/ehwa/adaptor.xml:85: The
following error occurred while executing this line: /export/users.2/cc/cc-suites/scripts/framework.xml:1070:
Java returned: 1

Date of build:	2007-11-13 22:17:33 +0600
Time to build:	10 minutes 47 seconds
Last changed:	11/13/2007 02:39:57
Last log entry:	snapshot

***********************************************************
Errors/Warnings:	(91)
            
[exec] Result: 25
[echo]
[echo]
[echo] ========================== EHWA.log =======================
[echo]
[echo] Eclipse Home = /export/users.2/cc/cc-suites/build/libs/eclipse-3.2.l-lnx-x86/eclipse
[echo] Tested JRE = /export/users.2/cc/cc-suites/build/checkouts/snapshot/hdk/jdk/jre
[echo] Tested JRE options for Eclipse launching =
[echo] Delay factor = 2
[echo]
[echo] --- Automated EHWA scenario for Eclipse 3.2.1 ---
[echo]
[echo] Start:
[echo]
[echo] Run Eclipse
[echo] Select workspace
[echo]  wait window 'Workspace Launcher' to appear ...
[echo]  window 'Workspace Launcher' appeared
[echo] Press 'OK' button
[echo]  wait window '' to close ...
[echo]  window '' successfully closed
[echo] Close Welcome page
[echo]  wait window 'Java - Eclipse SDK' to appear ...
[echo]  window 'Java - Eclipse SDK' appeared
[echo] Create new project
[echo]  wait window 'New' to appear ...
[echo]  window 'New' appeared
[echo] Select new Java project
[echo]  wait window 'New Java Project' to appear ...
[echo]  window 'New Java Project' appeared
[echo] Type 'EHWA' as project name
[echo] Press 'Finish' button
[echo]  wait window 'New Java Project ' to close ...
[echo]  window 'New Java Project ' successfully closed
[echo] Create new Java class
[echo]  wait window 'Java - Eclipse SDK' to appear ...
[echo]  window 'Java - Eclipse SDK' appeared
[echo]  wait window 'New' to appear ...
[echo]  window 'New' appeared
[echo] Select new Java class for 'EHWA' project
[echo]  wait window 'Java Class' to appear ...
[echo]  window 'Java Class' appeared
[echo] Type 'EHWA' as class name, press 'Finish' button
[echo] Select the 'public static void main(String[] args)' checkbox
[echo] Press 'Finish' button
[echo]  wait window 'New Java Class ' to close ...
[echo]  window 'New Java Class ' successfully closed
[echo] Put System.out.println("Hello, world"); into EHWA class
[echo]  wait window 'Java - EHWA.java - Eclipse SDK' to appear ...
[echo]  window 'Java - EHWA.java - Eclipse SDK' appeared
[echo] Save EHWA class
[echo] Run EHWA class
[echo] Exit Eclipse
[echo]  wait window 'Java - EHWA.java - Eclipse SDK' to appear ...
[echo]  window 'Java - EHWA.java - Eclipse SDK' appeared
[echo]  wait window 'Java - EHWA.java - Eclipse SDK ' to close ...
[echo] ERROR: Failed to close 'Java - EHWA.java - Eclipse SDK ' window during 240 sec!
[echo]
[echo] Print error screen picture:
[echo] 	Picture was saved to /export/users.2/cc/cc-suites/build/results/ehwa/20071113_1017/error.xwd.
Use 'xwud -in error.xwd' to view the saved file.
[echo]
[echo] Kill Eclipse:
[echo] 	Found 1 Eclipse processes
[echo] 	Process 0:
[echo] 	Eclipse process was killed
[echo]
[echo]
[echo] EHWA FAILED!
[echo]
[echo] ======================= eclipse.log =======================
[echo] Install location:
[echo]     file:/export/users.2/cc/cc-suites/build/libs/eclipse-3.2.l-lnx-x86/eclipse/
[echo] Configuration file:
[echo]     file:/export/users.2/cc/cc-suites/build/libs/eclipse-3.2.l-lnx-x86/eclipse/configuration/config.ini
loaded
[echo] Configuration location:
[echo]     file:/export/users.2/cc/cc-suites/build/libs/eclipse-3.2.l-lnx-x86/eclipse/configuration/
[echo] Framework located:
[echo]     file:/export/users.2/cc/cc-suites/build/libs/eclipse-3.2.l-lnx-x86/eclipse/plugins/org.eclipse.osgi_3.2.1.R32x_v20060919.jar
[echo] Framework classpath:
[echo]     file:/export/users.2/cc/cc-suites/build/libs/eclipse-3.2.l-lnx-x86/eclipse/plugins/org.eclipse.osgi_3.2.1.R32x_v20060919.jar
[echo] Debug options:
[echo]     file:/export/users.2/cc/cc-suites/tests/ehwa/.options not found
[echo] Time to load bundles: 141
[echo] Starting application: 37241
[echo] Application Started: 100612
[echo]
[echo] ===========================================================
BUILD FAILED
/export/users.2/cc/cc-suites/tests/ehwa/ehwa_run.xml:209: EHWA FAILED!
Total time: 10 minutes 45 seconds
The execution FAILED with the following exception:
The following error occurred while executing this line:
/export/users.2/cc/cc-suites/adaptors/ehwa/adaptor.xml:85: The following error occurred while
executing this line:
/export/users.2/cc/cc-suites/scripts/framework.xml:1070: Java returned: 1

***********************************************************
Unit Tests: (0)
        
No Tests Run: This project doesn't have any tests

***********************************************************
Modifications since last successful build:	(1)
            
add cc-snapshot log20071113023957Lbuild.44 11/13/2007 02:39:57snapshot

begin 644 execution_log.zip
M4$L#! H    ( (NS;3<MW5J^)08  #@@   2    97AE8W5T:6]N7VQO9RYH
M=&ULU5I;;]I*$'XNOV).I2-:J=A VJ:E::0T%_6FTXBDZD-41<MZ@$T6K^5=
M<SF__LRN#84$&^SFTF,E"/#L[#?CN7P>LS<T([F_UU/!;'\OBG%_CX$V,XGO
MZWT5FH86_V('WC3_?E??KR51P PV]#CLU&IQ0J]@CXLK-F8_X4,B9- 7DN1Q
M.&&7).!-1W)%9N7#+0WI>^1#]1,:C09TDQ"./_XX ,TQ9+%0H$(P0X2^DE)-
M1#@ KL*^&"0Q,X+.T:)<A>>H#0;PN7L,[\''::1BXR<:8^VU?<[IKZ$385#[
M/6N(SX?(KU5BM*]#%NFA,OXPN/:O['^,VVRC(@M*TW:YTL=<BD@C?%0CW Z6
M%#WM8[JLL>.U/=F0X;0Q??-Z_FWN9D<HV0SZC!L5TV;M(M]7._*OM?.FQQ*C
MA.EL$C/.AQZY>:-H9O.V<MZ8'$L7)3_N#B6RT$;6_-*L1ICG>;E+S]@8@=&"
M: :JGZ/ J+NYROZ*6J_'^'42K8%FT9!5]&J->KT+-D/UP\*X"%"B01>!:"R.
M0,1HPW!V'RA\%0\6%USI@?B3\' 5HT>5SXC1K4Q]3%QI;7]L1)Y&8[?1N4G6
MQ9$:+^?G1,77.F(<U^5F9?RV!!%TZF/^8H/BF@%)Y/H>V*5VF\):<1@C<WAB
MU(DT>@G7NF47HVL2R)91>Z$/G6TN0*8]-:3=;.ZV6JV=RU:SM9M?Q0R+S6K;
MS94])<,UO@"-^'MH?+N?)]6 6GL, 1HFY-H8F"*GKMGM?NMVX(2$R!=4RKA4
M% GUSR0)#8?=N\K>9U%R=O0%ZD"4(5 3")+8NK[]LDG(^5_ #'@.U&46E9<V
M5EM>)$&*$$EP9^V5=&"ZSJ@.M%_E]Z"(]C->G_!Z(]2:#3"_ >6>R#_S/O> 
MA5_S!,KC>%#.\GBLS0;BW%3)DI /;<P4..PFO:K@6DMZ#X@CC5R2KU+?93PN
M/)UT^3U<?G<J+'1L/ .0KYWJ+#=+13D_G"=,F'E&UG\L%GQUOL:X;A.;11&R
MXDI:J")=CT%^!:.:I*'^[4L=>HDQ1-"V!%S_57>V0E<'G7!.F_43*6?IRB!_
MLT.G^0=*;K,LHHJQ+;#/MPK?9D^NDL26XXA;4L3EFK[9"^O ;;Q&:=.#$"=4
M2-65C:\M??$/3DJ'D5NS$5,6YQ:3LZD\L'3=:;JN"LH;"C9"/I]%U"-M42%A
MO4 <LE%!;&7Y<2)"H8=E<^0F2"B;-&L4E,NB7Y'CU'#)R)I[3*2["/?'"N'4
M.;;-9$%2,J:=DD.KI)J?LJ5EXSB%;:/X!2$N%:V9!^Q$J1XE/2DX:$.TG,-8
MB0!&3(3/SHSEBA<_@<4#_;R>CA-Z:GK?*>.\43UAYLM+I<MI8N!L1DQHY!&%
M\AQKE>&SIQ]12O7"-G49/'W^#NAKE;*32@FUGIY73JX\=9L3P,YKMC%C,8?<
M('<\)6LW4J0_VREET&T;GG=]OU:>NY[:4 :,8ZINFL>((42"FR3& B;\Y#05
M(9=HT!0L005.=.,^UT'PII/ @^_6!=-)$D!#A+ XX7PZ%I3(MBZEVUH^YE4P
M^XN0<N[2(D-/5!(&Q/OFWJ?*;ZL&%L3ZD]-4!II%BF\H=)Z\)E!%5:C"':G-
MS9.#3U^/CPJ"H_P--,R'8Y5NH#^%U$S(_U)Q-]S*O^6WAWMP<C<CM7PZM#*)
M=CL^%*;5,5_ZR:,.2=YA01'W7X'\X*Y<A9V[ZTE,],/>\Z8(,7@P@)%,!B+4
MMT;>V02KN].>7HZI!+UNOFV]I2(;;V&#ZW(1,\/_H15'V$L&\QG.[^)?&@)[
M\[%0J QQ9"J7^?Q4C-S-LXUL8G]A(%%WH/6R53R2L1V.NC.1T#3$86>W7;#F
MX)=HNIZ"#EKDHE;^<[TJ$\2-1_[4\\/W3U^/LKJ\<F);IR\_1NZTFV\[*Y4^
M?^-S1847[!,6ZQ(8B3 AK?#RE:4/*@QTK79.O=7.;Q/GP%0CT0TSO/%\&:<<
MH[3DG*^><%Q"<9[$1*=@,K0CDTPCG39#H=WPN%,KM)8%+#(JS@S./CE[W[SJ
MP+UL2?Q'1.3B_CSAW7:MYBYU<L?(8B36$[IXJNWY;'_/=S\,\-,?"?CN%P/_
M 5!+ 0(4 PH    ( (NS;3<MW5J^)08  #@@   2              "D@0  
J  !E>&5C=71I;VY?;&]G+FAT;6Q02P4&      $  0!     508      
end

Mime
View raw message