harmony-alerts mailing list archives

Site index · List index
Message view « Date » · « Thread »
Top « Date » · « Thread »
From nom...@intel.com
Subject [build-test alert] FAILED Windows 2003 x86: jdktools-test debug
Date Tue, 13 Nov 2007 02:49:38 GMT

BUILD FAILED:
	Ant Error Message:
D:\cc\cc-common\scripts\cc-exec-adaptor.xml:104: The following error occurred while executing
this line: D:\cc\cc-common\adaptors\jdktools-test\adaptor.xml:28: The following error occurred
while executing this line: D:\cc\cc-common\build\checkouts\hdk\working_jdktools\build.xml:242:
The following error occurred while executing this line: D:\cc\cc-common\build\checkouts\hdk\working_jdktools\make\build-test.xml:98:
There were test failures.

Date of build:	2007-11-13 08:27:16 +0600
Time to build:	22 minutes 14 seconds
Last changed:	11/13/2007 04:48:24
Last log entry:	hdk

***********************************************************
Errors/Warnings:	(229)
            
Result: 1
[cc-ant]: Test Suite 'jdktools-test' execution. Repository updated: ${repository.updated}
[cc-ant]: Check for 'run' failure of hdk = ${hdk.parameters.run.failed}
[cc-ant]: Result: failed.superiors = '${failed.superiors}'
========================================
Testing jdktools binaries...
========================================
Compiling JPDA tests
Since fork is false, ignoring memoryMaximumSize setting
----------
1. WARNING in D:\cc\cc-common\build\checkouts\hdk\working_jdktools\modules\jpda\test\common\unit\org\apache\harmony\jpda\tests\framework\DebuggeeRegister.java
(at line 58)
registered.add(debuggee);
^^^^^^^^^^^^^^^^^^^^^^^^
Type safety: The method add(Object) belongs to the raw type LinkedList. References to generic
type LinkedList<E> should be parameterized
----------
----------
2. WARNING in D:\cc\cc-common\build\checkouts\hdk\working_jdktools\modules\jpda\test\common\unit\org\apache\harmony\jpda\tests\framework\TestOptions.java
(at line 505)
internalProperties.put(name, value);
^^^^^^^^^^^^^^^^^^^^^^^^^^^^^^^^^^^
Type safety: The method put(Object, Object) belongs to the raw type HashMap. References to
generic type HashMap<K,V> should be parameterized
----------
----------
3. WARNING in D:\cc\cc-common\build\checkouts\hdk\working_jdktools\modules\jpda\test\common\unit\org\apache\harmony\jpda\tests\framework\jdwp\PacketDispatcher.java
(at line 114)
eventQueue.add(eventPacket);
^^^^^^^^^^^^^^^^^^^^^^^^^^^
Type safety: The method add(Object) belongs to the raw type List. References to generic type
List<E> should be parameterized
----------
4. WARNING in D:\cc\cc-common\build\checkouts\hdk\working_jdktools\modules\jpda\test\common\unit\org\apache\harmony\jpda\tests\framework\jdwp\PacketDispatcher.java
(at line 249)
replies.put(new Integer(replyPacket.getId()),
replyPacket);
^^^^^^^^^^^^^^^^^^^^^^^^^^^^^^^^^^^^^^^^^^^^^^^^^^^^^^^^^^^^^^^^^^^^^^^^^^^^^^^^^^^^^^^^^^^
Type safety: The method put(Object, Object) belongs to the raw type Hashtable. References
to generic type Hashtable<K,V> should be parameterized
----------
5. WARNING in D:\cc\cc-common\build\checkouts\hdk\working_jdktools\modules\jpda\test\common\unit\org\apache\harmony\jpda\tests\framework\jdwp\PacketDispatcher.java
(at line 284)
commands.put(Id, command);
^^^^^^^^^^^^^^^^^^^^^^^^^
Type safety: The method put(Object, Object) belongs to the raw type Hashtable. References
to generic type Hashtable<K,V> should be parameterized
----------
6. WARNING in D:\cc\cc-common\build\checkouts\hdk\working_jdktools\modules\jpda\test\common\unit\org\apache\harmony\jpda\tests\framework\jdwp\PacketDispatcher.java
(at line 355)
commands.put(Id, command);
^^^^^^^^^^^^^^^^^^^^^^^^^
Type safety: The method put(Object, Object) belongs to the raw type Hashtable. References
to generic type Hashtable<K,V> should be parameterized
----------
----------
7. WARNING in D:\cc\cc-common\build\checkouts\hdk\working_jdktools\modules\jpda\test\common\unit\org\apache\harmony\jpda\tests\framework\jdwp\VmMirror.java
(at line 1834)
frames.add(frame);
^^^^^^^^^^^^^^^^^
Type safety: The method add(Object) belongs to the raw type ArrayList. References to generic
type ArrayList<E> should be parameterized
----------
8. WARNING in D:\cc\cc-common\build\checkouts\hdk\working_jdktools\modules\jpda\test\common\unit\org\apache\harmony\jpda\tests\framework\jdwp\VmMirror.java
(at line 1902)
vars.add(var);
^^^^^^^^^^^^^
Type safety: The method add(Object) belongs to the raw type ArrayList. References to generic
type ArrayList<E> should be parameterized
----------
9. WARNING in D:\cc\cc-common\build\checkouts\hdk\working_jdktools\modules\jpda\test\common\unit\org\apache\harmony\jpda\tests\framework\jdwp\VmMirror.java
(at line 2122)
fields.add(superClassFields.toArray()[i]);
^^^^^^^^^^^^^^^^^^^^^^^^^^^^^^^^^^^^^^^^^
Type safety: The method add(Object) belongs to the raw type ArrayList. References to generic
type ArrayList<E> should be parameterized
----------
10. WARNING in D:\cc\cc-common\build\checkouts\hdk\working_jdktools\modules\jpda\test\common\unit\org\apache\harmony\jpda\tests\framework\jdwp\VmMirror.java
(at line 2132)
fields.add(field);
^^^^^^^^^^^^^^^^^
Type safety: The method add(Object) belongs to the raw type ArrayList. References to generic
type ArrayList<E> should be parameterized
----------
----------
11. WARNING in D:\cc\cc-common\build\checkouts\hdk\working_jdktools\modules\jpda\test\common\unit\org\apache\harmony\jpda\tests\jdwp\DebuggerOnDemand\OnthowDebuggerLaunchDebuggee.java
(at line 94)
class ExceptionForDebugger extends Exception {
^^^^^^^^^^^^^^^^^^^^
The serializable class ExceptionForDebugger does not declare a static final serialVersionUID
field of type long
----------
----------
12. WARNING in D:\cc\cc-common\build\checkouts\hdk\working_jdktools\modules\jpda\test\common\unit\org\apache\harmony\jpda\tests\jdwp\Events\ClassUnloadDebuggee.java
(at line 32)
import java.util.LinkedList;
^^^^^^^^^^^^^^^^^^^^
The import java.util.LinkedList is never used
----------
13. WARNING in D:\cc\cc-common\build\checkouts\hdk\working_jdktools\modules\jpda\test\common\unit\org\apache\harmony\jpda\tests\jdwp\Events\ClassUnloadDebuggee.java
(at line 97)
boolean isOutOfMemory = false;
^^^^^^^^^^^^^
The local variable isOutOfMemory is never read
----------
14. WARNING in D:\cc\cc-common\build\checkouts\hdk\working_jdktools\modules\jpda\test\common\unit\org\apache\harmony\jpda\tests\jdwp\Events\ClassUnloadDebuggee.java
(at line 171)
public Class loadClass(String name) throws ClassNotFoundException {
^^^^^
Type safety: The return type Class for loadClass(String) from the type ClassUnloadDebuggee.CustomLoader
needs unchecked conversion to conform to Class<?> from the type ClassLoader
----------
15. WARNING in D:\cc\cc-common\build\checkouts\hdk\working_jdktools\modules\jpda\test\common\unit\org\apache\harmony\jpda\tests\jdwp\Events\ClassUnloadDebuggee.java
(at line 179)
public Class findClass(String name) throws ClassNotFoundException {
^^^^^
Type safety: The return type Class for findClass(String) from the type ClassUnloadDebuggee.CustomLoader
needs unchecked conversion to conform to Class<?> from the type ClassLoader
----------
----------
16. WARNING in D:\cc\cc-common\build\checkouts\hdk\working_jdktools\modules\jpda\test\common\unit\org\apache\harmony\jpda\tests\jdwp\Events\CombinedEvents002Test.java
(at line 100)
boolean expectColocatedEvents = (testedMethodStartCodeIndex == testedMethodEndCodeIndex);
^^^^^^^^^^^^^^^^^^^^^
The local variable expectColocatedEvents is never read
----------
----------
17. WARNING in D:\cc\cc-common\build\checkouts\hdk\working_jdktools\modules\jpda\test\common\unit\org\apache\harmony\jpda\tests\jdwp\Events\CombinedEvents003Test.java
(at line 53)
private boolean eventMethodExitReceived = false;
^^^^^^^^^^^^^^^^^^^^^^^
The field CombinedEvents003Test.eventMethodExitReceived is never read locally
----------
18. WARNING in D:\cc\cc-common\build\checkouts\hdk\working_jdktools\modules\jpda\test\common\unit\org\apache\harmony\jpda\tests\jdwp\Events\CombinedEvents003Test.java
(at line 76)
int EXPECTED_EVENTS_COUNT = EXPECTED_EVENTS_ARRAY.length;
^^^^^^^^^^^^^^^^^^^^^
The local variable EXPECTED_EVENTS_COUNT is never read
----------
----------
19. WARNING in D:\cc\cc-common\build\checkouts\hdk\working_jdktools\modules\jpda\test\common\unit\org\apache\harmony\jpda\tests\jdwp\Events\CombinedEventsTest.java
(at line 84)
int EXPECTED_EVENTS_COUNT = EXPECTED_EVENTS_ARRAY.length;
^^^^^^^^^^^^^^^^^^^^^
The local variable EXPECTED_EVENTS_COUNT is never read
----------
20. WARNING in D:\cc\cc-common\build\checkouts\hdk\working_jdktools\modules\jpda\test\common\unit\org\apache\harmony\jpda\tests\jdwp\Events\CombinedEventsTest.java
(at line 212)
int EXPECTED_EVENTS_COUNT = EXPECTED_EVENTS_ARRAY.length;
^^^^^^^^^^^^^^^^^^^^^
The local variable EXPECTED_EVENTS_COUNT is never read
----------
21. WARNING in D:\cc\cc-common\build\checkouts\hdk\working_jdktools\modules\jpda\test\common\unit\org\apache\harmony\jpda\tests\jdwp\Events\CombinedEventsTest.java
(at line 348)
int EXPECTED_EVENTS_COUNT = EXPECTED_EVENTS_ARRAY.length;
^^^^^^^^^^^^^^^^^^^^^
The local variable EXPECTED_EVENTS_COUNT is never read
----------
22. WARNING in D:\cc\cc-common\build\checkouts\hdk\working_jdktools\modules\jpda\test\common\unit\org\apache\harmony\jpda\tests\jdwp\Events\CombinedEventsTest.java
(at line 732)
String failureMessage = "## FAILURE during checking events! !";
^^^^^^^^^^^^^^
The local variable failureMessage is never read
----------
23. WARNING in D:\cc\cc-common\build\checkouts\hdk\working_jdktools\modules\jpda\test\common\unit\org\apache\harmony\jpda\tests\jdwp\Events\CombinedEventsTest.java
(at line 894)
String failureMessage = "## FAILURE during checking events !";
^^^^^^^^^^^^^^
The local variable failureMessage is never read
----------
----------
24. WARNING in D:\cc\cc-common\build\checkouts\hdk\working_jdktools\modules\jpda\test\common\unit\org\apache\harmony\jpda\tests\jdwp\Events\CombinedEventsTestCase.java
(at line 135)
long methodStartCodeIndex = lineTableReply.getNextValueAsLong();
^^^^^^^^^^^^^^^^^^^^
The local variable methodStartCodeIndex is never read
----------
25. WARNING in D:\cc\cc-common\build\checkouts\hdk\working_jdktools\modules\jpda\test\common\unit\org\apache\harmony\jpda\tests\jdwp\Events\CombinedEventsTestCase.java
(at line 187)
long methodStartCodeIndex = reply.getNextValueAsLong();
^^^^^^^^^^^^^^^^^^^^
The local variable methodStartCodeIndex is never read
----------
----------
26. WARNING in D:\cc\cc-common\build\checkouts\hdk\working_jdktools\modules\jpda\test\common\unit\org\apache\harmony\jpda\tests\jdwp\Events\ExceptionTest.java
(at line 188)
long frameID = reply.getNextValueAsFrameID();
^^^^^^^
The local variable frameID is never read
----------
----------
27. WARNING in D:\cc\cc-common\build\checkouts\hdk\working_jdktools\modules\jpda\test\common\unit\org\apache\harmony\jpda\tests\jdwp\ThreadReference\FramesTest.java
(at line 450)
frames.add(new FrameStruct(frameID, loc));
^^^^^^^^^^^^^^^^^^^^^^^^^^^^^^^^^^^^^^^^^
Type safety: The method add(Object) belongs to the raw type Vector. References to generic
type Vector<E> should be parameterized
----------
----------
28. WARNING in D:\cc\cc-common\build\checkouts\hdk\working_jdktools\modules\jpda\test\common\unit\org\apache\harmony\jpda\tests\jdwp\share\JDWPUnitDebuggeeProcessWrapper.java
(at line 233)
argv.add(val);
^^^^^^^^^^^^^
Type safety: The method add(Object) belongs to the raw type Vector. References to generic
type Vector<E> should be parameterized
----------
29. WARNING in D:\cc\cc-common\build\checkouts\hdk\working_jdktools\modules\jpda\test\common\unit\org\apache\harmony\jpda\tests\jdwp\share\JDWPUnitDebuggeeProcessWrapper.java
(at line 253)
return (String[])argv.toArray(args);
^^^^^^^^^^^^^^^^^^
Type safety: The method toArray(Object[]) belongs to the raw type Vector. References to generic
type Vector<E> should be parameterized
----------
29 problems (29 warnings)
JPDA exclude list: D:\cc\cc-common\build\checkouts\hdk\working_classlib\deploy\build\jdktools.jpda.exclude
Running JPDA tests
Debugger JVM=D:\cc\cc-common\build\checkouts\hdk\target\hdk\jdk\jre/bin/java
Debuggee JVM=D:\cc\cc-common\build\checkouts\hdk\target\hdk\jdk\jre/bin/java
SAMSA exclude list: D:\cc\cc-common\build\checkouts\hdk\working_classlib\deploy\build\jdktools.samsa.exclude
Running SAMSA tests
test.jre.home=D:\cc\cc-common\build\checkouts\hdk\target\hdk\jdk\jre
Run jdk/bin/java -version in D:\cc\cc-common\build\checkouts\hdk\working_jdktools\build\test_report
java version "1.5.0"
pre-alpha : not complete or compatible
svn = r594330, (Nov 13 2007), Windows/ia32/msvc 1310, debug build
http://harmony.apache.org
Run jdk/bin/javac -version in D:\cc\cc-common\build\checkouts\hdk\working_jdktools\build\test_report
Run jdk/bin/javah in D:\cc\cc-common\build\checkouts\hdk\working_jdktools\build\test_report
Run jdk/bin/javadoc in D:\cc\cc-common\build\checkouts\hdk\working_jdktools\build\test_report
Run jdk/bin/jarsigner in D:\cc\cc-common\build\checkouts\hdk\working_jdktools\build\test_report
Run jdk/bin/keytool -help in D:\cc\cc-common\build\checkouts\hdk\working_jdktools\build\test_report
Compiling TOOLS tests
Since fork is false, ignoring memoryMaximumSize setting
----------
1. WARNING in D:\cc\cc-common\build\checkouts\hdk\working_jdktools\modules\tools\src\test\java\org\apache\harmony\tests\tools\javah\Test\Test01.java
(at line 24)
private static final long xxx2 = 1;
^^^^
The field Test01.xxx2 is never read locally
----------
1 problem (1 warning)
TOOLS exclude list: D:\cc\cc-common\build\checkouts\hdk\working_classlib\deploy\build\jdktools.tools.exclude
Running TOOLS tests
test.jre.home=D:\cc\cc-common\build\checkouts\hdk\target\hdk\jdk\jre
The test report is in D:\cc\cc-common\build\checkouts\hdk\working_jdktools\build\test_report\html\index.html
The execution FAILED with the following exception:
The following error occurred while executing this line:
D:\cc\cc-common\adaptors\jdktools-test\adaptor.xml:28: The following error occurred while
executing this line:
D:\cc\cc-common\build\checkouts\hdk\working_jdktools\build.xml:242: The following error occurred
while executing this line:
D:\cc\cc-common\build\checkouts\hdk\working_jdktools\make\build-test.xml:98: There were test
failures.

***********************************************************
Unit Tests: (161)
        
failure: testSingleStep1 org.apache.harmony.jpda.tests.jdwp.Events.SingleStepTest
Unit Test Error Details:	(1)
                
Test: testSingleStep1Class: org.apache.harmony.jpda.tests.jdwp.Events.SingleStepTestjunit.framework.AssertionFailedError:
Received wrong event request ID, expected:<2> but was:<0>
	at org.apache.harmony.jpda.tests.jdwp.Events.SingleStepTest.stepFunction(SingleStepTest.java:173)
	at org.apache.harmony.jpda.tests.jdwp.Events.SingleStepTest.testSingleStep1(SingleStepTest.java:60)
	at java.lang.reflect.VMReflection.invokeMethod(VMReflection.java)

***********************************************************
Modifications since last successful build:	(1)
            
add cc-hdk log20071113044824Lbuild.341 11/13/2007 04:48:24hdk

begin 644 execution_log.zip
M4$L#! H    ( #!&;3=2_ 5G&A(  *]^   2    97AE8W5T:6]N7VQO9RYH
M=&UL[5W_4]NZLO\99OH_Z)X[;R[,$).OA.2FO.$!O:6G0!^A/>]-T]<1MI*X
M=2Q?R09R.^=_?[N2G<1VX@00)71NIF5L65JM]K.[6J]EN3,,1]Y!YYH[XX-.
M(-A!AQ(9CCWV^F]][H<EZ?Z+M<E^^3_^_K>#5YM1X-"0E>2-WWZU^6JS)%D8
M!:5OSO>0<T^6;J4NCJMERT6$S8ZCP'-MN.Z00/!OS Z)3T>,N#YQ1P$7H44^
MQ.57/"B]9S?,PYH!$^&8.*SO^F[H<E_J8R#3=X4,L?UQNV?;\*]D\]&(^SUI
M"S<(92]N[3)IW8T\0GV'T '%#O-MKB/7<WKVD-G?>01MA\[WWBT7WUU_\#49
M4&]$O[,,51Q@R&0((R3X^\SL(?]"-E^O^-N\@L;0"4DZ(=>N3P52MZS5J2 ;
MML>H7T)F9 G&$$2A$K_-@W'IFV"EONLQC8@]''$G6Q97:R<C*D&=2%]5 QM]
M=USQA1P)ID"$D_;#I*@K81=?!4/DGZX#B8-1IUHN&92.^"AP/93^NP_'AR1N
M\63,]&R/2LF2+K[1&VK/,E%M5HCDD; 94;B0D#]1GUW7QTZ@'7$EZ5-/LAWB
M#GPND(\1&W$Q/J-W[B@:=<$3$#!X5-(TD=+DERZO6.2/P\OST_-_/-S0M.KU
MOH%'4>/HQ:TC< (]+@8]&E"@T1M2 <7C:479ZPMP*TBQ=\RNH\& L4LV<&7(
MA(4,IGDE6S0D('Q&&OO;Z4L;(F[&'(LZSI834]O^.\E4_+\%OW2UJW$ @J1]
M%H[;Y&K(0,SAD(-+ MH7U^CXMLDU\[@_4,"'4$/06Q)BL_>N_YTY[X$=BURR
M/O $^*EJ ^8SX=K9:IV3 R*'//(<H$D"BC*!H0"6SFH@+BJOK@NXZ#<O C4C
M%.-:;F2!=7T0A4^]#U-/#LYR"Z>C'7)#O0@P7A'B>Z.-'6FT=\@RU-]2.3RC
M02'D<9W.[SN?G@CQVKH@_LVY#7H?J/V=A<>N#&@(+8IMNE*I9[&'L,(/_SMB
M$5-&K4XUS?M@;M*RE]JT 6NNOUP,J_56WC%#*)D8+;LEIV#/ R:VL'RLB5L#
M%IXZ6]O;.QFZ2WXS)![B Q[Z>QK?$=)KCRWU'JJ6 ?_1>,$ZMI_S$]@QW#!H
M)3MU=DA<L+I6_ J8[KU<3&N-W+S_;TR+RIMKA?6GT9DK!%\RO^_7<H:KZ$@U
MN:O#Y>":F\P/A:#CI3/ZI-:CI_7]%PA9JUS-0G9#A08,#HKA>KE0M5X>5-5*
M-0=5WV6>H\&2$=P\'6%VX8TN#+D2U];V9_?+PX.GEPMQI?P2,:X58:P.?V4/
MNA#+9TYB*03C_)6X\(\9QBF]"Q\$>9L4OZ>1;P^3)%<AS*U\?(N&2T[N;*9R
M*&^X2,@2=A<RB)*F%\F/3&-]K[2"]0XQ=2A<ZKG_PNB%%/3J< #:YR%Q&-02
MC. #"1H"Y'W7IUY,YQ,3$AI^/#TF2C<)[VN50'5Z).3/G-I2D)]@/D+VE%O]
MZ'N<.BOAFS=B_4R%X*D5A:YG37.#67,F]X&S@"ZFDGUV UA&<F6?^<S9I<<(
MO=7,"OT:^&'4!T%<1.%%_TSET<EKG6!?(':R1. >MT'[(3)RE06E24\D+AA=
M5>+/G MZC,0KS4I6Y$%T[8&/4)0($E)'6]U0/<G E.XVS#""WTI=YYR';WCD
M.\N<&UEE8A,LC(2O'9#FH,]%CHMMTA=\I.:Y:<W,J(\B&?+1>R@",'W&P/VB
M<P<4F .WJ?Z-]GLX$\(9]#+"0T6I\Y\'\SK0M%;4B6?.W3Q.)W+YP91.P.RQ
M!CJ1Y6+]=6*AKCQS3BBE*WQTC4L!]&FY7,6'0L7:4BXO<MKL+H#0](BCPPT3
MFN"\M[!?YIRI(+8;4@%U'';J.^R.O'Y-9J^> ,C)M5S4/-??K^SWYW/W /^_
M$-=GSO\4X5I;BFNCEG,"PKT!29$)O$@KANG.#2^9S=P;,*0ELW,A:O-PTV'I
M_!$LXB$%HT;>&Z\(VS/G@!X'6W-OSK-9<O(_'TZ.KDZ.OYY\.CF_ZGX]NOAX
M?@5 9<L/+R\/_]?RF#\(A_/P>YBES>_=I*4]<RYH,61+\<H_)_F%\*H^<_[F
M$;A4*_D;P%\(F'5(QCP,F%H]MZSH5P)FG5(F]P.FF4^9Q/<'?>IZD6!G3$HZ
M8 #*;W_]*WES>/K^X^4)<2)51XT)#]2,+O]"_O+;2EF5I=!D.G\()NN44;GG
M[))/4SX<DS6"9"%4ZY2*R4%U1.62.^]:[@D[9F'C='_V3DFUN4*)7N(:&UR@
M<\[NPD^XW.X0[DS]P=;\6Z8'N;BY/#S$FM8I,_( B/9S.<HBB,0+0F8A8FN4
MGY@DE);G)?9S<8("2CW3.SU>@,T;?;48GN4.+N[#) CKD$RX&N) )H\1>TI:
MRV>A>B.7(II94X+K#14AF)DB.]R*A;>#0MU>AZ?>G^ J%X6/3W65IULBO@XI
M"0D76._=\1\?/D*+)*?Z07 0B/Q#T"!8MB:PEDLI43&XB=>I>#]KG<K/@[.Z
M#FF)Q\.6SP3&&?DX\_[YR[;",5FM B=R8:YV\GNHQ2:]:)BA[[4 &M^K \\_
MDF0+3FZI\$$P<AM?E@I@G@$(2NS.]B*'95Z84J])Q9= WC*\WTM1ZO&_YU[W
M')C,^#BNFVB/A<I@Q=3C%P?GOK9U&?G^O)>VDNN$3%85O/MT]GH5#B$<@:E5
M'7[#_X+M0JRU.]6T'&UFCO;G;V@>TW&!G5C:3JS83K1HU% MM!/KDRO"B'IG
M4 FTWHJ71>#<EB:))9+@&YBDLD/>Z%L9V2;E'7*"BX/TX94[8H1Y-)#,:9,]
MJUEI$<GLQY-J6.6]ZAJ2JM3-4:H8&U_3G-1;Q@98K163JJU*JM*PZGO[A;2J
M*],J6[6*.<6J-(Q)JU(\POM(JU(M9JN^*JT:\+5O3DWW:L9(U9MF2.WMF1SA
MWA+!WX-4H[)72&IO90RK5JU9S-9]K*?<+-;3Y_$U#5/Z8 R_6MV8LM>JQ2)/
MF7.E@%2U;%7*\Z:*D^[5*K&#3DY870@U/+B-90$RH;*I)\=FYC%SNF7,,Z^=
MRS)(JFZUEDRL]^&J9FI>72\RUI[!2&V)5W\68S$762UQ5/<8W9(9ZWEB-),F
M7#.G4P:Y,NB #09[!HUF'4F9\^7F;@--*4+=J,C-!8PFN3)HRJ9(@3+LF].K
M?7-B_SF3UHLW&F/H&9Q&C1E,I5%,:N541[5AF;OA-CB-5IK&/$*U94CLAD-]
M4P-<+S(_Z[:Q<0\--YA3,F;#)N<$8Y:R9XA4Q6#P6C$X*U0,^JB*T;"E52[6
MJY7O(5LFG52U9<ZAF[/!2M/<TX=6L9;>Y]9]V9QL,D6\^J.,IK7?,!2>@<MJ
M&#)JLZ1,.5*S7!F,BDWYF:JY)S7UI?K^''>E=:,/JAOF<L0&573MPH:"F&C>
M@XV'K[1XR[V9!;B/9[UE[=<-"7,/_*PA>S?HL8&4J2SP_M(0Y1Y<&2-E,#8$
M!)LU0]X?Y%XQ1ZIER&4;U%$4EB&Y&QQ@PUS29P_O%&(E?;49\L@>EN*74:3:
MN+T]+6>*R$PIFVS@WEZ^K*][>-9]PG5]DH[DS,(^[-?FODU!+N<<NG7U#OAZ
MSW/<I=_GQ&?X6CT)V5VX0QRN-F[@X5!M0KY\9: >D*J1KH!%UC<![IZ/V -7
M[^6ZQ+W[)TOZ2"G9E^&ABV@7[(\/'=XQ^PLY5/,5>:OG*Z)W@6*"M,F6O4V.
M># 6[F 8DDJK!:I6+8.?PP6I<;,N[X>WN+V2VO&"JMTNN" N:*?GVLR7H$8[
MA (.@?I> ^Y,F>Y?#3(9XV\5"[3T-Y*N MI6HEXPI, 4;ND$HP\\%C+L"8^A
M6Z";;B-O?'S+H=&JUVI@"EOG_(:  P/^F]L[Y _7=_BMW'5IK;H[DC<V7*M 
M-;4I.U$22Y,;AF'0WMU-9O5XDH?YOA@]^\GA.[$]%^R;O$,QZKW_ ;RRU6P"
M6C6K9L&HIB">_M<9G(D Y5!6:#8M<NAY1%T&C\(D$S?,L8J'-7RJT;P[/RVI
M[X:0(5/[E&@C5LN6*:YG3E=/GWW$%^K:\X*P>#TP<FZ=X1<[/G.]U?L7TM%[
MB.$N+O*@B/JD2;J8D-(UYZ&B HHX)!W\>Z!L9.!"9$=4Z:T+0L;UU3!JYCOH
MBGB6T/P?KNIV6)]&7ACO=X8$"P4!/.7XP=\"GG 5_$]@B9,.HGF0(H6ZA^3T
M!T8F+ GFN(+9Z+)=_SYLR8#9;M]5GW/)N9H<2P[IZ'ZX&$_X2EA*:6#"F!U_
MP -T*-7=:AQ..B.W0]<>YJGVP7/J%Z?P!04JQLM&X/I@&=EN3E5A_*6.&=53
M;SU -S0*^0B<IMH79%D/X+^N.3B8+&RXW9&(YT?T ' /LXS?E*W-4E,Q@MI[
M#W<\B8 K\D^X2=) SC1:3<H28Q,ES^LQ;OL'OB"K"9=,@O)"\%3LYQQN/YFG
M _+'2%[O4NCBC(8R!*['+"QB"Z:3 >+[9(R)KNY@R+S FN=B-Z9,_(B]XI_D
MW>&EBA<)X$8S2,TT0'UR^^,Y#8LT)VZU 3\2$P!@D:*#[4F^?>D[&TLP-48Z
MR=%7Y0DWU/N*.E#1"I=<SQ!09>I%F2D%/ 4*JG2%U@%J[FS_4@(<#E"8<)>4
MY;F?-)YIMT&2?8B@?-*6;('C<-Q^'T(-O4_7G#ZWLPPJZ0$PVBU_10/##M17
MM.*Q%4L8KBK Y[>WNF]4\&T=0^BLG&@>4N58-M2H^(T+]PK4<=17N:@7SPBY
M+CVPD703&#*[3280. NXE/EXL&0S 0&.TB#'E8%'QP2+P,?@#EB2;$7 RZT+
M\V*BHLA]PF56>J&DI'/5/?SZ\?+] =),*17<=X$"T%& KG;(A1N.\^VQ=TT#
MC[XJLYG5#%60( '59MG-4 -9W(U)9\C!ID&$$,7)@Q_M#AKWP9]*5'!9179@
MU5")Q)74$+'6#F'6P-(5+5W1 I_2KE1K]7E]:;/ OQ/<9VTBU>'6VZNK#QBJ
M=R^.?N]F!1G#*+27US,$DIMZ?21JBW$0\H&@ <R;BC#<7"0J(!:05(T["7])
MJ:*9M38YGXU[<:$VYAM1GPYP2ES@%J8]I;F;^H,"-L'@3/&)LX+6=K1Q&F(2
M8'%O:5XG+0J916TUS^VLR19T.,OP;)M"CD>.>7Y'\38?CCM(90^R/:8EG&ZU
M@.E<:  ZA#,\*>'$_53A0?KL][C+2,4%Z6L).S]*G?C#&-I7_#E;HJ, +.OH
MPZ_J@UD'?UJ614KO.AB%)94*&?'YK9]\@$-F.-E0NB'8/S<V_J'O)%E**>!*
M-,F^SS1"0=G"V]@XPJ/T="'83>+Q<5_I*!OQE/2.FB$TU@=3$P\Y^%T>#K6R
M0"">;>HPS&[ K'+)1OR&$9CRX)9!3>SSW<I&B=TA5-#D1!VDAH?]J1D8G; ,
M'9Z=5C=*<(,-E*%YE\&]B.(5*^L@PQ7)#3B,-ML2=0W:70TAD%5ZE^@NUP$D
M 0'1!)AL8[W[,S0_U=M TQ3?6_80[M6WD1(E1]U+O6=%E@;P:'O<!W%-/@D*
MU9%S);8YU55(Y""JU!^D(ZEL;8BV_-!6,'[ 0Y2EEF"&5P5./D;:*$GF]36!
MB>I!Y J%<0"6HJ)<QB2!"8SEJ"5199K_HE!R8QH[?THBY]D^E9"+3.LMHEAD
MX-K?_,A8>29-!>%%>R/31&M=MN]\MGF5+VY>75R\[Z8^N1F_GCZMTOCWUS!3
MNRKH,RELO;4"=C!O3P4]4EU9I=#4MQ+5GW)ER;?6%NVBFMJ*7^U,<W=W5R6O
M267IU@F3W_S-:/1^J3%SBNAC=D--=C8@6Y5D7X,5MC70NOADSS_TWY_Y_"-G
M7.:??ZSP*'TZ>OQ2@(R?JD,(TD7WIS>C[E) NO!1^LIKEFI6O69J85W=:BQ9
MQ+$R6V5S3_%TA%,"3U5BHR <Z\(X3SA3E"_!'%U)AX=PKH>C3V%0@OI2;Q\.
MC+=)O;77&F7T!BT5N2&Z$=JHL7BUA]\B[[FX$9B%A\BOA)OP<,KPJTV8>F9/
MM2"4?(1.#;[:W$0F<5**5)2GUWWH*5JE*3GF0-4&@<FV7&W59.8"RI]PVXZ$
M ..[';K>A")<#C%F0D>)GS//#)TZ%&XRA)Q8O6(N*<8OA;>K^WIK&"/]K2YJ
MW7>]^K,[5Q]+GT8"BHV6%@'$/K?X1VE48@P6P-K9I0>=7?4]^EW];?I=]:'Z
M_P=02P$"% ,*    "  P1FTW4OP%9QH2  "O?@  $@              I($ 
K    97AE8W5T:6]N7VQO9RYH=&UL4$L%!@     !  $ 0    $H2      $! 
end

Mime
View raw message