harmony-alerts mailing list archives

Site index · List index
Message view « Date » · « Thread »
Top « Date » · « Thread »
From nom...@intel.com
Subject [build-test alert] FAILED Windows 2003 x86_64: jdktools-test debug
Date Tue, 13 Nov 2007 00:56:42 GMT

BUILD FAILED:
	Ant Error Message:
C:\cc\cc-common\scripts\cc-exec-adaptor.xml:104: The following error occurred while executing
this line: C:\cc\cc-common\adaptors\jdktools-test\adaptor.xml:28: The following error occurred
while executing this line: C:\cc\cc-common\build\checkouts\hdk\working_jdktools\build.xml:242:
The following error occurred while executing this line: C:\cc\cc-common\build\checkouts\hdk\working_jdktools\make\build-test.xml:97:
There were test errors.

Date of build:	2007-11-13 05:21:17 +0600
Time to build:	95 minutes 14 seconds
Last changed:	11/13/2007 04:45:35
Last log entry:	hdk

***********************************************************
Errors/Warnings:	(226)
            
Result: 1
========================================
Testing jdktools binaries...
========================================
Compiling JPDA tests
Since fork is false, ignoring memoryMaximumSize setting
----------
1. WARNING in C:\cc\cc-common\build\checkouts\hdk\working_jdktools\modules\jpda\test\common\unit\org\apache\harmony\jpda\tests\framework\DebuggeeRegister.java
(at line 58)
registered.add(debuggee);
^^^^^^^^^^^^^^^^^^^^^^^^
Type safety: The method add(Object) belongs to the raw type LinkedList. References to generic
type LinkedList<E> should be parameterized
----------
----------
2. WARNING in C:\cc\cc-common\build\checkouts\hdk\working_jdktools\modules\jpda\test\common\unit\org\apache\harmony\jpda\tests\framework\TestOptions.java
(at line 505)
internalProperties.put(name, value);
^^^^^^^^^^^^^^^^^^^^^^^^^^^^^^^^^^^
Type safety: The method put(Object, Object) belongs to the raw type HashMap. References to
generic type HashMap<K,V> should be parameterized
----------
----------
3. WARNING in C:\cc\cc-common\build\checkouts\hdk\working_jdktools\modules\jpda\test\common\unit\org\apache\harmony\jpda\tests\framework\jdwp\PacketDispatcher.java
(at line 114)
eventQueue.add(eventPacket);
^^^^^^^^^^^^^^^^^^^^^^^^^^^
Type safety: The method add(Object) belongs to the raw type List. References to generic type
List<E> should be parameterized
----------
4. WARNING in C:\cc\cc-common\build\checkouts\hdk\working_jdktools\modules\jpda\test\common\unit\org\apache\harmony\jpda\tests\framework\jdwp\PacketDispatcher.java
(at line 249)
replies.put(new Integer(replyPacket.getId()),
replyPacket);
^^^^^^^^^^^^^^^^^^^^^^^^^^^^^^^^^^^^^^^^^^^^^^^^^^^^^^^^^^^^^^^^^^^^^^^^^^^^^^^^^^^^^^^^^^^
Type safety: The method put(Object, Object) belongs to the raw type Hashtable. References
to generic type Hashtable<K,V> should be parameterized
----------
5. WARNING in C:\cc\cc-common\build\checkouts\hdk\working_jdktools\modules\jpda\test\common\unit\org\apache\harmony\jpda\tests\framework\jdwp\PacketDispatcher.java
(at line 284)
commands.put(Id, command);
^^^^^^^^^^^^^^^^^^^^^^^^^
Type safety: The method put(Object, Object) belongs to the raw type Hashtable. References
to generic type Hashtable<K,V> should be parameterized
----------
6. WARNING in C:\cc\cc-common\build\checkouts\hdk\working_jdktools\modules\jpda\test\common\unit\org\apache\harmony\jpda\tests\framework\jdwp\PacketDispatcher.java
(at line 355)
commands.put(Id, command);
^^^^^^^^^^^^^^^^^^^^^^^^^
Type safety: The method put(Object, Object) belongs to the raw type Hashtable. References
to generic type Hashtable<K,V> should be parameterized
----------
----------
7. WARNING in C:\cc\cc-common\build\checkouts\hdk\working_jdktools\modules\jpda\test\common\unit\org\apache\harmony\jpda\tests\framework\jdwp\VmMirror.java
(at line 1834)
frames.add(frame);
^^^^^^^^^^^^^^^^^
Type safety: The method add(Object) belongs to the raw type ArrayList. References to generic
type ArrayList<E> should be parameterized
----------
8. WARNING in C:\cc\cc-common\build\checkouts\hdk\working_jdktools\modules\jpda\test\common\unit\org\apache\harmony\jpda\tests\framework\jdwp\VmMirror.java
(at line 1902)
vars.add(var);
^^^^^^^^^^^^^
Type safety: The method add(Object) belongs to the raw type ArrayList. References to generic
type ArrayList<E> should be parameterized
----------
9. WARNING in C:\cc\cc-common\build\checkouts\hdk\working_jdktools\modules\jpda\test\common\unit\org\apache\harmony\jpda\tests\framework\jdwp\VmMirror.java
(at line 2122)
fields.add(superClassFields.toArray()[i]);
^^^^^^^^^^^^^^^^^^^^^^^^^^^^^^^^^^^^^^^^^
Type safety: The method add(Object) belongs to the raw type ArrayList. References to generic
type ArrayList<E> should be parameterized
----------
10. WARNING in C:\cc\cc-common\build\checkouts\hdk\working_jdktools\modules\jpda\test\common\unit\org\apache\harmony\jpda\tests\framework\jdwp\VmMirror.java
(at line 2132)
fields.add(field);
^^^^^^^^^^^^^^^^^
Type safety: The method add(Object) belongs to the raw type ArrayList. References to generic
type ArrayList<E> should be parameterized
----------
----------
11. WARNING in C:\cc\cc-common\build\checkouts\hdk\working_jdktools\modules\jpda\test\common\unit\org\apache\harmony\jpda\tests\jdwp\DebuggerOnDemand\OnthowDebuggerLaunchDebuggee.java
(at line 94)
class ExceptionForDebugger extends Exception {
^^^^^^^^^^^^^^^^^^^^
The serializable class ExceptionForDebugger does not declare a static final serialVersionUID
field of type long
----------
----------
12. WARNING in C:\cc\cc-common\build\checkouts\hdk\working_jdktools\modules\jpda\test\common\unit\org\apache\harmony\jpda\tests\jdwp\Events\ClassUnloadDebuggee.java
(at line 32)
import java.util.LinkedList;
^^^^^^^^^^^^^^^^^^^^
The import java.util.LinkedList is never used
----------
13. WARNING in C:\cc\cc-common\build\checkouts\hdk\working_jdktools\modules\jpda\test\common\unit\org\apache\harmony\jpda\tests\jdwp\Events\ClassUnloadDebuggee.java
(at line 97)
boolean isOutOfMemory = false;
^^^^^^^^^^^^^
The local variable isOutOfMemory is never read
----------
14. WARNING in C:\cc\cc-common\build\checkouts\hdk\working_jdktools\modules\jpda\test\common\unit\org\apache\harmony\jpda\tests\jdwp\Events\ClassUnloadDebuggee.java
(at line 171)
public Class loadClass(String name) throws ClassNotFoundException {
^^^^^
Type safety: The return type Class for loadClass(String) from the type ClassUnloadDebuggee.CustomLoader
needs unchecked conversion to conform to Class<?> from the type ClassLoader
----------
15. WARNING in C:\cc\cc-common\build\checkouts\hdk\working_jdktools\modules\jpda\test\common\unit\org\apache\harmony\jpda\tests\jdwp\Events\ClassUnloadDebuggee.java
(at line 179)
public Class findClass(String name) throws ClassNotFoundException {
^^^^^
Type safety: The return type Class for findClass(String) from the type ClassUnloadDebuggee.CustomLoader
needs unchecked conversion to conform to Class<?> from the type ClassLoader
----------
----------
16. WARNING in C:\cc\cc-common\build\checkouts\hdk\working_jdktools\modules\jpda\test\common\unit\org\apache\harmony\jpda\tests\jdwp\Events\CombinedEvents002Test.java
(at line 100)
boolean expectColocatedEvents = (testedMethodStartCodeIndex == testedMethodEndCodeIndex);
^^^^^^^^^^^^^^^^^^^^^
The local variable expectColocatedEvents is never read
----------
----------
17. WARNING in C:\cc\cc-common\build\checkouts\hdk\working_jdktools\modules\jpda\test\common\unit\org\apache\harmony\jpda\tests\jdwp\Events\CombinedEvents003Test.java
(at line 53)
private boolean eventMethodExitReceived = false;
^^^^^^^^^^^^^^^^^^^^^^^
The field CombinedEvents003Test.eventMethodExitReceived is never read locally
----------
18. WARNING in C:\cc\cc-common\build\checkouts\hdk\working_jdktools\modules\jpda\test\common\unit\org\apache\harmony\jpda\tests\jdwp\Events\CombinedEvents003Test.java
(at line 76)
int EXPECTED_EVENTS_COUNT = EXPECTED_EVENTS_ARRAY.length;
^^^^^^^^^^^^^^^^^^^^^
The local variable EXPECTED_EVENTS_COUNT is never read
----------
----------
19. WARNING in C:\cc\cc-common\build\checkouts\hdk\working_jdktools\modules\jpda\test\common\unit\org\apache\harmony\jpda\tests\jdwp\Events\CombinedEventsTest.java
(at line 84)
int EXPECTED_EVENTS_COUNT = EXPECTED_EVENTS_ARRAY.length;
^^^^^^^^^^^^^^^^^^^^^
The local variable EXPECTED_EVENTS_COUNT is never read
----------
20. WARNING in C:\cc\cc-common\build\checkouts\hdk\working_jdktools\modules\jpda\test\common\unit\org\apache\harmony\jpda\tests\jdwp\Events\CombinedEventsTest.java
(at line 212)
int EXPECTED_EVENTS_COUNT = EXPECTED_EVENTS_ARRAY.length;
^^^^^^^^^^^^^^^^^^^^^
The local variable EXPECTED_EVENTS_COUNT is never read
----------
21. WARNING in C:\cc\cc-common\build\checkouts\hdk\working_jdktools\modules\jpda\test\common\unit\org\apache\harmony\jpda\tests\jdwp\Events\CombinedEventsTest.java
(at line 348)
int EXPECTED_EVENTS_COUNT = EXPECTED_EVENTS_ARRAY.length;
^^^^^^^^^^^^^^^^^^^^^
The local variable EXPECTED_EVENTS_COUNT is never read
----------
22. WARNING in C:\cc\cc-common\build\checkouts\hdk\working_jdktools\modules\jpda\test\common\unit\org\apache\harmony\jpda\tests\jdwp\Events\CombinedEventsTest.java
(at line 732)
String failureMessage = "## FAILURE during checking events! !";
^^^^^^^^^^^^^^
The local variable failureMessage is never read
----------
23. WARNING in C:\cc\cc-common\build\checkouts\hdk\working_jdktools\modules\jpda\test\common\unit\org\apache\harmony\jpda\tests\jdwp\Events\CombinedEventsTest.java
(at line 894)
String failureMessage = "## FAILURE during checking events !";
^^^^^^^^^^^^^^
The local variable failureMessage is never read
----------
----------
24. WARNING in C:\cc\cc-common\build\checkouts\hdk\working_jdktools\modules\jpda\test\common\unit\org\apache\harmony\jpda\tests\jdwp\Events\CombinedEventsTestCase.java
(at line 135)
long methodStartCodeIndex = lineTableReply.getNextValueAsLong();
^^^^^^^^^^^^^^^^^^^^
The local variable methodStartCodeIndex is never read
----------
25. WARNING in C:\cc\cc-common\build\checkouts\hdk\working_jdktools\modules\jpda\test\common\unit\org\apache\harmony\jpda\tests\jdwp\Events\CombinedEventsTestCase.java
(at line 187)
long methodStartCodeIndex = reply.getNextValueAsLong();
^^^^^^^^^^^^^^^^^^^^
The local variable methodStartCodeIndex is never read
----------
----------
26. WARNING in C:\cc\cc-common\build\checkouts\hdk\working_jdktools\modules\jpda\test\common\unit\org\apache\harmony\jpda\tests\jdwp\Events\ExceptionTest.java
(at line 188)
long frameID = reply.getNextValueAsFrameID();
^^^^^^^
The local variable frameID is never read
----------
----------
27. WARNING in C:\cc\cc-common\build\checkouts\hdk\working_jdktools\modules\jpda\test\common\unit\org\apache\harmony\jpda\tests\jdwp\ThreadReference\FramesTest.java
(at line 450)
frames.add(new FrameStruct(frameID, loc));
^^^^^^^^^^^^^^^^^^^^^^^^^^^^^^^^^^^^^^^^^
Type safety: The method add(Object) belongs to the raw type Vector. References to generic
type Vector<E> should be parameterized
----------
----------
28. WARNING in C:\cc\cc-common\build\checkouts\hdk\working_jdktools\modules\jpda\test\common\unit\org\apache\harmony\jpda\tests\jdwp\share\JDWPUnitDebuggeeProcessWrapper.java
(at line 233)
argv.add(val);
^^^^^^^^^^^^^
Type safety: The method add(Object) belongs to the raw type Vector. References to generic
type Vector<E> should be parameterized
----------
29. WARNING in C:\cc\cc-common\build\checkouts\hdk\working_jdktools\modules\jpda\test\common\unit\org\apache\harmony\jpda\tests\jdwp\share\JDWPUnitDebuggeeProcessWrapper.java
(at line 253)
return (String[])argv.toArray(args);
^^^^^^^^^^^^^^^^^^
Type safety: The method toArray(Object[]) belongs to the raw type Vector. References to generic
type Vector<E> should be parameterized
----------
29 problems (29 warnings)
JPDA exclude list: C:\cc\cc-common\build\checkouts\hdk\working_classlib\deploy\build\jdktools.jpda.exclude
Running JPDA tests
Debugger JVM=C:\cc\cc-common\build\checkouts\hdk\target\hdk\jdk\jre/bin/java
Debuggee JVM=C:\cc\cc-common\build\checkouts\hdk\target\hdk\jdk\jre/bin/java
SAMSA exclude list: C:\cc\cc-common\build\checkouts\hdk\working_classlib\deploy\build\jdktools.samsa.exclude
Running SAMSA tests
test.jre.home=C:\cc\cc-common\build\checkouts\hdk\target\hdk\jdk\jre
Run jdk/bin/java -version in C:\cc\cc-common\build\checkouts\hdk\working_jdktools\build\test_report
java version "1.5.0"
pre-alpha : not complete or compatible
svn = r594328, (Nov 13 2007), Windows/em64t/msvc 1400, debug build
http://harmony.apache.org
Run jdk/bin/javac -version in C:\cc\cc-common\build\checkouts\hdk\working_jdktools\build\test_report
Run jdk/bin/javah in C:\cc\cc-common\build\checkouts\hdk\working_jdktools\build\test_report
Run jdk/bin/javadoc in C:\cc\cc-common\build\checkouts\hdk\working_jdktools\build\test_report
Run jdk/bin/jarsigner in C:\cc\cc-common\build\checkouts\hdk\working_jdktools\build\test_report
Run jdk/bin/keytool -help in C:\cc\cc-common\build\checkouts\hdk\working_jdktools\build\test_report
Compiling TOOLS tests
Since fork is false, ignoring memoryMaximumSize setting
----------
1. WARNING in C:\cc\cc-common\build\checkouts\hdk\working_jdktools\modules\tools\src\test\java\org\apache\harmony\tests\tools\javah\Test\Test01.java
(at line 24)
private static final long xxx2 = 1;
^^^^
The field Test01.xxx2 is never read locally
----------
1 problem (1 warning)
TOOLS exclude list: C:\cc\cc-common\build\checkouts\hdk\working_classlib\deploy\build\jdktools.tools.exclude
Running TOOLS tests
test.jre.home=C:\cc\cc-common\build\checkouts\hdk\target\hdk\jdk\jre
The test report is in C:\cc\cc-common\build\checkouts\hdk\working_jdktools\build\test_report\html\index.html
The execution FAILED with the following exception:
The following error occurred while executing this line:
C:\cc\cc-common\adaptors\jdktools-test\adaptor.xml:28: The following error occurred while
executing this line:
C:\cc\cc-common\build\checkouts\hdk\working_jdktools\build.xml:242: The following error occurred
while executing this line:
C:\cc\cc-common\build\checkouts\hdk\working_jdktools\make\build-test.xml:97: There were test
errors.

***********************************************************
Unit Tests: (161)
        
error: testCombinedEvents_04 org.apache.harmony.jpda.tests.jdwp.Events.CombinedEventsTest
Unit Test Error Details:	(1)
                
Test: testCombinedEvents_04Class: org.apache.harmony.jpda.tests.jdwp.Events.CombinedEventsTestorg.apache.harmony.jpda.tests.framework.TestErrorException:
Debuggee process did not finish during timeout
	at org.apache.harmony.jpda.tests.jdwp.share.JDWPUnitDebuggeeProcessWrapper.WaitForProcessExit(JDWPUnitDebuggeeProcessWrapper.java:284)
	at org.apache.harmony.jpda.tests.jdwp.share.JDWPUnitDebuggeeProcessWrapper.finishProcessAndRedirectors(JDWPUnitDebuggeeProcessWrapper.java:87)
	at org.apache.harmony.jpda.tests.jdwp.share.JDWPUnitDebuggeeWrapper.stop(JDWPUnitDebuggeeWrapper.java:109)
	at org.apache.harmony.jpda.tests.jdwp.share.JDWPTestCase.internalTearDown(JDWPTestCase.java:108)
	at org.apache.harmony.jpda.tests.jdwp.share.JDWPSyncTestCase.internalTearDown(JDWPSyncTestCase.java:83)
	at org.apache.harmony.jpda.tests.jdwp.share.JDWPRawTestCase.tearDown(JDWPRawTestCase.java:118)
Caused by: java.lang.IllegalThreadStateException: process has not exited
	at java.lang.Runtime$SubProcess.exitValue(Runtime.java:357)
	at org.apache.harmony.jpda.tests.jdwp.share.JDWPUnitDebuggeeProcessWrapper.WaitForProcessExit(JDWPUnitDebuggeeProcessWrapper.java:279)
	at org.apache.harmony.jpda.tests.jdwp.share.JDWPUnitDebuggeeProcessWrapper.finishProcessAndRedirectors(JDWPUnitDebuggeeProcessWrapper.java:87)
	... 14 more

***********************************************************
Modifications since last successful build:	(1)
            
add cc-hdk log20071113044535Lbuild.317 11/13/2007 04:45:35hdk

begin 644 execution_log.zip
M4$L#! H    ( !$W;3<&7>7;F!(  $=_   2    97AE8W5T:6]N7VQO9RYH
M=&UL[5UM<]LXDO[L5.4_8&?K:NTJB]'[BU?QE<]V-L[$<<YR,G<5Y5(P"4E,
M*((+D+:UJ?GOUPV0DDA*I&S#L9-:U8PC@4"CT4^CN]$$P?XDG'K[_4ONS/;[
M@6#[?4ID.//8R[^-N!]6I/LOMD>ZU?_X^]_VGS^+ H>&K"*O_+WGSYX_JT@6
M1D'EJ_,MY-R3E6NIB^-JV7(18;.C*/!<&ZX[)!#\*[-#XM,I(ZY/W&G 16B1
M]W'Y!0\J;]D5\[!FP$0X(PX;N;X;NMR7^CN0&;E"AMC^<&]HV_!?Q>;3*?>'
MTA9N$,IAW-IETKJ9>H3Z#J%CBAWFVUQ&KN<,[0FSO_$(VDZ<;\-K+KZY_OA+
M,J#AE'YC&:HXP)#)$$9(\/.)V1/^F3Q[N>'GV04TADY(T@FY='TJD+IE;4X%
MV; ]1OT*,B,K,(8@"I7X;1[,*E\%JXQ<CVE$[,F4.]FRN-I>,J(*U(GT536P
MZ3?'%9_)H6 *1/BQ=S<IZDK8Q1?!$/F'ZT#B8-1/+9<,2H=\&K@>2O_-^Z,#
M$K=X,&:&MD>E9$D77^D5M9>9J'=J1/)(V(PH7$C('ZC/@>MC)]".N)*,J"?9
M+G''/A?(QY1-N9B=TAMW&DT'8 D(3'A4TC21ROR3+J]9Y(^#\W<G[_YQ]XFF
M56_X%2R*&L<P;AV!$1AR,1[2@ *-X80**)XM*LKA2(!908K#(W89C<>,G;.Q
M*T,F+&0PS2O9IB$!X3/2ZNZD+VV)N!ES+.HXVTY,;>?O)%/Q_]9\TM4N9@$(
MDHY8.-LC%Q,&8@XG'$P2T#Z[1,.W0RZ9Q_VQ CZ$&H)>DQ";O77];\QY"^Q8
MY)R-@"? 3U4;,Y\)U\Y6ZQ_O$SGAD>< 31)0E D,!;!T-@-Q77G]J8"+=O,L
M4!ZA&-=J*PNLZX,H?.J]7UAR,);;Z(YVR17U(L!X0XAOC39VI-'>)66HOZ9R
M<DJ#0LCC.OW?=S\^$.*-IX+X5^<Z&+ZG]C<6'KDRH"&T*)[3M5HSBSV$%7[X
MWQ&+F)K4ZJ>F>1O,3<[LTCEM8#8W?UX,Z\U>WC!#*)E,6G9-3F ^CYG8QO*9
M)FZ-67CB;._L[&;HEGR62-S%!MSU\S"V(Z27'BNU'JJ6 ?O1^HEUK)NS$]@Q
M+!BTDITXNR0NV%PK?@5,VS\OIHU6SN__&].B\LZ3POKC]-05@I?X]VXC-W$5
M':F<N_I:#JXY9WX@!)V5>O1YK7N[]>Y/"%FO6L]"=D6%!@R^%,/U\T+5^_F@
MJM?J.:A&+O,<#9:,8/%TB-F%5[HPY$I<VSN?W,]W#YY^7HAKU9\1XT81QNKK
MKVQ!UV+YR$DLA6"<OQ)G_A'#.&5XYH,@KY/BMS3R[4F2Y"J$N9>/;W'BDN,;
MFZD<RBLN$K*$W80,HJ3%1?(]TUBOE3:8O1-,'0J7>NZ_,'HA!;TZ'(#V>4@<
M!K4$(WA#@H8 ^<CUJ1?3^<B$A(8?3HZ(TDW"1UHE4)WN"?DCI[84Y,>8CY!#
M958_^!ZGSD;XYB>QOJ="\*<5A:YG+7*#V>E,;@-G 5U,)?OL"K",Y,8V\Y&S
M2_<1>J^3%?HE\,.H#X(XB\*ST:G*HY.7.L&^1NRD1. >MT'[(3)RU0Q*DYY+
M7#"ZJ<0?.1=T'XG7.K6LR(/HT@,;H2@1)*2^;0]"=2<#4[H[X&$$OY:ZSCL>
MON*1[Y09-[*)8Q,LC(2O#9#F8,1%CHL=,A)\JOS<HF9FU(>1#/GT+10!F#YC
M8'[1N ,*S(%EJG^E[1YZ0O@%O4S5S2&DU/_/_54=:%H;ZL0CYV[NIQ.Y_&!*
M)\![/ &=R'+Q]'5BK:X\<DXHI2M\>HE; ?3/:K6.-X6*M:5:76>TV4T H>DA
M1X,;)C3!>&]CO\PY54'L(*0"ZCCLQ'?8#7GYDBQ?/0:0DVNYJ'FEO=_8[J_F
M[@[V?RVNCYS_*<*U48IKJY$S L*] DF1.;Q(*X;IQ@W/F<W<*YA()=ZY$+55
MN.FP=/4(UO&0@E$C[\TVA.V1<T#W@ZW37G%OEAS_S_OCPXOCHR_''X_?70R^
M')Y]>'<!0&7+#\[/#_[7\I@_#B>K\+O;3%O=N\F9]LBYH/60E>*5OT_R"^%5
M?^3\S3UPJ=?R"\!?")BGD(RY&S"-9FY;T:\$S%-*F=P.F$X^91*O#T;4]2+!
M3IF4=,P E-_^^E?RZN#D[8?S8^)$JHX:$WY1'EW^A?SEMXVR*J709#J_"R9/
M*:-R2^^23U/>'9,G!,E:J)Y2*B8'U2&5)2OO1NX..V9AXW1_=J6DVER@1,]Q
MCPUNT'G';L*/N-WN %:F_GA[]9+I3B9N)0]WF4U/*3-R!XBZN1QE$43B)T)F
M+6)/*#\Q3RB5YR6ZN3A! :7NZ9T<K<'FE;Y:#$^Y@8O[, G"4T@F7$QP(//;
MB$,EK7(OU&SE4D1+>TIPOZ$B!)XILL/M6'B[*-2=IW#7^R-<Y:+P]JFN\G!;
MQ)]"2D+"!39\<_3'^P_0(LFIOA<<!"+_$#0(RO8$-G(I)2K&5_$^%>]'[5/Y
M<7#6GT):XOZPY3.!<48^SKQ_^KRC<$QVJ\ /N397.__<=<8FO6B8H>\G 30^
M5P>6?RK)-ORXIL('P<@=?%@J #\#$%38C>U%#LL\,*4>DXHO@;QE>+N'HM3M
M?\^]'#K@S/@LKIMHCX7*8,74XP<'5SZV=1[Y_JJ'MI+KA,QW%;SY>/IR$PXA
M' '7JKY^Q?\%>P&QUHN%IN5H,W.T/WW%Z;$8%\P32\\3*YXG6C1JJ!;.$^NC
M*\*(>J=0";3>BK=%H&]+D\022? )3%+;):_T4D;ND>HN.<;-0?KKA3MEA'DT
MD,S9PSQ8I]$BDMGWIU5K6YVZ,5*]1M<<K6K;$*V.U35%JFMU:PUCM*H]4RAV
MK7JM5TBKL2FM5LWJ=(M5HKXIK4;#:G=-J43'JG9,T>I9S7HQCAO+J]FSVIUB
M6LV-^:K6K78QCK>:V>:,1-N4E>C5K&JC:4SM6VUST[',>K77T*KE#'0=8.QT
M5A ['EQLXCWT\M3*)Q143NWXR,#,;%K-ZBH.[S8SC?F0GM4P9_;;=5,3P"2M
M=JGWWMA>M-L@KIHY%$U&%24^Y%9\M<R-T9@A0UHM<S.HV34H^Y)8X%:&WZ#_
M-B9Z",.,^;:.U3 8TM6-J6K7JI6(_C;&OM,SI:K ET&+8Y"M:LV<Y^ATS8VQ
MVC"G]N:L1,>J&;2$K8XIBP.RKYH*#PU;+W.B[[5,61QP0DV#SK%J#L9ZVYQS
M[#;-J42W9C P:1LT.553.M&V6CU3\C*IJVVC@9Q)4]@R9J)A#ID:(L!HT*,9
M8ZM7ZF@W3IVTZ[#F-F=Q6DU3%J=G]4PMCC%9:W 5:FS%83"E@[1,.B&#X:4Q
MFUKN&UNWR(#U#/K9=LN4D3!K<$QI/4P@8]I5QW#)D-;7#<Y&I%620[X-+7,1
M='G>ZS:+4',KM!Z$A.;NG73KYJ9CSV >I^P6V.:RA]5QB7/<F%:S:C5*Y+7Y
MO:8&.&US*S23-P/*DB^WXJMJSJ49I65PU6[,=32LAL'[5E5C*R'#04[=G"FL
M&TNB 8P&HW%S$\AD&J= Z5?=7+O[GH_7W%NZ<V? L==+#>_&M+HUJV[J1EN]
M9BPCC*2,Q4% RUBL5[5Z+7,QE;&I 3#6ZN86JL9\'LC>J*JV#.&(\C+$%@S1
MW'84@_Z@ WZJ%8_Q^;.01_:D$C\A(]5I\GN+<J:(+)6R^:GR>^5[#0<'IX,'
MW&PHZ50N[3;$?FWNVQ3D\HY#MZX^EE\?Q(ZO#O Y\1D^ZT]"=A/N$H>KTR1X
M.%$GHY=O5]0#4C72%;#(^BK \O,IN^.6PER7^$*!^3Y#4DD.B[CKSMXUA_9#
MAS?,_DP.E.LBK[7K(OIH*B;('MFV=\@A#V;"'4]"""=ZH&KU*JP\<)=LW&S 
M1^$UGOFDCN&@Z@@.+H@+VNFY-O,EJ-$NH8!#H%XB@<=EIOM7@TS&^%O-:EG5
MWTBZ"FA;A7K!A )3>,X4C#[P6,BP)_P.W0+==!MYY>.C%ZU>LU'O[I+M=_R*
MU!K(?V=GE_SA^@Z_EB_8M-T,7TSEE4UJS2I,&754/%$B2].;A&&P]^)%XN%C
MAP^^OQ@^^\'Q.[8]%R8X>8-RU&\D /2J5J<#<$'(;,&H%BB>_-<I_!(!"J*J
MX.Q8Y,#SB+H,)H5))JZ88Q4/:_)0HWGS[J2BWF9")DR=GJ)GL=I,37&7=;IZ
M^M<'?,QO;U5 %N]21LZM4WR/R">N#Z#_3/KZ9#,\6T;N%U&?-TD7$U*YY#Q4
M5$ 3)Z2/?_?5)!F[$.4157KM@I!QUS>,FOD.VB*>);3Z@WO-'3:BD1?&I[ A
MP4)! $\Y?O"SAB?<F_\#6.*DCVCNITBA[B$Y_=J3.4N".:Y@-MILU[\-6S)@
MMCMRU4MF<K8FQY)#^KH?+F9SOA*64AJ8,&;'KQ4!'4IUMQF'\\[(]<2U)WFJ
M(S"=^G$N?&R"BEG9"%P?9D:VFQ-5&+\_9$GUU+,8T V-0CX%JZE.*RGK >S7
M)0<#DX4-#V$2L8-$"P#KF3)^4W-MF9H*$M2)@'@.2P1<D7_"@DD#N=1H,RE+
M#$Z4/"]G>!@AV(*L)IPS"<H+T5.QG7.X_6"6#L@?(7E]=J*++@UE"%S/6%C$
M%KB3,>+[8(R)@>Y@PKS 6F5BMQ9,?(^MXI_DS<&Y"A@)X$8S2"TU0'UR1[,5
M#8LT)VZU!1\2$P!@D:*#[4F^?>4;FTF8:HSTDV]?E"7<4D]1ZDA%*UQR/4- 
ME:G'=Q84\"=04*4;M Y0<Y?[EQ+@<(#"G+ND+,_]O/%2NRV2G(X$Y?.V9!L,
MA^..1A!JZ-/#5O2YDV5020^ T6;Y"TXP[$"]VRL>6[&$X:H"?'5[:_!*1=_6
M$<3.RHCF(56&94N-BE^YL%B@CJ/>%4:]V"/DNO1@CJ2;P)#9=>) X%? I<P'
MA!6;"0APE 8YK@P\.B-8!#8&S^629#L"7JY=\(N)BB+W"9=9Z862DO[%X.#+
MA_.W^T@SI52P\ (%H-, 3>V$"S><Y=MC[YH&?ONBILVR9JB"! FHMLQNAAK(
MXF9&^A,.<QI$"%&<W/^^U\?)O?^G$A5<5I$=S&JH1.)*:HA8:Y<P:VSIBI:N
M:(%-V:O5&\U5?>EI@7_GN"_/B52'VZ\O+MYCK#XX._Q]D!5D#*/05EY[""2W
ML/I(U!:S(.1C00/PFXHPK"X2%1!K2*K&_82_I%31S,XVN9J-6W&AC@N<4I^.
MT26N,0N+GM+<+>Q! 9LPX4SQB5Y!:SO.<1IB%F!];VE>YRT*F45M-<_M\I0M
MZ'"9X>4VA1Q/'?/\3N/#1QQWG$H?9'M,2SC=:@W3N=  = @]/*F@XWZH\"#]
MZ_>XRTC%!>EK"3O?*_WX=1W:5ORY7**C "SKZZ]?U&N\]O^T+(M4WO0Q"DLJ
M%3+B\VL_>2V(S'"RI71#L']N;?U#KR192BG@2C3/Q"\U0D'9PMO:.L1O:7<A
MV%5B\?&TZR@;\53T.9\A--9?%E,\Y&!W>3C1R@*!>+:IPS"] 5[EG$WY%2/@
M\F#)H!S[:K.R56$W"!4T.59?4L/#_I0'1B,L0X=GW>I6!1;80!F:#QBL112O
M6%D'&:Y(%N PVFQ+U#5H=S&!0%;I7:*[7 >0! 1$$V"RC?69U-#\1!].35-\
M;]L36*OO("5*#@?G^B2-+ W@T?:X#^*:OZ@4JB/G2FPKJJN0R$%4J3].1U+9
MVA!M^:&M8'R/7U&66H(97A4X^1AIJR*9-]($YJH'D2L4Q@%8BHHR&?,,)C"6
MHY9$E6G^BT+)K47L_#&)G)?[5$(NFEJO$<6B":[MS??,+,^DJ2"\V-O*--%:
ME^T[GV[>Y#V@%V=G;P>I%X'&#\TOJK3^_8[.U%D/^I<4MC[P 3M8==*#'JFN
MK%)HZ@V.ZD^U5O(&N'5GNZ9>$*#.R[FYN:F3EZ16>J##_+/ZB!Q]BFO,G")Z
MGS-:D_,6R'8M.6UA@\,6M"X^V T0_?='W@#)32[S-T VN*V^&#V^OT#&=]@A
M!!F@^=-'9 \H(%UX6WWC_4SUKM4TM@EYMUFK6K5>\2WLC5FK+?8.W_=6GHYR
M*F"M*FP:A#-=&.<*EXKR)9BGJ^@0$7[KX>B?,"A!?:D/-@?&]TB[U^Y-,[J#
MLQ6Y(;H1SE-C,>L0WY(^=/&(,@N_(K\2%N+A@N'GS\#]+/_4@E#R$3H]^/S9
M,V02'5.D(CV]#T2[:96JY)@'54<7)@>&[:DF2Q=0_H3;=B0$3,#KB>O-*<+E
M$.,F-);067;HU*&PT!!R/O,5<TDQOL-\K][5A]88Z6]S4>N^F_4?W;EZC?LB
M&E!L]#J*"XA_KO&/TBBM]!: VG]!]_LOP%S#WTONS. ?U(?]_P=02P$"% ,*
M    "  1-VTW!EWEVY@2  !'?P  $@              I($     97AE8W5T
B:6]N7VQO9RYH=&UL4$L%!@     !  $ 0    ,@2      $! 
end

Mime
View raw message