harmony-alerts mailing list archives

Site index · List index
Message view « Date » · « Thread »
Top « Date » · « Thread »
From nom...@intel.com
Subject [build-test alert] FAILED Linux x86_64: JettyScenario
Date Mon, 12 Nov 2007 22:16:12 GMT
Jetty server JRE:

Apache Harmony Launcher : (c) Copyright 1991, 2006 The Apache Software Foundation or its licensors,
as applicable.
java version "1.5.0" 
pre-alpha : not complete or compatible
svn = r594094, (Nov 12 2007), Linux/em64t/gcc 4.1.0, release build
http://harmony.apache.org

Scenario framework JRE:

Apache Harmony Launcher : (c) Copyright 1991, 2006 The Apache Software Foundation or its licensors,
as applicable.
java version "1.5.0" 
pre-alpha : not complete or compatible
svn = r594094, (Nov 12 2007), Linux/em64t/gcc 4.1.0, release build
http://harmony.apache.org

================================================================================
Scenario results:

Testsuite: org.apache.harmony.test.jetty.JettyScenario
Tests run: 5, Failures: 1, Errors: 0, Time elapsed: 3.842 sec
------------- Standard Output ---------------
Setup completed.

==============================================================testInitialPage===
Starting initial page test case.
Loading page from server: http://localhost:7070/test/
Getting resource with name: initial_page.html
Found resource: /export/users/cc/cc-suites/tests/JettyScenario/resources/JettyScenario/initial_page.html
Saving content of downloaded page to: /export/users/cc/cc-suites/build/results/JettyScenario/JettyScenario/initial_page.html
Comparing page content with etalon: initial_page.html
Page is equal to etalon.
Initial page test case passed.

============================================================testStaticContent===
Starting static content page test case.
Loading page from server: http://localhost:7070/test/data.txt
Getting resource with name: static_content.txt
Found resource: /export/users/cc/cc-suites/tests/JettyScenario/resources/JettyScenario/static_content.txt
Saving content of downloaded page to: /export/users/cc/cc-suites/build/results/JettyScenario/JettyScenario/static_content.txt
Comparing page content with etalon: static_content.txt
Page have different number of lines than etalon.

=======================================================testSessionDumpServlet===
Starting servlet test case.
Loading page from server: http://localhost:7070/test/session/
Getting resource with name: session_dump.html
Found resource: /export/users/cc/cc-suites/tests/JettyScenario/resources/JettyScenario/session_dump.html
Saving content of downloaded page to: /export/users/cc/cc-suites/build/results/JettyScenario/JettyScenario/session_dump.html
Comparing page content with etalon: session_dump.html
Page is equal to etalon.
Session dump servlet page is OK.
Getting resource with name: session_dump_new.html
Found resource: /export/users/cc/cc-suites/tests/JettyScenario/resources/JettyScenario/session_dump_new.html
Saving content of downloaded page to: /export/users/cc/cc-suites/build/results/JettyScenario/JettyScenario/session_dump_new.html
Comparing page content with etalon: session_dump_new.html
Page is equal to etalon.
Session create page is OK.
Getting resource with name: session_dump_set.html
Found resource: /export/users/cc/cc-suites/tests/JettyScenario/resources/JettyScenario/session_dump_set.html
Saving content of downloaded page to: /export/users/cc/cc-suites/build/results/JettyScenario/JettyScenario/session_dump_set.html
Comparing page content with etalon: session_dump_set.html
Page is equal to etalon.
Session set page is OK.
Getting resource with name: session_dump_remove.html
Found resource: /export/users/cc/cc-suites/tests/JettyScenario/resources/JettyScenario/session_dump_remove.html
Saving content of downloaded page to: /export/users/cc/cc-suites/build/results/JettyScenario/JettyScenario/session_dump_remove.html
Comparing page content with etalon: session_dump_remove.html
Page is equal to etalon.
Session remove page is OK.
Getting resource with name: session_dump_invalidate.html
Found resource: /export/users/cc/cc-suites/tests/JettyScenario/resources/JettyScenario/session_dump_invalidate.html
Saving content of downloaded page to: /export/users/cc/cc-suites/build/results/JettyScenario/JettyScenario/session_dump_invalidate.html
Comparing page content with etalon: session_dump_invalidate.html
Page is equal to etalon.
Session invalidate page is OK.
Servlet test case passed.

===========================================================testRequestDumpJSP===
Starting JSP test case.
Loading page from server: http://localhost:7070/test/snoop.jsp
Getting resource with name: request_dump_JSP.html
Found resource: /export/users/cc/cc-suites/tests/JettyScenario/resources/JettyScenario/request_dump_JSP.html
Saving content of downloaded page to: /export/users/cc/cc-suites/build/results/JettyScenario/JettyScenario/request_dump_JSP.html
Comparing page content with etalon: request_dump_JSP.html
Page is equal to etalon.
JSP test case passed.

=====================================================testGZippedStaticContent===
Starting gzipped static content test case.
Loading page from server: http://localhost:7070/test/data.txt.gz
Unpacking content from archive.
Getting resource with name: static_content_ungzipped.txt
Found resource: /export/users/cc/cc-suites/tests/JettyScenario/resources/JettyScenario/static_content_ungzipped.txt
Saving content of downloaded page to: /export/users/cc/cc-suites/build/results/JettyScenario/JettyScenario/static_content_ungzipped.txt
Comparing page content with etalon: static_content_ungzipped.txt
Page is equal to etalon.
Gzipped static content test case passed.
------------- ---------------- ---------------

Testcase: testInitialPage took 1.121 sec
Testcase: testStaticContent took 0.2 sec
	FAILED
Content is not correct.
junit.framework.AssertionFailedError: Content is not correct.
	at org.apache.harmony.test.jetty.JettyScenario.testStaticContent(Unknown Source)
	at java.lang.reflect.VMReflection.invokeMethod(VMReflection.java)

Testcase: testSessionDumpServlet took 0.354 sec
Testcase: testRequestDumpJSP took 1.513 sec
Testcase: testGZippedStaticContent took 0.529 sec

================================================================================
Jetty server output:

2007-11-12 22:15:54.082::INFO:  Logging to STDERR via org.mortbay.log.StdErrLog
2007-11-12 22:15:54.433::INFO:  Statistics on = false for SelectChannelConnector @ 0.0.0.0:7070
2007-11-12 22:15:54.516::INFO:  jetty-6.1.2rc1
2007-11-12 22:15:54.608::INFO:  Deploy /export/users/cc/cc-suites/build/libs/jetty-6.1.2rc1/contexts/javadoc.xml
-> org.mortbay.jetty.servlet.Context@abd9b3e8{/javadoc,file:/export/users/cc/cc-suites/build/libs/jetty-6.1.2rc1/javadoc/}
2007-11-12 22:15:54.668::INFO:  Deploy /export/users/cc/cc-suites/build/libs/jetty-6.1.2rc1/contexts/test.xml
-> org.mortbay.jetty.webapp.WebAppContext@abdbd55a{/test,/export/users/cc/cc-suites/build/libs/jetty-6.1.2rc1/webapps/test}
2007-11-12 22:15:57.606::WARN:  Unknown realm: Test JAAS Realm
2007-11-12 22:15:59.568::INFO:  Started SelectChannelConnector @ 0.0.0.0:7070

================================================================================

BUILD FAILED:
	Ant Error Message:
/export/users/cc/cc-suites/scripts/cc-exec-adaptor.xml:104: The following error occurred while
executing this line: /export/users/cc/cc-suites/adaptors/JettyScenario/adaptor.xml:186: Jetty
scenario failed

Date of build:	2007-11-13 04:15:43 +0600
Time to build:	23 seconds
Last changed:	11/13/2007 03:44:35
Last log entry:	snapshot

***********************************************************
Errors/Warnings:	(2)
            
The execution FAILED with the following exception:
The following error occurred while executing this line:
/export/users/cc/cc-suites/adaptors/JettyScenario/adaptor.xml:186: Jetty scenario failed

***********************************************************
Unit Tests: (5)
        
failure: testStaticContent org.apache.harmony.test.jetty.JettyScenario
Unit Test Error Details:	(1)
                
Test: testStaticContentClass: org.apache.harmony.test.jetty.JettyScenariojunit.framework.AssertionFailedError:
Content is not correct.
	at org.apache.harmony.test.jetty.JettyScenario.testStaticContent(Unknown Source)
	at java.lang.reflect.VMReflection.invokeMethod(VMReflection.java)

***********************************************************
Modifications since last successful build:	(1)
            
add cc-snapshot log20071113034435Lbuild.34 11/13/2007 03:44:35snapshot

begin 644 execution_log.zip
M4$L#! H    (  0B;3= Z0ZNN $  #,#   2    97AE8W5T:6]N7VQO9RYH
M=&ULE5--;]LP#+WK5_ R]!);R=(6F><&"- 6V+#3FEN0@RK3L0I9$B0J'_OU
MD^($FUM@P 0;_B#?X\,C67?4ZV7]:IO3LG8>E[6 0">-#S>M-50$]0LK6$P_
M?;U9LN@:05B$O:D8Y+/!(\HMK @\[E50UL#=E]OY[+YDK)"V=TICH=K"(#;8
M5(SY^ <J.[N%A[\/K!KAR'IHT_T=B4XO$HWPRE;P,QHHRXS=-*B1< N/^:G,
MK@*.1V<]\1C0!RYENHH0%6'@KU'IAGL,45/@(U+^EK]*;7<C22\D?*8=%$"B
MW*,_9VS>HE&TS5I,3K!^5PHG9(=E)WQOS:E,):D<>$>U1OAU2@J0O8"["3P+
MI6,26,%L D_>6Y]>IQ-8JQX!M7 A60?S<G'[.8F1'YC^1P8\K[[]>'ID ]YC
M=BVQ>&%"\KP'2C63COELVH=+"VW PEA2K9*"4H>K=V99YSZ8Q=9=DIYF(V;$
MI2@<%'5 *=):K>TAH_ HT0VLZW$@^P!6RN@]-G#HTB1=&5.8.A5 *X,5^T?O
MQ3!.[]M^^5T>>UW-%O?55?O5HS8U!!M6<[&L^7DG^+ ?_+PLOP%02P$"% ,*
M    "  $(FTW0.D.KK@!   S P  $@              I($     97AE8W5T
B:6]N7VQO9RYH=&UL4$L%!@     !  $ 0    .@!      $! 
end

Mime
View raw message