harmony-alerts mailing list archives

Site index · List index
Message view « Date » · « Thread »
Top « Date » · « Thread »
From nom...@intel.com
Subject [build-test alert] FAILED Linux x86: jdktools-test debug
Date Mon, 12 Nov 2007 21:45:23 GMT

BUILD FAILED:
	Ant Error Message:
/export/users/cc/cc-common/scripts/cc-exec-adaptor.xml:104: The following error occurred while
executing this line: /export/users/cc/cc-common/adaptors/jdktools-test/adaptor.xml:28: The
following error occurred while executing this line: /export/users/cc/cc-common/build/checkouts/hdk/working_jdktools/build.xml:242:
The following error occurred while executing this line: /export/users/cc/cc-common/build/checkouts/hdk/working_jdktools/make/build-test.xml:98:
There were test failures.

Date of build:	2007-11-13 03:25:12 +0600
Time to build:	20 minutes 4 seconds
Last changed:	11/13/2007 00:26:34
Last log entry:	hdk

***********************************************************
Errors/Warnings:	(226)
            
Result: 1
========================================
Testing jdktools binaries...
========================================
Compiling JPDA tests
Since fork is false, ignoring memoryMaximumSize setting
----------
1. WARNING in /export/users/cc/cc-common/build/checkouts/hdk/working_jdktools/modules/jpda/test/common/unit/org/apache/harmony/jpda/tests/framework/DebuggeeRegister.java
(at line 58)
registered.add(debuggee);
^^^^^^^^^^^^^^^^^^^^^^^^
Type safety: The method add(Object) belongs to the raw type LinkedList. References to generic
type LinkedList<E> should be parameterized
----------
----------
2. WARNING in /export/users/cc/cc-common/build/checkouts/hdk/working_jdktools/modules/jpda/test/common/unit/org/apache/harmony/jpda/tests/framework/TestOptions.java
(at line 505)
internalProperties.put(name, value);
^^^^^^^^^^^^^^^^^^^^^^^^^^^^^^^^^^^
Type safety: The method put(Object, Object) belongs to the raw type HashMap. References to
generic type HashMap<K,V> should be parameterized
----------
----------
3. WARNING in /export/users/cc/cc-common/build/checkouts/hdk/working_jdktools/modules/jpda/test/common/unit/org/apache/harmony/jpda/tests/framework/jdwp/PacketDispatcher.java
(at line 114)
eventQueue.add(eventPacket);
^^^^^^^^^^^^^^^^^^^^^^^^^^^
Type safety: The method add(Object) belongs to the raw type List. References to generic type
List<E> should be parameterized
----------
4. WARNING in /export/users/cc/cc-common/build/checkouts/hdk/working_jdktools/modules/jpda/test/common/unit/org/apache/harmony/jpda/tests/framework/jdwp/PacketDispatcher.java
(at line 249)
replies.put(new Integer(replyPacket.getId()),
replyPacket);
^^^^^^^^^^^^^^^^^^^^^^^^^^^^^^^^^^^^^^^^^^^^^^^^^^^^^^^^^^^^^^^^^^^^^^^^^^^^^^^^^^^^^^^^^^
Type safety: The method put(Object, Object) belongs to the raw type Hashtable. References
to generic type Hashtable<K,V> should be parameterized
----------
5. WARNING in /export/users/cc/cc-common/build/checkouts/hdk/working_jdktools/modules/jpda/test/common/unit/org/apache/harmony/jpda/tests/framework/jdwp/PacketDispatcher.java
(at line 284)
commands.put(Id, command);
^^^^^^^^^^^^^^^^^^^^^^^^^
Type safety: The method put(Object, Object) belongs to the raw type Hashtable. References
to generic type Hashtable<K,V> should be parameterized
----------
6. WARNING in /export/users/cc/cc-common/build/checkouts/hdk/working_jdktools/modules/jpda/test/common/unit/org/apache/harmony/jpda/tests/framework/jdwp/PacketDispatcher.java
(at line 355)
commands.put(Id, command);
^^^^^^^^^^^^^^^^^^^^^^^^^
Type safety: The method put(Object, Object) belongs to the raw type Hashtable. References
to generic type Hashtable<K,V> should be parameterized
----------
----------
7. WARNING in /export/users/cc/cc-common/build/checkouts/hdk/working_jdktools/modules/jpda/test/common/unit/org/apache/harmony/jpda/tests/framework/jdwp/VmMirror.java
(at line 1834)
frames.add(frame);
^^^^^^^^^^^^^^^^^
Type safety: The method add(Object) belongs to the raw type ArrayList. References to generic
type ArrayList<E> should be parameterized
----------
8. WARNING in /export/users/cc/cc-common/build/checkouts/hdk/working_jdktools/modules/jpda/test/common/unit/org/apache/harmony/jpda/tests/framework/jdwp/VmMirror.java
(at line 1902)
vars.add(var);
^^^^^^^^^^^^^
Type safety: The method add(Object) belongs to the raw type ArrayList. References to generic
type ArrayList<E> should be parameterized
----------
9. WARNING in /export/users/cc/cc-common/build/checkouts/hdk/working_jdktools/modules/jpda/test/common/unit/org/apache/harmony/jpda/tests/framework/jdwp/VmMirror.java
(at line 2122)
fields.add(superClassFields.toArray()[i]);
^^^^^^^^^^^^^^^^^^^^^^^^^^^^^^^^^^^^^^^^^
Type safety: The method add(Object) belongs to the raw type ArrayList. References to generic
type ArrayList<E> should be parameterized
----------
10. WARNING in /export/users/cc/cc-common/build/checkouts/hdk/working_jdktools/modules/jpda/test/common/unit/org/apache/harmony/jpda/tests/framework/jdwp/VmMirror.java
(at line 2132)
fields.add(field);
^^^^^^^^^^^^^^^^^
Type safety: The method add(Object) belongs to the raw type ArrayList. References to generic
type ArrayList<E> should be parameterized
----------
----------
11. WARNING in /export/users/cc/cc-common/build/checkouts/hdk/working_jdktools/modules/jpda/test/common/unit/org/apache/harmony/jpda/tests/jdwp/DebuggerOnDemand/OnthowDebuggerLaunchDebuggee.java
(at line 94)
class ExceptionForDebugger extends Exception {
^^^^^^^^^^^^^^^^^^^^
The serializable class ExceptionForDebugger does not declare a static final serialVersionUID
field of type long
----------
----------
12. WARNING in /export/users/cc/cc-common/build/checkouts/hdk/working_jdktools/modules/jpda/test/common/unit/org/apache/harmony/jpda/tests/jdwp/Events/ClassUnloadDebuggee.java
(at line 32)
import java.util.LinkedList;
^^^^^^^^^^^^^^^^^^^^
The import java.util.LinkedList is never used
----------
13. WARNING in /export/users/cc/cc-common/build/checkouts/hdk/working_jdktools/modules/jpda/test/common/unit/org/apache/harmony/jpda/tests/jdwp/Events/ClassUnloadDebuggee.java
(at line 97)
boolean isOutOfMemory = false;
^^^^^^^^^^^^^
The local variable isOutOfMemory is never read
----------
14. WARNING in /export/users/cc/cc-common/build/checkouts/hdk/working_jdktools/modules/jpda/test/common/unit/org/apache/harmony/jpda/tests/jdwp/Events/ClassUnloadDebuggee.java
(at line 171)
public Class loadClass(String name) throws ClassNotFoundException {
^^^^^
Type safety: The return type Class for loadClass(String) from the type ClassUnloadDebuggee.CustomLoader
needs unchecked conversion to conform to Class<?> from the type ClassLoader
----------
15. WARNING in /export/users/cc/cc-common/build/checkouts/hdk/working_jdktools/modules/jpda/test/common/unit/org/apache/harmony/jpda/tests/jdwp/Events/ClassUnloadDebuggee.java
(at line 179)
public Class findClass(String name) throws ClassNotFoundException {
^^^^^
Type safety: The return type Class for findClass(String) from the type ClassUnloadDebuggee.CustomLoader
needs unchecked conversion to conform to Class<?> from the type ClassLoader
----------
----------
16. WARNING in /export/users/cc/cc-common/build/checkouts/hdk/working_jdktools/modules/jpda/test/common/unit/org/apache/harmony/jpda/tests/jdwp/Events/CombinedEvents002Test.java
(at line 100)
boolean expectColocatedEvents = (testedMethodStartCodeIndex == testedMethodEndCodeIndex);
^^^^^^^^^^^^^^^^^^^^^
The local variable expectColocatedEvents is never read
----------
----------
17. WARNING in /export/users/cc/cc-common/build/checkouts/hdk/working_jdktools/modules/jpda/test/common/unit/org/apache/harmony/jpda/tests/jdwp/Events/CombinedEvents003Test.java
(at line 53)
private boolean eventMethodExitReceived = false;
^^^^^^^^^^^^^^^^^^^^^^^
The field CombinedEvents003Test.eventMethodExitReceived is never read locally
----------
18. WARNING in /export/users/cc/cc-common/build/checkouts/hdk/working_jdktools/modules/jpda/test/common/unit/org/apache/harmony/jpda/tests/jdwp/Events/CombinedEvents003Test.java
(at line 76)
int EXPECTED_EVENTS_COUNT = EXPECTED_EVENTS_ARRAY.length;
^^^^^^^^^^^^^^^^^^^^^
The local variable EXPECTED_EVENTS_COUNT is never read
----------
----------
19. WARNING in /export/users/cc/cc-common/build/checkouts/hdk/working_jdktools/modules/jpda/test/common/unit/org/apache/harmony/jpda/tests/jdwp/Events/CombinedEventsTest.java
(at line 84)
int EXPECTED_EVENTS_COUNT = EXPECTED_EVENTS_ARRAY.length;
^^^^^^^^^^^^^^^^^^^^^
The local variable EXPECTED_EVENTS_COUNT is never read
----------
20. WARNING in /export/users/cc/cc-common/build/checkouts/hdk/working_jdktools/modules/jpda/test/common/unit/org/apache/harmony/jpda/tests/jdwp/Events/CombinedEventsTest.java
(at line 212)
int EXPECTED_EVENTS_COUNT = EXPECTED_EVENTS_ARRAY.length;
^^^^^^^^^^^^^^^^^^^^^
The local variable EXPECTED_EVENTS_COUNT is never read
----------
21. WARNING in /export/users/cc/cc-common/build/checkouts/hdk/working_jdktools/modules/jpda/test/common/unit/org/apache/harmony/jpda/tests/jdwp/Events/CombinedEventsTest.java
(at line 348)
int EXPECTED_EVENTS_COUNT = EXPECTED_EVENTS_ARRAY.length;
^^^^^^^^^^^^^^^^^^^^^
The local variable EXPECTED_EVENTS_COUNT is never read
----------
22. WARNING in /export/users/cc/cc-common/build/checkouts/hdk/working_jdktools/modules/jpda/test/common/unit/org/apache/harmony/jpda/tests/jdwp/Events/CombinedEventsTest.java
(at line 732)
String failureMessage = "## FAILURE during checking events! !";
^^^^^^^^^^^^^^
The local variable failureMessage is never read
----------
23. WARNING in /export/users/cc/cc-common/build/checkouts/hdk/working_jdktools/modules/jpda/test/common/unit/org/apache/harmony/jpda/tests/jdwp/Events/CombinedEventsTest.java
(at line 894)
String failureMessage = "## FAILURE during checking events !";
^^^^^^^^^^^^^^
The local variable failureMessage is never read
----------
----------
24. WARNING in /export/users/cc/cc-common/build/checkouts/hdk/working_jdktools/modules/jpda/test/common/unit/org/apache/harmony/jpda/tests/jdwp/Events/CombinedEventsTestCase.java
(at line 135)
long methodStartCodeIndex = lineTableReply.getNextValueAsLong();
^^^^^^^^^^^^^^^^^^^^
The local variable methodStartCodeIndex is never read
----------
25. WARNING in /export/users/cc/cc-common/build/checkouts/hdk/working_jdktools/modules/jpda/test/common/unit/org/apache/harmony/jpda/tests/jdwp/Events/CombinedEventsTestCase.java
(at line 187)
long methodStartCodeIndex = reply.getNextValueAsLong();
^^^^^^^^^^^^^^^^^^^^
The local variable methodStartCodeIndex is never read
----------
----------
26. WARNING in /export/users/cc/cc-common/build/checkouts/hdk/working_jdktools/modules/jpda/test/common/unit/org/apache/harmony/jpda/tests/jdwp/Events/ExceptionTest.java
(at line 188)
long frameID = reply.getNextValueAsFrameID();
^^^^^^^
The local variable frameID is never read
----------
----------
27. WARNING in /export/users/cc/cc-common/build/checkouts/hdk/working_jdktools/modules/jpda/test/common/unit/org/apache/harmony/jpda/tests/jdwp/ThreadReference/FramesTest.java
(at line 450)
frames.add(new FrameStruct(frameID, loc));
^^^^^^^^^^^^^^^^^^^^^^^^^^^^^^^^^^^^^^^^^
Type safety: The method add(Object) belongs to the raw type Vector. References to generic
type Vector<E> should be parameterized
----------
----------
28. WARNING in /export/users/cc/cc-common/build/checkouts/hdk/working_jdktools/modules/jpda/test/common/unit/org/apache/harmony/jpda/tests/jdwp/share/JDWPUnitDebuggeeProcessWrapper.java
(at line 233)
argv.add(val);
^^^^^^^^^^^^^
Type safety: The method add(Object) belongs to the raw type Vector. References to generic
type Vector<E> should be parameterized
----------
29. WARNING in /export/users/cc/cc-common/build/checkouts/hdk/working_jdktools/modules/jpda/test/common/unit/org/apache/harmony/jpda/tests/jdwp/share/JDWPUnitDebuggeeProcessWrapper.java
(at line 253)
return (String[])argv.toArray(args);
^^^^^^^^^^^^^^^^^^
Type safety: The method toArray(Object[]) belongs to the raw type Vector. References to generic
type Vector<E> should be parameterized
----------
29 problems (29 warnings)
JPDA exclude list: /export/users/cc/cc-common/build/checkouts/hdk/working_classlib/deploy/build/jdktools.jpda.exclude
Running JPDA tests
Debugger JVM=/export/users/cc/cc-common/build/checkouts/hdk/target/hdk/jdk/jre/bin/java
Debuggee JVM=/export/users/cc/cc-common/build/checkouts/hdk/target/hdk/jdk/jre/bin/java
SAMSA exclude list: /export/users/cc/cc-common/build/checkouts/hdk/working_classlib/deploy/build/jdktools.samsa.exclude
Running SAMSA tests
test.jre.home=/export/users/cc/cc-common/build/checkouts/hdk/target/hdk/jdk/jre
Run jdk/bin/java -version in /export/users/cc/cc-common/build/checkouts/hdk/working_jdktools/build/test_report
java version "1.5.0"
pre-alpha : not complete or compatible
svn = r594248, (Nov 13 2007), Linux/ia32/gcc 4.1.0, debug build
http://harmony.apache.org
Run jdk/bin/javac -version in /export/users/cc/cc-common/build/checkouts/hdk/working_jdktools/build/test_report
Run jdk/bin/javah in /export/users/cc/cc-common/build/checkouts/hdk/working_jdktools/build/test_report
Run jdk/bin/javadoc in /export/users/cc/cc-common/build/checkouts/hdk/working_jdktools/build/test_report
Run jdk/bin/jarsigner in /export/users/cc/cc-common/build/checkouts/hdk/working_jdktools/build/test_report
Run jdk/bin/keytool -help in /export/users/cc/cc-common/build/checkouts/hdk/working_jdktools/build/test_report
Compiling TOOLS tests
Since fork is false, ignoring memoryMaximumSize setting
----------
1. WARNING in /export/users/cc/cc-common/build/checkouts/hdk/working_jdktools/modules/tools/src/test/java/org/apache/harmony/tests/tools/javah/Test/Test01.java
(at line 24)
private static final long xxx2 = 1;
^^^^
The field Test01.xxx2 is never read locally
----------
1 problem (1 warning)
TOOLS exclude list: /export/users/cc/cc-common/build/checkouts/hdk/working_classlib/deploy/build/jdktools.tools.exclude
Running TOOLS tests
test.jre.home=/export/users/cc/cc-common/build/checkouts/hdk/target/hdk/jdk/jre
The test report is in /export/users/cc/cc-common/build/checkouts/hdk/working_jdktools/build/test_report/html/index.html
The execution FAILED with the following exception:
The following error occurred while executing this line:
/export/users/cc/cc-common/adaptors/jdktools-test/adaptor.xml:28: The following error occurred
while executing this line:
/export/users/cc/cc-common/build/checkouts/hdk/working_jdktools/build.xml:242: The following
error occurred while executing this line:
/export/users/cc/cc-common/build/checkouts/hdk/working_jdktools/make/build-test.xml:98: There
were test failures.

***********************************************************
Unit Tests: (161)
        
failure: testSingleStep1 org.apache.harmony.jpda.tests.jdwp.Events.SingleStepTest
Unit Test Error Details:	(1)
                
Test: testSingleStep1Class: org.apache.harmony.jpda.tests.jdwp.Events.SingleStepTestjunit.framework.AssertionFailedError:
Received wrong event request ID, expected:<2> but was:<0>
	at org.apache.harmony.jpda.tests.jdwp.Events.SingleStepTest.stepFunction(SingleStepTest.java:173)
	at org.apache.harmony.jpda.tests.jdwp.Events.SingleStepTest.testSingleStep1(SingleStepTest.java:60)
	at java.lang.reflect.VMReflection.invokeMethod(VMReflection.java)

***********************************************************
Modifications since last successful build:	(1)
            
add cc-hdk log20071113002634Lbuild.397 11/13/2007 00:26:34hdk

begin 644 execution_log.zip
M4$L#! H    ( *D=;3?H2RCZ=1(  !A_   2    97AE8W5T:6]N7VQO9RYH
M=&UL[5UM<]LXDOYL_0KL;%VM7651[R_6*+[RV<[&F3CV6HYGKU*Y%$Q"$AV*
MX *D;6UJ_OMU Z0D4A(EV;!'2:UJQB%!H-'LI[O1:()@=QB.O,/N+7?&A]U 
ML,,N)3(<>^S-W_K<#XO2_3?KD';YOW[]VV$A"AP:LJ*\]SN%0E&R, J*=\ZW
MD'-/%A\D%L95TJ4B@@8G4>"Y-EQT2"#X';-#XM,1(ZY/W%' 16B1R[C\F@?%
M#^R>>5@S8"(<$X?U7=\-7>Y+?0QD^JZ0(;8OL4<D4(HD$[)DV_!?T>:C$?=+
MTA9N$,I23,AETGH<>83Z#J$#BGWG-K^-7,\IV4-F?^,1D!DZWTH/7'QS_<'7
MY!Y+(_J-93HH%$(FPTZ!X.\SLX?\"RF\6?-7N(:VT -)>B"WKD\%DK:L]:D4
M;(]1OXB,R")P'T3 4,'FP;AX)UBQ[WH,P;&'(^ZD2^(J'7T71;@>J2OJ9D;?
M'%=\(<>"*2SAI/-L">I*V-E7P9#2:W0E"P5UHB64QNJ8CP+70PS>7YX<$5W]
M-7@JV1Z5DL6=W=%[:L]R4VU5B.21L!E1:)&0OWCO/=?'[J 9<27I4T^R?>(.
M?"Z0HQ$;<3$^IX_N*!KUP%L0\ NHO2D:Q<DO55RQR.]'5Q_//O[=B!UJ/2W=
M@0]2]U.*6T?@.4I<#$HTH$"C-*0"BL?3BK+4%^"+D&+IA-U&@P%C5VS@RI )
M"WE-<4UV:4@ #D8:[;W4E1T1-V*.11UGUXEI[?U*TO7^;\DO5>MZ'( T:9^%
MXPZY'C*0=3CDX+B \L4M>LH]<LL\[@^4'H100] '$F*S#Z[_C3D?@!F+7+$^
M< 0@JFH#YC/AVMEJW=-#(H<\\AR@20**\H ; 4"==9!<4ES=0H#1NUX$:BC)
MQ;;<R(#K^B 0GWJ74U<//G471[%]<D^]"'!>#^9-$<=N-.+[9!7R[Z@<GM,@
M%_:X3O>W_9N70+VVA:C?.0]!Z9+:WUAXXLJ AM BU[8KE7H&?XA(_/ ?$8N8
M,FYUJBEN@+M!"U]IV\^VZOK/ &2U?C#GI2$43:R7/9 S,.P!$[M8/M:DK0$+
MSYS=O;W]--45OQD*3_ %3_R]B L)Z:W'5CH15>O9;J3Q4ZA9.^LOL%N8:&@]
M.W/V25RPMF;\\, V?P9@:XUL(/ ?8)<4M[85[YO1N2L$SQ_PV[6L!2LJ4HWV
MZG EP,9&]R,AZ'CE$#^I]<QQOOU#XW90KF9PNZ="HP8'N9C]H'@=_,AX52O5
M+%Y]EWF.1DQ&,+<ZQC3$6UT8<B6UW;W/[I<GQU0_*,Z5\H\-="T':'7XLSK4
M97AN3\)+H1CGNL2%?\(P@"E=^"#0AZ3X XU\>Y@DQ/*@/IB+?=&"R>FCS52F
MY2T7"5'"'D,&P=/T(OF>;JNG4JO->(BY1N%2S_TW!C4DIT^' ]@^#XG#H)9@
M!)]RT!!@[[L^]6(Z-P #-/QT=D*4=A+>UVJ!*O4<V+<G#:9@/\7,A2PI+_O)
M]SAUUL%XSICU8QN"IU84NIXUS2;^N@C1]2#-H8KY9Y_= YX@NO4<Z/:DHIXA
M^8-61O*WP VC/LCC(@HO^N<J!T_>Z.3\8MF3?*E[W 8S@'#)5::4)CP1NV!T
M/;%O3^+H&6*OM"H9N0?1K0<^0]$A2$8=[?9"]2@$$\%[,.H(_B!UG8\\?,LC
MWUGAZL@:0YU@821\[8YT_WTNYGC8(WW!1VKDF];,W/%Q)$,^^@!%@*C/&+AB
M=/.  '-@)NO?:R^(8R.<02\C/%24NO]]N*@#36LMQ=B>5,^S%".;44PI!@PI
M?[IB9'G8=L58IB_;DT%*Z0L?W>(2!'U:+E?QF5*NQI3+2UPXW!'$K<<<'7"8
M4 17OHN],N=<1;B]D JHX[ SWV&/Y,T;,GOU%*!.KF4#ZH7>?]U18#%O&X\&
MR[#=GFQ1'K:U5=@V:EEG(-Q[D!>90(R48J@>W?"*V<R]!Y/*'Z]SD5N G8Y8
M%W._C(,4E!I];[P6=MN3,7H6=JWF_#-><OK/R]/CZ].3KZ<WIQ^O>U^/+SY]
MO :TLN5'5U='_VMYS!^$PP4@/LGD%O=MS.2V)W&T'+95F,T]9_E),*MN3[+G
MZ>!4*W.SQ)\$G2U+W3P)G5H]NV#I9T%G2S,L&Z'3FLNPQ/.'/G6]2+!S)B4=
M,$#FE[_^E;P].OOPZ>J4.)&JH^X(#]18+_]"_O++.DF85?ADNMX<F"U-P&PV
MXLRE-Y\.S);@L@RN+4W<S,%U3&7^%+V6?6B/.=SX@4%V.J6:7*-<KW#]#J[]
M^<@>PQM<TG<$DUA_L+MP7O44A[>0@\W-:DOS*)OCU,[F-O-P$C\(/,M0V\YL
MQB0)M3*+T<Z&#PHL]6CP[&0)/F_UU5R(5GJ[N =C0&Q9ZN%ZB#<T>2Y94C);
M.2S5&]FDTLQZ%5S7J,C 4!79X6XLPGT4[=Z?_QS]!JYRD?LL5E=YH77I6Y:_
MD'"!E=Z?_'[Y"5HD&=E+P4$P\G=!@V#%XL-:-@E%Q> ^7@+CO<X2F->"M+IE
M28QG8S>70(Q3^G'J_O.7/05FLA &3N2R-._D]T333?K06$//6X VO@0(@\!(
MDETX>:#"!Z'(O4(A@.$&1%]DC[87.2S]!I=Z;RN^ G*6X9-?TU++"CSWMN3 
MZ,;'<=U$?RQ4!RON2+WJN.A]LJO(]Q>\399<)F2R4N']S?F;#1F%8 6&7'5X
MA_^#-D(45IJHW%PO["5Z^7R'!C.]5; <2UN.%5N.%I6Z>PLMQ[IQ11A1[QPJ
M@2%8\?(+'/92%+% $GR)E%3VR5L]\Y$=4MXGI[@&21]>NR-&F$<#R9P.:5GM
M6HU(9C^;4MVJ-AJ&*)6K=4.4:K6J(4K-JAE*5>N@43'$4[MBZNZJK3Q"M74)
M5:I6HY*K3]5U2;6M6KMM2I_,"+QE->NY+&TDIWQ2];7UJ6DUFF8$5;,.6F9,
MN&:UVTTCE)I@>0>F]*!I2%!-JYQOP\VU!54%4J8,IEP[,&4P=3/HM:U6S=B@
MT,[U49M0,N: *Y7<NTL9<27/'S2M^B+P3GO7ZP0(.D%A]2">\& BRP+D0258
M3T],>(6*&<D#I9H9R0,E4Q%"\\!4_%.I&KNYLJF[*^<KZ":46J9B#4.C<=VJ
MEXT%"(8\)T#7-J-.2,G0L&!N_*PWC<6;ID:JFAE+,1?Z&+/<AC%[:QN34?XT
M82-?:2ID;1^8,MWV@3'_;6[F4C,6]!A3@K8Q7VEHP$0Q&?.ZACP3QCIF#!AC
M'3/1.,C)6+!3KILS.V.SU[(QB1L+Y4S-@Y&2&9X:5K5A)MM3!3]NRM&U*V;D
MU+!J33,NLV4UC;GQ2M54&%XQEJXM5XR%*G53H4K%F']:H>.-M>VN8K7*Q@87
M8UI@:$8.<FJ:\2IM4Y%X!4-?<Y2VDBE3DY]V/J6UYX@M"%;,N#J@U#0C\@:X
M7U.4JG5C3USR?<$F$L]7J$THY0<KZS^4:%CEEKFIHK$XVMBLS%0D9LR-&_(I
M*&TS(W#%:AIR3C6(PTSI4KMM3$Z&YAI-JUPVIM_&HJ=ZRU2\6FN:T\QE5K?@
M\<33UT2\X][,:EH#T4S;T RP"=,(0]/2EE5;*LR-*;5,4:HWC5$R$V97K;8A
M!XW8&5IA@7(R-2UM&'+1<'MU0^,&DLI?][&!:UWX)/1IT5K+$$\XYFO?6@AY
M9 ^+\7LE4FT&WTE*F2(P*6.33>$[*U;A]8[.>Z^S#$_2D9RNPT,.;.[;% 3S
MD0,#KMY17V^:CKO_^YSX#-^A)R%[#/>)P]5.#3P<XM[EJ];QZ?M2%5+7L<2Z
M$^#>^8@]?X5=MF_\(L!DU1TI)ALR&%@%NW@'?NCZD=E?R)$:L\@[/681O2\4
M$Z1#=NT]<LR#L7 'PY!4#@Y ]ZKE<E,M*HV;]7@_?,!-E]26%U1M=\$%<4%=
M/==FO@3=VB<4< G4)R)P&\M4]^INDYO]I6)!//\+2=4 )2Q2+QA28 FW>8);
M#SP6,NP'CZ%3H)IJ(N]]?&.A 6%*O;U/=C_R>P*F#LRW]O9Q8_3HL>326K4T
ML&W,3%A@/6H_=Z)DE:(U#,.@4TI6""=#/(SVN0#:KXC@J>VY8//D/8I2?T\ 
M\"M;K18 !C$MWMT4Q[/_.8<S$: TR@K0ED6./(^HR^!E&#!YSQPK]_Z&+W];
M[S^>%=7G2LB0J6U+M(&K9<@4UR>G:J=./N&+<YU%(5F\KA?OP#K';X1\YGJ[
M^"^DJ_<8PPU=Y.%RVI,&J5)"BK><AXH$:.20=/'OH3*5@0M!'E&E#RX(&I=*
MP_TRWT$/Q3-T%O]P?;;#^C3RPG@O-*27(P)@:(X9_"UA"%>ROS0_G'01PL,4
M(=0\)*8_8C+A1S#'%<Q&'^[Z&_ D V:[?5=]02;K:K+\.*2K.^%B/&$JX2>E
M<PE7=OQE$-";5&=KL3?IBSP,77LX3[0/;E._!H5O%U QSF??]<$0LIV<J<+X
M4Q\SZJ9>6(!.:!3R$7A,M1M(/GWP7[<<W$H6+MSH2,1C)5H[3&#R>4T9UBPM
M%32HC?APCY,(."+_@OF1QF^FT5KBE1BJ*$'>CG$+0+#[#/Y73(*Z0@B5Z]D<
M;K^";X..3K CO7.ABR,:"A*X'[,PAS\84@:(\"MP*'JZJR'S FN!>]V9<O,]
M]HE_D/='5RJ4)  C30,W4Q]UR^V/%[1;KD5QFQWXD;@YH(ST'&Q-YEH7O[&Q
M!'MCI)L<?55^<$>]@JA#%:U[R?5T>U6DWG:9$L!3(*!*5S<.4(5G>Y<28'" 
MP(2WI&R.]4G;F68[)-E_",HG3<DNN ['[?=!#_1.70NZW,NPIP0'B&B?_!7M
M#.FKSW;%-Y8K7+BH<%[<W.J]59&X=0*AM/*A<U@JW[*C;HG?NS"#H(ZC/@)&
MO7@PR';H@8&D6\#MLH=DZ("S@$LY%PP6;28@KE&*X[@R\.B88!&X&=SZ2I)=
ML"!PE3 :)GJ)K"<\9@072DJZU[VCKY^N/APBR90NP0P,D*>C !WMD LW',\U
MQ[XU"3SZJ@QE5B-408(!5)ME-DT,Y/ X)MTA!Q,&Z4'D)@^_=[IHRX=_*#'!
M917-@15#)1)74O>'M?8)LP:6KFCIBA:XD$ZE6JLOZ$K; OZ= #YK"*G^=M]=
M7U]BB-Z[./ZMMS='#0$4VL?K\0&I37T^TK3%. CY0-  QDM%%V84"?AB,475
MMIMPEY0JDAD+DXN9V(@'M1W?B/IT@(/A8D<P[2C-V]0#+&<2C,P4E^C^M9*C
M6=,0$P%+.TMS.FF0QRHJJ7E>9^UT>7^S[,XVR>-WY)CG=A3OV.&X@]GL0;;#
MM'33C1:S/!<(@/+@($Z*.#B_?#"0.ODM[CM244#J4L+6]V(W_FR&=A1_S);H
M,1_+NOKPJ_J^UN$?EF61XOLN!F%)I1PN?/[@)Q_GD&DV=I1V"/:OG9V_Z]DB
M2ZD%7(F2C/M,&Y20+;R=G6,\2H\1@MTG?AXWEXYDMK':0C.$MOI@:MXA!W?+
MPZ'6%HB],RT=ALD,&$FNV(C?,P*#'$P1U#"^T*'L%#74T.)4':1N#7M3 RZZ
M7ADZ/,KV!_-GH NM>PQF'HI1K*L#"E<D\VNXTTQ#5#5H=CV$H%6I7:*Y7,>(
M!&1#$T0R;?7&S]#Z3.\ 35-,[]I#F(KO(2%*CGM7>J^)# E@T/:X#Y*:?&T4
M:B/;2F+SM57HXR":U!^D(Z9,90BJ_-!6\%WB(4I1RR[#J$)E+A;:*4KF]77[
MB;Y!; J%<9R5(J)<Q21K"6QEB2618YKYG'!Q9QH;WR21\6R/2KS+3>D=@I=C
MS=K)?,^8=#H%!6%$9R?30FM:NM],@GF-CW1>7UQ\Z,U^I3-^>7Q:H_&?SV:N
MV@!!GTEAZUT0L*]%VQ_H.]:558Y,?5!1_2E7\K_#MF2?U-1._&I'F<?'QRIY
M0RJK=CF8_!9N(J-W1(T94R2?OM]IL@D!V:TD6Q"LVH% *^5K//O0?U_KV4?6
MV%[RV<<:#]"G(L"O!<CX63H$(#UTAGH'ZAX%T/,>H*^]*JEJ50R]N7!@E?,7
M.Z[-4]DJQ\_/G_P03P<V1?!6138*PC$6Q0G!24'V')-Q11T(=@J:?WT&=R&H
M+_4&X<!IA]3;!XU16EO00)$'HMN@:;Y$B%K"[YN77-S&R\+#0D'"E#N<\%V 
M 6AZHJ6@1"-T(K!00$9Q8(I48*<7=^CQ664D.28[U?9^R2Y:'=5DY@+*G7#;
MCH0 DWL8NMZ$(EP.,59"!]DIY-P]=2C,,82<&+WB,BG&3XYWJFV]E8OAGM>7
MN^:B7OWSV%!?8I_&"XJA RT6B(L>\(_2N<1 K$*W1 ^[)?7A^](M=\;P#ZK)
MX?\#4$L! A0#"@    @ J1UM-^A+*/IU$@  &'\  !(              *2!
L     &5X96-U=&EO;E]L;V<N:'1M;%!+!08      0 ! $    "E$@     ! 
end

Mime
View raw message