harmony-alerts mailing list archives

Site index · List index
Message view « Date » · « Thread »
Top « Date » · « Thread »
From nom...@intel.com
Subject [build-test alert] FAILED Linux x86_64: jdktools-test debug
Date Mon, 12 Nov 2007 20:44:30 GMT

BUILD FAILED:
	Ant Error Message:
/export/users/cc/cc-common/scripts/cc-exec-adaptor.xml:104: The following error occurred while
executing this line: /export/users/cc/cc-common/adaptors/jdktools-test/adaptor.xml:28: The
following error occurred while executing this line: /export/users/cc/cc-common/build/checkouts/hdk/working_jdktools/build.xml:242:
The following error occurred while executing this line: /export/users/cc/cc-common/build/checkouts/hdk/working_jdktools/make/build-test.xml:97:
There were test errors.

Date of build:	2007-11-13 02:14:38 +0600
Time to build:	29 minutes 45 seconds
Last changed:	11/12/2007 23:40:57
Last log entry:	hdk

***********************************************************
Errors/Warnings:	(226)
            
Result: 1
========================================
Testing jdktools binaries...
========================================
Compiling JPDA tests
Since fork is false, ignoring memoryMaximumSize setting
----------
1. WARNING in /export/users/cc/cc-common/build/checkouts/hdk/working_jdktools/modules/jpda/test/common/unit/org/apache/harmony/jpda/tests/framework/DebuggeeRegister.java
(at line 58)
registered.add(debuggee);
^^^^^^^^^^^^^^^^^^^^^^^^
Type safety: The method add(Object) belongs to the raw type LinkedList. References to generic
type LinkedList<E> should be parameterized
----------
----------
2. WARNING in /export/users/cc/cc-common/build/checkouts/hdk/working_jdktools/modules/jpda/test/common/unit/org/apache/harmony/jpda/tests/framework/TestOptions.java
(at line 505)
internalProperties.put(name, value);
^^^^^^^^^^^^^^^^^^^^^^^^^^^^^^^^^^^
Type safety: The method put(Object, Object) belongs to the raw type HashMap. References to
generic type HashMap<K,V> should be parameterized
----------
----------
3. WARNING in /export/users/cc/cc-common/build/checkouts/hdk/working_jdktools/modules/jpda/test/common/unit/org/apache/harmony/jpda/tests/framework/jdwp/PacketDispatcher.java
(at line 114)
eventQueue.add(eventPacket);
^^^^^^^^^^^^^^^^^^^^^^^^^^^
Type safety: The method add(Object) belongs to the raw type List. References to generic type
List<E> should be parameterized
----------
4. WARNING in /export/users/cc/cc-common/build/checkouts/hdk/working_jdktools/modules/jpda/test/common/unit/org/apache/harmony/jpda/tests/framework/jdwp/PacketDispatcher.java
(at line 249)
replies.put(new Integer(replyPacket.getId()),
replyPacket);
^^^^^^^^^^^^^^^^^^^^^^^^^^^^^^^^^^^^^^^^^^^^^^^^^^^^^^^^^^^^^^^^^^^^^^^^^^^^^^^^^^^^^^^^^^
Type safety: The method put(Object, Object) belongs to the raw type Hashtable. References
to generic type Hashtable<K,V> should be parameterized
----------
5. WARNING in /export/users/cc/cc-common/build/checkouts/hdk/working_jdktools/modules/jpda/test/common/unit/org/apache/harmony/jpda/tests/framework/jdwp/PacketDispatcher.java
(at line 284)
commands.put(Id, command);
^^^^^^^^^^^^^^^^^^^^^^^^^
Type safety: The method put(Object, Object) belongs to the raw type Hashtable. References
to generic type Hashtable<K,V> should be parameterized
----------
6. WARNING in /export/users/cc/cc-common/build/checkouts/hdk/working_jdktools/modules/jpda/test/common/unit/org/apache/harmony/jpda/tests/framework/jdwp/PacketDispatcher.java
(at line 355)
commands.put(Id, command);
^^^^^^^^^^^^^^^^^^^^^^^^^
Type safety: The method put(Object, Object) belongs to the raw type Hashtable. References
to generic type Hashtable<K,V> should be parameterized
----------
----------
7. WARNING in /export/users/cc/cc-common/build/checkouts/hdk/working_jdktools/modules/jpda/test/common/unit/org/apache/harmony/jpda/tests/framework/jdwp/VmMirror.java
(at line 1834)
frames.add(frame);
^^^^^^^^^^^^^^^^^
Type safety: The method add(Object) belongs to the raw type ArrayList. References to generic
type ArrayList<E> should be parameterized
----------
8. WARNING in /export/users/cc/cc-common/build/checkouts/hdk/working_jdktools/modules/jpda/test/common/unit/org/apache/harmony/jpda/tests/framework/jdwp/VmMirror.java
(at line 1902)
vars.add(var);
^^^^^^^^^^^^^
Type safety: The method add(Object) belongs to the raw type ArrayList. References to generic
type ArrayList<E> should be parameterized
----------
9. WARNING in /export/users/cc/cc-common/build/checkouts/hdk/working_jdktools/modules/jpda/test/common/unit/org/apache/harmony/jpda/tests/framework/jdwp/VmMirror.java
(at line 2122)
fields.add(superClassFields.toArray()[i]);
^^^^^^^^^^^^^^^^^^^^^^^^^^^^^^^^^^^^^^^^^
Type safety: The method add(Object) belongs to the raw type ArrayList. References to generic
type ArrayList<E> should be parameterized
----------
10. WARNING in /export/users/cc/cc-common/build/checkouts/hdk/working_jdktools/modules/jpda/test/common/unit/org/apache/harmony/jpda/tests/framework/jdwp/VmMirror.java
(at line 2132)
fields.add(field);
^^^^^^^^^^^^^^^^^
Type safety: The method add(Object) belongs to the raw type ArrayList. References to generic
type ArrayList<E> should be parameterized
----------
----------
11. WARNING in /export/users/cc/cc-common/build/checkouts/hdk/working_jdktools/modules/jpda/test/common/unit/org/apache/harmony/jpda/tests/jdwp/DebuggerOnDemand/OnthowDebuggerLaunchDebuggee.java
(at line 94)
class ExceptionForDebugger extends Exception {
^^^^^^^^^^^^^^^^^^^^
The serializable class ExceptionForDebugger does not declare a static final serialVersionUID
field of type long
----------
----------
12. WARNING in /export/users/cc/cc-common/build/checkouts/hdk/working_jdktools/modules/jpda/test/common/unit/org/apache/harmony/jpda/tests/jdwp/Events/ClassUnloadDebuggee.java
(at line 32)
import java.util.LinkedList;
^^^^^^^^^^^^^^^^^^^^
The import java.util.LinkedList is never used
----------
13. WARNING in /export/users/cc/cc-common/build/checkouts/hdk/working_jdktools/modules/jpda/test/common/unit/org/apache/harmony/jpda/tests/jdwp/Events/ClassUnloadDebuggee.java
(at line 97)
boolean isOutOfMemory = false;
^^^^^^^^^^^^^
The local variable isOutOfMemory is never read
----------
14. WARNING in /export/users/cc/cc-common/build/checkouts/hdk/working_jdktools/modules/jpda/test/common/unit/org/apache/harmony/jpda/tests/jdwp/Events/ClassUnloadDebuggee.java
(at line 171)
public Class loadClass(String name) throws ClassNotFoundException {
^^^^^
Type safety: The return type Class for loadClass(String) from the type ClassUnloadDebuggee.CustomLoader
needs unchecked conversion to conform to Class<?> from the type ClassLoader
----------
15. WARNING in /export/users/cc/cc-common/build/checkouts/hdk/working_jdktools/modules/jpda/test/common/unit/org/apache/harmony/jpda/tests/jdwp/Events/ClassUnloadDebuggee.java
(at line 179)
public Class findClass(String name) throws ClassNotFoundException {
^^^^^
Type safety: The return type Class for findClass(String) from the type ClassUnloadDebuggee.CustomLoader
needs unchecked conversion to conform to Class<?> from the type ClassLoader
----------
----------
16. WARNING in /export/users/cc/cc-common/build/checkouts/hdk/working_jdktools/modules/jpda/test/common/unit/org/apache/harmony/jpda/tests/jdwp/Events/CombinedEvents002Test.java
(at line 100)
boolean expectColocatedEvents = (testedMethodStartCodeIndex == testedMethodEndCodeIndex);
^^^^^^^^^^^^^^^^^^^^^
The local variable expectColocatedEvents is never read
----------
----------
17. WARNING in /export/users/cc/cc-common/build/checkouts/hdk/working_jdktools/modules/jpda/test/common/unit/org/apache/harmony/jpda/tests/jdwp/Events/CombinedEvents003Test.java
(at line 53)
private boolean eventMethodExitReceived = false;
^^^^^^^^^^^^^^^^^^^^^^^
The field CombinedEvents003Test.eventMethodExitReceived is never read locally
----------
18. WARNING in /export/users/cc/cc-common/build/checkouts/hdk/working_jdktools/modules/jpda/test/common/unit/org/apache/harmony/jpda/tests/jdwp/Events/CombinedEvents003Test.java
(at line 76)
int EXPECTED_EVENTS_COUNT = EXPECTED_EVENTS_ARRAY.length;
^^^^^^^^^^^^^^^^^^^^^
The local variable EXPECTED_EVENTS_COUNT is never read
----------
----------
19. WARNING in /export/users/cc/cc-common/build/checkouts/hdk/working_jdktools/modules/jpda/test/common/unit/org/apache/harmony/jpda/tests/jdwp/Events/CombinedEventsTest.java
(at line 84)
int EXPECTED_EVENTS_COUNT = EXPECTED_EVENTS_ARRAY.length;
^^^^^^^^^^^^^^^^^^^^^
The local variable EXPECTED_EVENTS_COUNT is never read
----------
20. WARNING in /export/users/cc/cc-common/build/checkouts/hdk/working_jdktools/modules/jpda/test/common/unit/org/apache/harmony/jpda/tests/jdwp/Events/CombinedEventsTest.java
(at line 212)
int EXPECTED_EVENTS_COUNT = EXPECTED_EVENTS_ARRAY.length;
^^^^^^^^^^^^^^^^^^^^^
The local variable EXPECTED_EVENTS_COUNT is never read
----------
21. WARNING in /export/users/cc/cc-common/build/checkouts/hdk/working_jdktools/modules/jpda/test/common/unit/org/apache/harmony/jpda/tests/jdwp/Events/CombinedEventsTest.java
(at line 348)
int EXPECTED_EVENTS_COUNT = EXPECTED_EVENTS_ARRAY.length;
^^^^^^^^^^^^^^^^^^^^^
The local variable EXPECTED_EVENTS_COUNT is never read
----------
22. WARNING in /export/users/cc/cc-common/build/checkouts/hdk/working_jdktools/modules/jpda/test/common/unit/org/apache/harmony/jpda/tests/jdwp/Events/CombinedEventsTest.java
(at line 732)
String failureMessage = "## FAILURE during checking events! !";
^^^^^^^^^^^^^^
The local variable failureMessage is never read
----------
23. WARNING in /export/users/cc/cc-common/build/checkouts/hdk/working_jdktools/modules/jpda/test/common/unit/org/apache/harmony/jpda/tests/jdwp/Events/CombinedEventsTest.java
(at line 894)
String failureMessage = "## FAILURE during checking events !";
^^^^^^^^^^^^^^
The local variable failureMessage is never read
----------
----------
24. WARNING in /export/users/cc/cc-common/build/checkouts/hdk/working_jdktools/modules/jpda/test/common/unit/org/apache/harmony/jpda/tests/jdwp/Events/CombinedEventsTestCase.java
(at line 135)
long methodStartCodeIndex = lineTableReply.getNextValueAsLong();
^^^^^^^^^^^^^^^^^^^^
The local variable methodStartCodeIndex is never read
----------
25. WARNING in /export/users/cc/cc-common/build/checkouts/hdk/working_jdktools/modules/jpda/test/common/unit/org/apache/harmony/jpda/tests/jdwp/Events/CombinedEventsTestCase.java
(at line 187)
long methodStartCodeIndex = reply.getNextValueAsLong();
^^^^^^^^^^^^^^^^^^^^
The local variable methodStartCodeIndex is never read
----------
----------
26. WARNING in /export/users/cc/cc-common/build/checkouts/hdk/working_jdktools/modules/jpda/test/common/unit/org/apache/harmony/jpda/tests/jdwp/Events/ExceptionTest.java
(at line 188)
long frameID = reply.getNextValueAsFrameID();
^^^^^^^
The local variable frameID is never read
----------
----------
27. WARNING in /export/users/cc/cc-common/build/checkouts/hdk/working_jdktools/modules/jpda/test/common/unit/org/apache/harmony/jpda/tests/jdwp/ThreadReference/FramesTest.java
(at line 450)
frames.add(new FrameStruct(frameID, loc));
^^^^^^^^^^^^^^^^^^^^^^^^^^^^^^^^^^^^^^^^^
Type safety: The method add(Object) belongs to the raw type Vector. References to generic
type Vector<E> should be parameterized
----------
----------
28. WARNING in /export/users/cc/cc-common/build/checkouts/hdk/working_jdktools/modules/jpda/test/common/unit/org/apache/harmony/jpda/tests/jdwp/share/JDWPUnitDebuggeeProcessWrapper.java
(at line 233)
argv.add(val);
^^^^^^^^^^^^^
Type safety: The method add(Object) belongs to the raw type Vector. References to generic
type Vector<E> should be parameterized
----------
29. WARNING in /export/users/cc/cc-common/build/checkouts/hdk/working_jdktools/modules/jpda/test/common/unit/org/apache/harmony/jpda/tests/jdwp/share/JDWPUnitDebuggeeProcessWrapper.java
(at line 253)
return (String[])argv.toArray(args);
^^^^^^^^^^^^^^^^^^
Type safety: The method toArray(Object[]) belongs to the raw type Vector. References to generic
type Vector<E> should be parameterized
----------
29 problems (29 warnings)
JPDA exclude list: /export/users/cc/cc-common/build/checkouts/hdk/working_classlib/deploy/build/jdktools.jpda.exclude
Running JPDA tests
Debugger JVM=/export/users/cc/cc-common/build/checkouts/hdk/target/hdk/jdk/jre/bin/java
Debuggee JVM=/export/users/cc/cc-common/build/checkouts/hdk/target/hdk/jdk/jre/bin/java
SAMSA exclude list: /export/users/cc/cc-common/build/checkouts/hdk/working_classlib/deploy/build/jdktools.samsa.exclude
Running SAMSA tests
test.jre.home=/export/users/cc/cc-common/build/checkouts/hdk/target/hdk/jdk/jre
Run jdk/bin/java -version in /export/users/cc/cc-common/build/checkouts/hdk/working_jdktools/build/test_report
java version "1.5.0"
pre-alpha : not complete or compatible
svn = r594225, (Nov 12 2007), Linux/em64t/gcc 4.1.0, debug build
http://harmony.apache.org
Run jdk/bin/javac -version in /export/users/cc/cc-common/build/checkouts/hdk/working_jdktools/build/test_report
Run jdk/bin/javah in /export/users/cc/cc-common/build/checkouts/hdk/working_jdktools/build/test_report
Run jdk/bin/javadoc in /export/users/cc/cc-common/build/checkouts/hdk/working_jdktools/build/test_report
Run jdk/bin/jarsigner in /export/users/cc/cc-common/build/checkouts/hdk/working_jdktools/build/test_report
Run jdk/bin/keytool -help in /export/users/cc/cc-common/build/checkouts/hdk/working_jdktools/build/test_report
Compiling TOOLS tests
Since fork is false, ignoring memoryMaximumSize setting
----------
1. WARNING in /export/users/cc/cc-common/build/checkouts/hdk/working_jdktools/modules/tools/src/test/java/org/apache/harmony/tests/tools/javah/Test/Test01.java
(at line 24)
private static final long xxx2 = 1;
^^^^
The field Test01.xxx2 is never read locally
----------
1 problem (1 warning)
TOOLS exclude list: /export/users/cc/cc-common/build/checkouts/hdk/working_classlib/deploy/build/jdktools.tools.exclude
Running TOOLS tests
test.jre.home=/export/users/cc/cc-common/build/checkouts/hdk/target/hdk/jdk/jre
The test report is in /export/users/cc/cc-common/build/checkouts/hdk/working_jdktools/build/test_report/html/index.html
The execution FAILED with the following exception:
The following error occurred while executing this line:
/export/users/cc/cc-common/adaptors/jdktools-test/adaptor.xml:28: The following error occurred
while executing this line:
/export/users/cc/cc-common/build/checkouts/hdk/working_jdktools/build.xml:242: The following
error occurred while executing this line:
/export/users/cc/cc-common/build/checkouts/hdk/working_jdktools/make/build-test.xml:97: There
were test errors.

***********************************************************
Unit Tests: (161)
        
error: testCombinedEvents_04 org.apache.harmony.jpda.tests.jdwp.Events.CombinedEventsTest
Unit Test Error Details:	(1)
                
Test: testCombinedEvents_04Class: org.apache.harmony.jpda.tests.jdwp.Events.CombinedEventsTestorg.apache.harmony.jpda.tests.framework.TestErrorException:
org.apache.harmony.jpda.tests.framework.jdwp.exceptions.TimeoutException: Connection was closed
	at org.apache.harmony.jpda.tests.framework.jdwp.VmMirror.receiveEvent(VmMirror.java:1698)
	at org.apache.harmony.jpda.tests.jdwp.Events.CombinedEventsTest.receiveAndCheckEvents(CombinedEventsTest.java:920)
	at org.apache.harmony.jpda.tests.jdwp.Events.CombinedEventsTest.testCombinedEvents_04(CombinedEventsTest.java:547)
	at java.lang.reflect.VMReflection.invokeMethod(VMReflection.java)
Caused by: org.apache.harmony.jpda.tests.framework.jdwp.exceptions.TimeoutException: Connection
was closed
	at org.apache.harmony.jpda.tests.framework.jdwp.PacketDispatcher.run(PacketDispatcher.java:600)

***********************************************************
Modifications since last successful build:	(1)
            
add cc-hdk log20071112234057Lbuild.355 11/12/2007 23:40:57hdk

begin 644 execution_log.zip
M4$L#! H    ( (P5;3>F((F4@Q(  "-_   2    97AE8W5T:6]N7VQO9RYH
M=&UL[5UM<]LXDOYL_0KL;%VM7&51HMZE47SELYV-,_'+6HYGKU*Y%$Q"$FV*
MX(*D;6UJ_OMU Z0D4A(EV[!'2:UJQB%!H-'LI[O1:()@;Q2.W?W>#;<G^SU?
ML/T>)4$X<=F[OPVX%Y8"Y]^L2]J5__KU;_N%R+=IR$K!O=<M%$H!"R._=&O?
MA9R[0>DAP,*X2KI41-#@*/)=QX*+-O$%OV562#PZ9L3QB#/VN0@-<A&77W&_
M](G=,Q=K^DR$$V*S@>,YH<.]0!T#F8$C@A#;E]DC$BA' 1-!V;+@OY+%QV/N
ME0-+.'X8E&-"#@N,Q[%+J&<3.J38=V[SF\AQ[;(U8M8=CX#,R+XK/W!QYWC#
M;\D]EL?TCF4Z*!1"%H3= L'?%V:-^%=2>+?AKW %;:$'DO1 ;AR/"B1M&)M3
M*5@NHUX)&0E*P+T? 4,%B_N3TJU@I8'C,@3'&HVYG2Z)JW35793@>B2OR)L9
MW]F.^$H.!9-8PDGWQ1)4E;"S;X(AI;?H*B@4Y(F24!JK0S[V'1<Q^'AQ=$!4
M];?@J6RY- A8W-DMO:?6/#?5EDD"'@F+$8D6"?FK]]YW/.P.FA$G( /J!FR/
M.$./"^1HS,9<3$[IHS..QGWP%@3\ FIOBD9I^DL5FP;Y_>#R[.3L[UKL4.EI
M^19\D+R?<MPZ L]1YF)8ICX%&N41%5 \F54,R@,!O@@IEH_8330<,G;)ADX0
M,F$@KRFN29&&!.!@I-'>35W9$7$C9AO4MHMV3&OW5Y*N]W\K?JE:5Q,?I$D'
M+)QTR=6(@:S#$0?'!93/;]!3[I(;YG)O*/4@A!J"/I 0FWURO#MF?P)F#'+)
M!L 1@"BK#9G'A&-EJ_6.]TDPXI%K TWB4Y0'W @ :F^"Y(KBZA8"C-[UW)=#
M22ZVE48&7,<#@7C4O9BY>O"I11S%]L@]=2/ >3.8GXHX=J,0WR/KD/] @]$I
M]7-AC^OT?MN[?@W4:UN(^JW]X)<OJ'7'PB,G\&D(+7)MVS3K&?PA(O'"?T0L
M8M*XY:FB^ 3<-5KX6MM^L577?P8@J_7.@I>&4#2Q7O9 3L"PATP4L7RB2!M#
M%I[8Q=W=O335-;\Y"L_P!<_\O8H+">F-R]8Z$5GKQ6ZD\5.H63OK+[!;F&@H
M/3NQ]TA<L+%F_/# -G\&8&N-;"#P'V!7%+>V%>_K\:DC!,\?\-NUK 5+*H$<
M[>7A6H"UC>X'0M#)VB%^6NN%XWS[A\:M4ZEF<+NG0J$&![F8_:!X=7YDO*IF
M-8O7P&&NK1 +(IA;'6(:XKTJ#+F46G'WB_/UV3'5#XJS6?FQ@:[E "T/?U:'
MN@K/[4EX213C7)<X]XX8!C#E<P\$^I 4?Z*19XV2A%@>U)V%V!<MF!P_6DQF
M6MYSD1 E[#%D$#S-+I+OZ;9J*K7>C$>8:Q0.=9U_8U!#<OJT.8#M\9#8#&H)
M1O I!PT!]H'C43>F<PTP0,//)T=$:B?A Z46J%(O@7U[TF 2]F/,7 1EZ64_
M>RZG]B88+QBS>FQ#\-2(0L<U9MG$7Y<ANAFD.50Q_^RQ>\ 31+>9 ]V>5-0+
M)-]I921_ ]PPZH$\SJ/P?' J<_#DG4K.+Y<]R9>ZRRTP PB7'&E*:<)3L0M&
M-Q/[]B2.7B!VLV5FY.Y'-R[X#$F'(!EY5.R'\E$()H)W8=01_"%0=<YX^)Y'
MGKW&U9$-ACK!PDAXRAVI_@=<+/"P2P:"C^7(-ZN9N>/#* CY^!,4 :(>8^"*
MT<T# LR&F:QWK[P@CHUP!KV,\5!2ZOWW_K(.%*V-%&-[4CTO4HQL1C&E&#"D
M_.F*D>5AVQ5CE;YL3P8II2]\?(-+$-1II5+%9TJY&E.IK'#A<$<0MQYR=,!A
M0A%<>1%[9?:IC'#[(150QV8GGLT>R;MW9/[J,4"=7,L&U$N]_Z:CP'+>GCP:
MK,)V>[)%>=C6UF';J&6=@7#N05YD"C%2BJ%Z=,)+9C'G'DPJ?[S.16X)=BIB
M7<[]*@Y24"KTW<E&V&U/QNA%V+6:B\]XR?$_+XX/KXZ/OAU?'Y]=];\=GG\^
MNP*TLN4'EY<'_VNXS!N&HR4@/LODEO>MS>2V)W&T&K9UF"T\9_E),*MN3[+G
M^>!4S859XD^"SI:E;IZ%3JV>7;#TLZ"SI1F6)Z'36LBPQ/.' 77<2+!3%@1T
MR "97_[Z5_+^X.33Y\MC8D>RCKPC/)!C?? 7\I=?-DG"K,,GT_73@=G2!,S3
M1IR%].;S@=D27%;!M:6)FP6X#FF0/T6O91_:8PXW?F"0G4[))E<HUTM<OX-K
M?\[88WB-2_H.8!+K#8M+YU7/<7A+.7BZ66UI'N7I.+6SN<T\G,0/ L\JU+8S
MFS%-0JW-8K2SX8,$2SX:/#E:@<][=347HK7>+NY!&Q!;EGJX&N$-39]+EJ7,
MU@Y+]48VJ32W7@77-4HR,%1%5EB,1;B'HMW]\Y^C7\-5+G*?Q:HJK[0N?<OR
M%P%<8.6/1[]??(8624;V0G 03/"[H+Z_9O%A+9N$HF)X'R^!<=]F"<Q;05K=
MLB3&B[%;2"#&*?TX=?_EZZX$,UD( R?!JC3O]/=,TTWZ4%A#SUN -KX$"(/ 
M."!%.'F@P@.A!+N%@@_##8B^Q!XM-[)9^@TN^=Y6? 7D'(3/?DU++BMPG9NR
M#:,;G\1U$_TQ4!V,N"/YJN.R]\DN(\];\C99<IF0Z4J%C]>G[Y[(* 0K,.3*
MPUO\'[01HK#R5.46>F&OT<N76S28V:V"Y1C*<HS8<I2HY-T;:#G&M2/"B+JG
M4 D,P8B77^"PEZ*(!0'!ETB)N4?>JYE/T"65/7*,:Y#4X94S9H2YU ^8W24M
MH]-JD(!9+Z94-UIM380:[9HF2AVSJH52PZB:NJ14U2.FAE%O-'6)J9)[=[5-
M*9DUH]UIY9&J;DJJ8]1,72)OY+*T,:&V4>]H$U.N7M8WI52K&/6F-C'E0_<$
M2O6F'LULMH"INB9S,=MZ'%W#:%9RT6NNH&0NH-<PEIGP<?]JDU%!S4J-Q5R"
MS*P='[W8!-O@%_0(OVXT-8TR':.IC:6&+DKUMJZ1K][)-9R-_8+9A@$KUUD]
MQ2]4]5'29<QU;2%"/=^I/T6A.MK4H*$G; &>-'EBO#M=$M?&4D?7R-?4-O(U
M6]HHY6O3$P*I9EV;P!NZ-'Q-F/B48;VF3<.KNB@UFKKLMV5JL[J*-B]>T:;C
M;6T2K^OBJ5'7-1]N5G5I04.?G-K:1KN&+CDU6MITO*8M!:&/DK8PLV'JXJG5
MT*4%K8HV.6D+H;7)NZ;-IVB*>_7I0-,P\^6T<3*CVC#:FN9D&-;K48.F4:WI
M<2IMH]W29BQ-;:E6?8.YMJQMT]0U2+6T#<'M_$E+8^,\6P,B>VT!AK;)75L7
M3VU-TY:.T=(T"38Q'ZG'A$T,?O7HIJE/S9&4)A_56).8WGBNV((IM2ZWV=$D
M\B8,"GH,IFE4-,T5USY[><+LO%7+S6)L3,FL&)5J+GB;/Y]H&C5]^35-0[H^
M(\8H2MN3#FW1IKZY2UT/2Q5P!KI8JFD;T>LU;:%T2P^EIM&N:E,G38\J&T:E
MJ2M"[&CB"1\+KM*")4^LGK\^X@-WYYZ&:8EI- U '</4E'_I&!5-/JQMF)H<
M!O"D*:O;-BK:<D)U73/FCE'5E(8#D6M['&JV-(59@)ZFQYA(2E.""<)(38$(
MA&QZ;FZ6:RZ$/+)&I?@5DT#N"]]-2IDD,"UCT_WANVL6Y/4/3OMOLR(OH.-@
MMB0/.;"X9U$0S!D'!ARUN;[:/QT_!.!QXC%\G9Z$[#'<(S:7FS;P<(3;F*];
MTJ?N2U9(7<<2XU: =^=C]O+%=MF^\>, TP5XI)3LS:!A0>SRS?BAZT=F?24'
M<L@B']201=0644R0+BE:N^20^Q/A#$<A,3L=T+UJ!6);7%\:-^OS0?B ^R_)
MW2^HW/F""^* NKJ.Q;P =&N/4,#%EU^+P!TM4]W+NTUN]A?3@(#@%Y*J 4I8
MHJX_HL 2[O@$M^Z[+&38#QY#IT UU22X]_#EA4:G7JTV]DCQC-\3LXK,MW;W
M<(_TZ+',QLUZ6!Y:%KA>TP#SD7N[$RFL%+%1&/K=<K):.!GB8;3/1=!Z0PB/
M+=<!HR<?49;JVP( 8,5HM0"QFE'#NYL!>?(_IW F?!1'12+:,LB!ZQ)Y&=P,
M R;OF6WDWM_H]6_KX]E)27ZZA(R8W,)$6;A<DDQQK7*J=NKD,[Y$UUT6DL5K
M?/$.C%/\7L@7KK:._TIZ:K\QW-PEV%]->]H@54I(Z8;S4)( E1R1'O[=E[8R
M="#(([+TP0%!X[)IN%_FV>BB>(;.\A^NU;;9@$9N&.^+AO1R1  ,+3"#OQ4,
MX:KVU^:'DQY"N)\BA)J'Q-0'3:;\"&8[@EGHQ!WO"3P%/K.<@2._)I/U-5E^
M;-)3G7 QF3*5\)/2N80K*_Y*".A-JK.-V)OV11Y&CC5:)#H OZE>B<(W#:B8
MY+/O>& (V4Y.9&'\V8\Y=9,O+T G- KY&%RFW!DDGS[XKQL.;B4+%VYZ).+!
M$JT=)C#YO*8,:YZ6C!KDIGRXWTD$')%_P?Q(X3?7:"/Q!ABK2$'>3' [0+#[
M#/Z7+ !UA1@JU[/9W'H#WP8='6%':A=#!X<T%"1P/V%A#G\PI P1X3?@4/15
M5R/F^L82][HSX^9[[!/_(!\/+F4L20!&F@9NKC[JEC.8+&FW6HOB-COP(W%S
M0!GIV=B:++0NW;%) /;&2"\Y^B;]X(Y\'5'%*DKWDNOI]K)(OODR(X"G0$"6
MKF_LHPK/]QX$ (,-!*:\)64+K$_;SC7;(<E>1% ^;4J*X#IL9S  /5"[=BWI
M<C?#GA0<(*)\\C>T,Z0O/^$5WUBN<.&BQ'EY<Z/_7H;BQA'$TM*'+F I?<N.
MO"5^[\ 4@MJV_" 8=>/!(-NA"P:2;@&WRQZ2H0/.?!X$"]%@R6("XAJI.+83
M^"Z=$"P"-X/;8 6D"!8$KA)&PT0OD?6$QXS@PH"2WE7_X-OGRT_[2#*E2S %
M ^3IV$='.^+""2<+S;%O10*/ODE#F=<(69!@ -7FF4T3 SD\3DAOQ,&$07H0
MN07[W[L]M.7]/Z28X+*,YL"*H1*)*\G[PUI[A!E#0U4T5$4#7$C7K-;J2[I2
MMH!_IX#/&T*JO^*'JZL+C-'[YX>_]7<7J"& 0OEX-3X@M9G/1YJ6F/@A'PKJ
MPW@IZ<*4(@%?+*<HV_82[I)223)C8<%R)I[$@]R:;TP].L3!<+DCF'64YFWF
M 58S"4:FBTMT_TK)T:QIB)F E9VE.9TVR&,5E50_K_-VNKJ_>7;GF^3Q.[;U
M<SN.=^^PG>%\^B#;85JZZ4;+65X(!$!Y<! G)1R<7S\82)W\%O<=R2@@=2EA
MZWNI%W]"0SF*/^9+U)B/93UU^$U^:VO_#\,P2.EC#X.PI%(.%QY_\)(/=01I
M-G:D=@CVKYV=OZO9(DNI!5R)DHS[7!N4D"7<G9U#/$J/$8+=)WX>-YJ.@FQC
MN9UF"&W5P<R\0P[NEH<CI2T0>V=:V@RS&3"27+(QOV<$!CF8(LAA?*E#V2DI
MJ*'%L3Q(W1KV)@=<=+U!:/,HVQ_,GX$NM.XSF'E(1K&N"B@<D<ROX4XS#5'5
MH-G5"()6J7:)YG(5(Q*0#4T0R;15FT!#ZQ.U&S1-,5VT1C 5WT5"E!SV+]6^
M$QD2P*#E<@\D-?WR*-1&MJ7$%FO+T,=&-*DW3$=,F<H05'FA)>&[P$.4HI)=
MAE&)RD(LM%,*F#M0[:?Z!K$I%,9Q5HJ(=!73M"6PE2661(YIYG/"Q9U9;'R=
M1,;S/4KQKC:E#PA>CC4K)_,]8]+I%!2$$=V=3 NE:>E^,QGF#3[8>75^_JD_
M_\7.^$7R68W&?SZAN6XS!'46"$OMB(!]+=L*0=VQJBQS9/+CBO)/Q<S_)MN*
M/5-3N_++W64>'Q^KY!TQU^UX,/TMW5!&[8X:,R9)/G_OTV1# E(TD^T(UNU&
MH)3R+1Y^J+]O]? C:VRO^?!C@P?H,Q'@EP."^%DZ!"!]=(9J-^H^!=#S'J!O
MO#*I:9AZGKU56VW#S'^I8F.FJD8E7ICT[,=X*K(I@;LJL;$?3K HS@A."[+G
MF(TKJ4BP6U#\JS.X"T&]0.T6#IQV2=ULF>.TNJ"%(@]$M4';?(T8M8P?.R\[
MN*>7@8>%0@!S[G#*=P%&H-F)DH(4C5"9P$(!&<61*9*1G5K=H09HF9+DF.V4
M>_TE6VIU99.Y"RAWPBTK$@)L[F'DN%.*<#G$8 D]9+>0<_?4IC#)$,'4ZB67
M23%^?[Q;;:M]733WO+G<%1?UZI_'AOPL^RQ@D QU6I(?"(P>\(_4.64*1J%7
MION],KAQ^'O#[0G\@TJR__]02P$"% ,*    " ",%6TWIB")E(,2   C?P  
M$@              I($     97AE8W5T:6]N7VQO9RYH=&UL4$L%!@     !
-  $ 0    +,2      $! 
end

Mime
View raw message