harmony-alerts mailing list archives

Site index · List index
Message view « Date » · « Thread »
Top « Date » · « Thread »
From nom...@intel.com
Subject [build-test alert] FAILED Windows 2003 x86_64: JettyScenario
Date Sun, 11 Nov 2007 08:51:28 GMT
Jetty server JRE:

Apache Harmony Launcher : (c) Copyright 1991, 2006 The Apache Software Foundation or its licensors,
as applicable.
java version "1.5.0" 
pre-alpha : not complete or compatible
svn = r593024, (Nov  8 2007), Windows/em64t/msvc 1400, release build
http://harmony.apache.org


Scenario framework JRE:

Apache Harmony Launcher : (c) Copyright 1991, 2006 The Apache Software Foundation or its licensors,
as applicable.
java version "1.5.0" 
pre-alpha : not complete or compatible
svn = r593024, (Nov  8 2007), Windows/em64t/msvc 1400, release build
http://harmony.apache.org


================================================================================
Scenario results:

Testsuite: org.apache.harmony.test.jetty.JettyScenario
Tests run: 5, Failures: 0, Errors: 0, Time elapsed: 4.485 sec
------------- Standard Output ---------------
Setup completed.

==============================================================testInitialPage===
Starting initial page test case.
Loading page from server: http://localhost:7070/test/
Getting resource with name: initial_page.html
Found resource: C:\cc\cc-suites\tests\JettyScenario/resources\JettyScenario\initial_page.html
Saving content of downloaded page to: C:\cc\cc-suites\build\results\JettyScenario\JettyScenario\initial_page.html
Comparing page content with etalon: initial_page.html
Page is equal to etalon.
Initial page test case passed.

============================================================testStaticContent===
Starting static content page test case.
Loading page from server: http://localhost:7070/test/data.txt
Getting resource with name: static_content.txt
Found resource: C:\cc\cc-suites\tests\JettyScenario/resources\JettyScenario\static_content.txt
Saving content of downloaded page to: C:\cc\cc-suites\build\results\JettyScenario\JettyScenario\static_content.txt
Comparing page content with etalon: static_content.txt
Page is equal to etalon.
Static content page test case passed.

=======================================================testSessionDumpServlet===
Starting servlet test case.
Loading page from server: http://localhost:7070/test/session/
Getting resource with name: session_dump.html
Found resource: C:\cc\cc-suites\tests\JettyScenario/resources\JettyScenario\session_dump.html
Saving content of downloaded page to: C:\cc\cc-suites\build\results\JettyScenario\JettyScenario\session_dump.html
Comparing page content with etalon: session_dump.html
Page is equal to etalon.
Session dump servlet page is OK.
Getting resource with name: session_dump_new.html
Found resource: C:\cc\cc-suites\tests\JettyScenario/resources\JettyScenario\session_dump_new.html
Saving content of downloaded page to: C:\cc\cc-suites\build\results\JettyScenario\JettyScenario\session_dump_new.html
Comparing page content with etalon: session_dump_new.html
Page is equal to etalon.
Session create page is OK.
Getting resource with name: session_dump_set.html
Found resource: C:\cc\cc-suites\tests\JettyScenario/resources\JettyScenario\session_dump_set.html
Saving content of downloaded page to: C:\cc\cc-suites\build\results\JettyScenario\JettyScenario\session_dump_set.html
Comparing page content with etalon: session_dump_set.html
Page is equal to etalon.
Session set page is OK.
Getting resource with name: session_dump_remove.html
Found resource: C:\cc\cc-suites\tests\JettyScenario/resources\JettyScenario\session_dump_remove.html
Saving content of downloaded page to: C:\cc\cc-suites\build\results\JettyScenario\JettyScenario\session_dump_remove.html
Comparing page content with etalon: session_dump_remove.html
Page is equal to etalon.
Session remove page is OK.
Getting resource with name: session_dump_invalidate.html
Found resource: C:\cc\cc-suites\tests\JettyScenario/resources\JettyScenario\session_dump_invalidate.html
Saving content of downloaded page to: C:\cc\cc-suites\build\results\JettyScenario\JettyScenario\session_dump_invalidate.html
Comparing page content with etalon: session_dump_invalidate.html
Page is equal to etalon.
Session invalidate page is OK.
Servlet test case passed.

===========================================================testRequestDumpJSP===
Starting JSP test case.
Loading page from server: http://localhost:7070/test/snoop.jsp
Getting resource with name: request_dump_JSP.html
Found resource: C:\cc\cc-suites\tests\JettyScenario/resources\JettyScenario\request_dump_JSP.html
Saving content of downloaded page to: C:\cc\cc-suites\build\results\JettyScenario\JettyScenario\request_dump_JSP.html
Comparing page content with etalon: request_dump_JSP.html
Page is equal to etalon.
JSP test case passed.

=====================================================testGZippedStaticContent===
Starting gzipped static content test case.
Loading page from server: http://localhost:7070/test/data.txt.gz
Unpacking content from archive.
Getting resource with name: static_content_ungzipped.txt
Found resource: C:\cc\cc-suites\tests\JettyScenario/resources\JettyScenario\static_content_ungzipped.txt
Saving content of downloaded page to: C:\cc\cc-suites\build\results\JettyScenario\JettyScenario\static_content_ungzipped.txt
Comparing page content with etalon: static_content_ungzipped.txt
Page is equal to etalon.
Gzipped static content test case passed.
------------- ---------------- ---------------

Testcase: testInitialPage took 1.219 sec
Testcase: testStaticContent took 0.266 sec
Testcase: testSessionDumpServlet took 0.437 sec
Testcase: testRequestDumpJSP took 2.078 sec
Testcase: testGZippedStaticContent took 0.36 sec

================================================================================
Jetty server output:

2007-11-08 20:57:03.626::INFO:  Logging to STDERR via org.mortbay.log.StdErrLog
2007-11-08 20:57:04.063::INFO:  Statistics on = false for SelectChannelConnector @ 0.0.0.0:7070
2007-11-08 20:57:04.141::INFO:  jetty-6.1.2rc1
2007-11-08 20:57:05.079::INFO:  Deploy C:\cc\cc-suites\build\libs\jetty-6.1.2rc1\contexts\javadoc.xml
-> org.mortbay.jetty.servlet.Context@4ce4bba{/javadoc,file:/C:/cc/cc-suites/build/libs/jetty-6.1.2rc1/javadoc/}
2007-11-08 20:57:05.141::INFO:  Deploy C:\cc\cc-suites\build\libs\jetty-6.1.2rc1\contexts\test.xml
-> org.mortbay.jetty.webapp.WebAppContext@4d06a52{/test,C:\cc\cc-suites\build\libs\jetty-6.1.2rc1/webapps/test}
2007-11-08 20:57:12.344::WARN:  Unknown realm: Test JAAS Realm
2007-11-08 20:57:14.860::INFO:  Started SelectChannelConnector @ 0.0.0.0:7070

================================================================================

BUILD FAILED:
	Ant Error Message:
C:\cc\cc-suites\scripts\cc-exec-adaptor.xml:104: The following error occurred while executing
this line: C:\cc\cc-suites\adaptors\JettyScenario\adaptor.xml:136: Jetty server startup timeout
exceeded

Date of build:	2007-11-11 11:46:15 +0300
Time to build:	5 minutes 7 seconds
Last changed:	11/11/2007 01:09:28
Last log entry:	snapshot

***********************************************************
Errors/Warnings:	(2)
            
The execution FAILED with the following exception:
The following error occurred while executing this line:
C:\cc\cc-suites\adaptors\JettyScenario\adaptor.xml:136: Jetty server startup timeout exceeded

***********************************************************
Unit Tests: (5)
        
All Tests Passed

***********************************************************
Modifications since last successful build:	(1)
            
add cc-snapshot log20071111010928Lbuild.32 11/11/2007 01:09:28snapshot

begin 644 execution_log.zip
M4$L#! H    ( &Q>:S=FE4 U4@$  "H"   2    97AE8W5T:6]N7VQO9RYH
M=&UL75)-;\(P#+U7ZG_P9>+4%H2&6%8JH;%)0SNQW2B'D!H:%)HJ<?C8KU]2
MA@18^5!B^R7OV7E->U7D:UV=B[PU6.0<+)T53GH;W5!BY2\R&/>?7GM%'+FV
MXH2)/30LCB#8$D\H5C E,'B05NH&GE^&XU$_C:,X2H3>MU)A(C=)@UAAQ<*U
M<3?YHM8KF-P:3"O>DC:P\7..1.=O@0TW4C-8N ;2M$M>5JB0< 6SL,MFR^"-
ME4+XD5@G"6VY=E)5I4'K%-GR#JK<A5.J]/;^)]_$30"[/ P6S0'--63'#WP%
M<[_"H@-ED SB*/JI$8(0CH( ']//K_<9'"750-ZST4KI8\#$D\ VQ+ NY<9A
MC.>JA7#&8 7'VHMV1?1NJJ4%)1OTLCURY!>Q'NG]7Z>GO6*#X8C=\?$E]BQ=
M"R3WJ!UU'POE\<7),U[D6=<*V:4MLJY'_@!02P$"% ,*    " !L7FLW9I5 
M-5(!   J @  $@              I($     97AE8W5T:6]N7VQO9RYH=&UL
64$L%!@     !  $ 0    ((!      $! 
end

Mime
View raw message