harmony-alerts mailing list archives

Site index · List index
Message view « Date » · « Thread »
Top « Date » · « Thread »
From nom...@intel.com
Subject [build-test alert] FAILED Windows 2003 x86_64: tomcat-scenario
Date Sun, 11 Nov 2007 08:46:06 GMT
svn.revision=593762
BUILD FAILED:
	Ant Error Message:
C:\cc\cc-suites\scripts\cc-exec-adaptor.xml:104: The following error occurred while executing
this line: C:\cc\cc-suites\adaptors\tomcat-scenario\adaptor.xml:105: Tomcat server startup
timeout exceeded

Date of build:	2007-11-11 11:40:59 +0300
Time to build:	5 minutes 2 seconds
Last changed:	11/11/2007 01:09:28
Last log entry:	snapshot

***********************************************************
Errors/Warnings:	(1)
            
The execution FAILED with the following exception:
The following error occurred while executing this line:
C:\cc\cc-suites\adaptors\tomcat-scenario\adaptor.xml:105: Tomcat server startup timeout exceeded

***********************************************************
Unit Tests: (0)
        
No Tests Run: This project doesn't have any tests

***********************************************************
Modifications since last successful build:	(1)
            
add cc-snapshot log20071111010928Lbuild.32 11/11/2007 01:09:28snapshot

begin 644 execution_log.zip
M4$L#! H    ( ,)=:S>LVO/X+P$  "P"   2    97AE8W5T:6]N7VQO9RYH
M=&ULK9)12\,P$,??"_L.]R)[:KN!$ZFU($Y!\'%O1B1+KFLD34)RV3H_O6F=
M((H^"8$+_"^_^]_EZHYZW=1;*X]-[3PV-8= 1XW7\]8:RH-ZPPHN%V=7\V:6
M12<Y81[VIIIELTQHY.,- )XD:B1\AO48E=E5<%LQ(=+)0U2$@6VCTI)Y#%%3
M8&1[P1-?H.%>6::,Q*%(;OX']QK<RU\\6$&K- 9HO>U_86NU#8P[+CK,3_R+
M8E$LSYFVNS .P,>Q_6S3(>" (I*R!NYO'A[OUG!0U $EI;5:V\-8$P>!;LRI
MIB=?!.^M!RM$]!XE'+ID[9.89.I4 *T,IF+?K7+)'5G_<P(GH1AZ72T7JPHV
M4P($]'OTZ9.YI^B 5(\VTN0-)<K455WRIBZG92@_%J.<MN0=4$L! A0#"@  
M  @ PEUK-ZS:\_@O 0  + (  !(              *2!     &5X96-U=&EO
@;E]L;V<N:'1M;%!+!08      0 ! $    !? 0     ! 
end

Mime
View raw message