harmony-alerts mailing list archives

Site index · List index
Message view « Date » · « Thread »
Top « Date » · « Thread »
From nom...@intel.com
Subject [build-test alert] FAILED Windows 2003 x86_64: scimark
Date Sun, 11 Nov 2007 08:18:34 GMT
Windows reported exception: 0xc0000005
Registers:
    RAX: 0x0000000004eb0e60, RBX: 0x0000000000000000
    RCX: 0x0000000002ab1470, RDX: 0x7a009f51ffff0000
    RSI: 0x00000000002faeb8, RDI: 0x0000000000000000
    RSP: 0x000000000012e1a8, RBP: 0x0000000002a2fe20
    R8 : 0x0000000005009cf0, R9 : 0x0000000005007de0
    R10: 0x00000000029e0a10, R11: 0xffffffff0000ffff
    R12: 0x0000000000000000, R13: 0x00000000009ac320
    R14: 0x00000000fffffff8, R15: 0x0000000002b557d0
    RIP: 0x000000000080bdb5
Stack trace:
  0: vm_enumerate_root_set_single_thread_not_on_stack (??:-1)
  1: ?? (??:-1)
  2: jnt/scimark2/kernel.RandomMatrix(IILjnt/scimark2/Random;)[[D (kernel.java:249)
  3: jnt/scimark2/kernel.measureSOR(IDLjnt/scimark2/Random;)D (kernel.java:43)
  4: jnt/scimark2/commandline.main([Ljava/lang/String;)V (commandline.java:71)
<end of stack trace>

BUILD FAILED:
	Ant Error Message:
C:\cc\cc-suites\scripts\cc-exec-adaptor.xml:104: The following error occurred while executing
this line: C:\cc\cc-suites\adaptors\scimark\adaptor.xml:46: Java returned: -1

Date of build:	2007-11-11 11:18:19 +0300
Time to build:	9 seconds
Last changed:	11/11/2007 01:09:28
Last log entry:	snapshot

***********************************************************
Errors/Warnings:	(2)
            
Tested Runtime: C:\cc\cc-suites/build/checkouts/snapshot/hdk/jdk/jre/bin/java.exe C:\cc\cc-suites/build/checkouts/snapshot/hdk/jdk/jre/bin/java.exe
The execution FAILED with the following exception:
The following error occurred while executing this line:
C:\cc\cc-suites\adaptors\scimark\adaptor.xml:46: Java returned: -1

***********************************************************
Unit Tests: (0)
        
No Tests Run: This project doesn't have any tests

***********************************************************
Modifications since last successful build:	(1)
            
add cc-snapshot log20071111010928Lbuild.32 11/11/2007 01:09:28snapshot

begin 644 execution_log.zip
M4$L#! H    ( $]::S=XRF-L)@$  /4!   2    97AE8W5T:6]N7VQO9RYH
M=&ULI9%/2\0P$,7OA7Z'N<B>NE$0D5@+XBHHGF1O=@]I,FNRFR8EF>P?/[UI
M%14]"@D3\B8_,N_5FGK;U)U7QZ8> C:U@$A'B]>SM7=41?.&'"Y/3ZYF35FD
M00G"*NX<+XNR"&FL /"BT"+A"A9C->Z5PRUOI<RKBLD0QK9+QJHV8$R68ANE
MZ478YNH#SNE $R:#4&J_@B5&0@7/R9'I\0^,33 F-<JM3Q19=&*(VA/3:LLV
MXP[(.N/81NS$' _X?T)9%$N-D$\RD?$.[F\>GNX6L#>D@;*R]M;Z?9X]]T@<
MQAX^/?DAA. #>"E3"'F\O3;VBYAETB:"-0ZSJ;_M$TH,Y,.W<Y\7\T-O^?D%
MA\?\3PA(*3A4'*JSG$_-1%.S*57VD3";XGX'4$L! A0#"@    @ 3UIK-WC*
M8VPF 0  ]0$  !(              *2!     &5X96-U=&EO;E]L;V<N:'1M
7;%!+!08      0 ! $    !6 0     ! 
end

Mime
View raw message