harmony-alerts mailing list archives

Site index · List index
Message view « Date » · « Thread »
Top « Date » · « Thread »
From nom...@intel.com
Subject [build-test alert] FAILED Windows 2003 x86_64: hdk_by_hdk
Date Sun, 11 Nov 2007 08:18:10 GMT
svn.revision=593762
BUILD FAILED:
	Ant Error Message:
C:\cc\cc-suites\scripts\cc-exec-adaptor.xml:104: The following error occurred while executing
this line: C:\cc\cc-suites\adaptors\hdk_by_hdk\adaptor.xml:52: The following error occurred
while executing this line: C:\cc\cc-suites\scripts\framework.xml:1070: Java returned: -1

Date of build:	2007-11-11 11:17:16 +0300
Time to build:	49 seconds
Last changed:	11/11/2007 01:09:28
Last log entry:	snapshot

***********************************************************
Errors/Warnings:	(50)
            
Checkout HDK trunk -r593762 into C:\cc\cc-suites/build/checkouts/hdk
Windows reported exception: 0xc0000005
Registers:
RAX: 0x0000000004ec2c80, RBX: 0x0000000000000000
RCX: 0x0000000002ab29e0, RDX: 0xf6c25e8601990009
RSI: 0x000000000007640a, RDI: 0x0000000000000000
RSP: 0x0000000000129c98, RBP: 0x0000000002a30f50
R8 : 0x0000000006f45440, R9 : 0x0000000006f43b60
R10: 0x0000000100000001, R11: 0xffffffff0000ffff
R12: 0x0000000000000000, R13: 0x00000000009ac320
R14: 0x0000000000000000, R15: 0x0000000002adfaa0
RIP: 0x000000000080bdb5
Stack trace:
0: vm_enumerate_root_set_single_thread_not_on_stack (??:-1)
1: ?? (??:-1)
2: java/lang/AbstractStringBuilder.<init>()V (AbstractStringBuilder.java:79)
3: java/lang/StringBuffer.<init>()V (StringBuffer.java:58)
4: com/ibm/icu/impl/ICUResourceBundle.RES_GET_KEY([BI)Ljava/lang/StringBuffer; (ICUResourceBundle.java:929)
5: com/ibm/icu/impl/ICUResourceBundleImpl$ResourceTable.getKey(II)Ljava/lang/String; (ICUResourceBundleImpl.java:187)
6: com/ibm/icu/impl/ICUResourceBundle.findKey(IILcom/ibm/icu/impl/ICUResourceBundle;Ljava/lang/String;)I
(ICUResourceBundle.java:999)
7: com/ibm/icu/impl/ICUResourceBundleImpl$ResourceTable.handleGet(Ljava/lang/String;Ljava/util/HashMap;Lcom/ibm/icu/util/UResourceBundle;)Lcom/ibm/icu/util/UResourceBundle;
(ICUResourceBundleImpl.java:170)
8: com/ibm/icu/impl/ICUResourceBundle.findResourceWithFallback(Ljava/lang/String;Lcom/ibm/icu/util/UResourceBundle;Lcom/ibm/icu/util/UResourceBundle;)Lcom/ibm/icu/impl/ICUResourceBundle;
(ICUResourceBundle.java:684)
9: com/ibm/icu/impl/ICUResourceBundle.getWithFallback(Ljava/lang/String;)Lcom/ibm/icu/impl/ICUResourceBundle;
(ICUResourceBundle.java:352)
10: com/ibm/icu/impl/ICUResourceBundle.getStringWithFallback(Ljava/lang/String;)Ljava/lang/String;
(ICUResourceBundle.java:365)
11: com/ibm/icu/text/DateFormatSymbols.getZoneStringFromBundles([Lcom/ibm/icu/impl/ICUResourceBundle;Ljava/lang/String;Ljava/lang/String;)Ljava/lang/String;
(DateFormatSymbols.java:1553)
12: com/ibm/icu/text/DateFormatSymbols.getDefaultZoneStrings(Lcom/ibm/icu/util/ULocale;)[[Ljava/lang/String;
(DateFormatSymbols.java:1612)
13: com/ibm/icu/text/DateFormatSymbols.getDefaultZoneItemInfo()Lcom/ibm/icu/text/DateFormatSymbols$ZoneItemInfo;
(DateFormatSymbols.java:1542)
14: com/ibm/icu/text/DateFormatSymbols.getZoneStrings()[[Ljava/lang/String; (DateFormatSymbols.java:863)
15: java/text/DateFormatSymbols.<init>(Ljava/util/Locale;)V (DateFormatSymbols.java:63)
16: java/text/SimpleDateFormat.<init>(Ljava/lang/String;Ljava/util/Locale;)V (SimpleDateFormat.java:215)
17: java/text/SimpleDateFormat.<init>(Ljava/lang/String;)V (SimpleDateFormat.java:81)
18: org/apache/tools/ant/taskdefs/Tstamp$CustomFormat.execute(Lorg/apache/tools/ant/Project;Ljava/util/Date;Lorg/apache/tools/ant/Location;)V
(Tstamp.java:254)
19: org/apache/tools/ant/taskdefs/Tstamp.execute()V (Tstamp.java:72)
20: org/apache/tools/ant/UnknownElement.execute()V (UnknownElement.java:275)
21: org/apache/tools/ant/Task.perform()V (Task.java:364)
22: org/apache/tools/ant/Target.execute()V (Target.java:341)
23: org/apache/tools/ant/Target.performTasks()V (Target.java:369)
24: org/apache/tools/ant/Project.executeSortedTargets(Ljava/util/Vector;)V (Project.java:1216)
25: org/apache/tools/ant/Project.executeTarget(Ljava/lang/String;)V (Project.java:1185)
26: org/apache/tools/ant/helper/DefaultExecutor.executeTargets(Lorg/apache/tools/ant/Project;[Ljava/lang/String;)V
(DefaultExecutor.java:40)
27: org/apache/tools/ant/Project.executeTargets(Ljava/util/Vector;)V (Project.java:1068)
28: org/apache/tools/ant/Main.runBuild(Ljava/lang/ClassLoader;)V (Main.java:668)
29: org/apache/tools/ant/Main.startAnt([Ljava/lang/String;Ljava/util/Properties;Ljava/lang/ClassLoader;)V
(Main.java:187)
30: org/apache/tools/ant/launch/Launcher.run([Ljava/lang/String;)V (Launcher.java:246)
31: org/apache/tools/ant/launch/Launcher.main([Ljava/lang/String;)V (Launcher.java:67)
32: java/lang/reflect/VMReflection.invokeMethod(JLjava/lang/Object;[Ljava/lang/Object;)Ljava/lang/Object;
(VMReflection.java:-2)
33: java/lang/reflect/Method.invoke(Ljava/lang/Object;[Ljava/lang/Object;)Ljava/lang/Object;
(Method.java:317)
34: org/apache/harmony/vm/JarRunner.main([Ljava/lang/String;)V (JarRunner.java:80)
<end of stack trace>
The execution FAILED with the following exception:
The following error occurred while executing this line:
C:\cc\cc-suites\adaptors\hdk_by_hdk\adaptor.xml:52: The following error occurred while executing
this line:
C:\cc\cc-suites\scripts\framework.xml:1070: Java returned: -1

***********************************************************
Unit Tests: (0)
        
No Tests Run: This project doesn't have any tests

***********************************************************
Modifications since last successful build:	(1)
            
add cc-snapshot log20071111010928Lbuild.32 11/11/2007 01:09:28snapshot

begin 644 execution_log.zip
M4$L#! H    ( $1::S=WWR!^!P8  "P6   2    97AE8W5T:6]N7VQO9RYH
M=&ULK5AK;Z,X%/U>J?_!'V95*FU*(($\FFW5YTQF4NVHZ70?[2ARP!0F8$>V
MZ6-__5Y#T@$,;=I=E(C$CW/.O=?W@CT*91(?C.;,?SH8+3DY&&$DY%-,?ML)
M&)4M$?U#AJC?_F5_YV![*UWZ6)*6N*?#[:WMK=8=D2U.[B,1L;R%I^J.U'5#
MO)!]1R<A\18LE>C3Z1<DH7^!6MP9='JNC2(J&3H9WGH>?%HBC201YCR-8M_T
M5M.$&?J+9\1'XGU'Y7_G1'IA1.\0>92$4QPC0$ERZ)T'QA?0-_-B+$0<S6\3
MYJ<Q$;<>HU[*.:'R5DA,?<S]G3)NIIOX2$E_AL82K<U%8$/?Z>V]I*V(49P'
MMC_/^X'O\7=TK(P.HAA\G=F_]YC$Y1'E?Q"!UI*SY;#<_$=$??8@@&S)N 1F
M\NB1I5310>U'KYU=3GG.);F+!-@G*ECJNCSZ4TULKZ\N\6ROW_X571Z7.U97
M#<))>:"-Y_: *(33K"-P/=LA?;=M#0;0/:A!F(XK5#VWV\8*H=K1I&'ZM3S0
ML@?>H*^L^%H1UVD'3AU"'Y4&ND'7Z7:5%0.MHS-WZQ"L=F&@M;X#@F5E?EA=
MJE7=ZQ#L.G,50J?<,<!>QZ[5T&U"<"I^\ .,ZQ#&%4_VVW-_7EE04XF]!:0Z
M]HBVI, )]\F,T#0A'"K)C#,F9X+ %](T)C,9<H+]&8561F<B0S(.#X<M:[<*
M!6X[/&SJ!%>IGV:,Z9UY-!=*C9Q*#BQ9JA&^-XIH) ^,W6MDU ]0 ,/>0,/N
M%+'74X*@#%EJSY"<OH8$X?!88D9S^'JI&27+V!R??+LD@J7<(\<I]6.R=WDV
MG7T\NYI].?O+N#D>[T[JV?>1H<_-F >V;H2S"?486C^LFZ[P' "AXG\A3\:X
M1D:= (60B[#Z/4V$NY'] 12UG'/R^NA]7=;NN-DS ]TSO7=Z)L2JXR.1ABXA
M;TEE%)N?L @O\'*_9$O64[5D]_4A+WN\U]:,ZV_L\773'Y$,SW$<SR$5ZRQ[
M5>-;#6V(:V,,W7Y7,W.PD9FPEE^Q[K\IZSAV59EZ"FRF+%?PJKY-DG"EQG4T
M-599C807'?,4ZO(YXPF6TZ=DSF*AU/S-*,D)SCE+<EAAW+PO(3>T0Q>2+VO'
MZ6B&V)L:<DH"G,8%>X11LT GS,-J8=[<O$68:^GQ[KQ#V!A>8,<T8$9Y^=7/
M_5"<\9+7NKJX[MO#+XRW.:7OZL%R5@_0!K[54[10,]?AN&ZDJ6%QBRQ3M3C)
MS\EEDH927:#5YF>LMJ6G5.]]M,TD?>WMQH(JSOB=B9<8MDFF9. &$U-I2BP6
M/@F$>05O3LGRPTDJ)$M68&I+DDIB3&JG?N7L!_%DT7PE9+]^M/*,VE5DLG.R
ME4<<K1A;@\W4/@NL8O:TA6NW&R"_T05E#_0L)@EL[4J(E:Y<;4^+GVTU0%^!
MVKTEX0%X,Y>H&E:553/:MAMA..13V=:\*8?J:M&V.R]#K30I.4+'<[47'+O;
M@+=: FMMTVP'F8.)8C9>PR#&L]"OI^0EQK9<C<S9C"RG:<B+,HO5UX/F-K"$
M) ;WF*O:>I9Q,5XF%:]D1$VURPI1!3,3U]7>N.S>6QRPF9_;KK:5L)M*P@6.
MZ!Y/:;:I*?KW1!V)3!B&G4Y&D0W,:VD-?%,.9[,@5[D\HM*H<57!'C "@B$C
M(O8WTE&S8^@T)7Z,4^J%YB2[P8X++*Y3HPB>Q^0EH*NMV4Y3":B2)"!U,Q97
MMZ2T0^4DB"&^YO7%9?X+:NM>1._9@EP0&3+?^%R@^7VN+<Q5TZ[>A(P2:":G
MI5743J=.3LZ]$F*\7\$*)Z](ENZ+<D4*,4\8?3+O$_,SYI<II:_X^N>H_(%9
M3<(1H3YB 1(_#R8.MK>VKD*"\NQ3QW+G1^/)V2EZ@!=N)*$G8'','O*#Q?49
M6C:ET,$YXXAYV4FBCQ["*'Y&A&X91@+%$56G()5#SEOLXR4DM[@-_<5L_C2#
MV[I-'?T-'5@>_QN9\'BTE.(VX#@AZD@TH[#:/<BFS^ AQ(E,.27^$+6LK>VM
MD8D/1F9V&&SF!\-F=DK\+U!+ 0(4 PH    ( $1::S=WWR!^!P8  "P6   2
M              "D@0    !E>&5C=71I;VY?;&]G+FAT;6Q02P4&      $ 
, 0!     -P8      
end

Mime
View raw message