harmony-alerts mailing list archives

Site index · List index
Message view « Date » · « Thread »
Top « Date » · « Thread »
From nom...@intel.com
Subject [build-test alert] FAILED Windows 2003 x86_64: dacapo
Date Sat, 10 Nov 2007 22:48:44 GMT
svn.revision=593762
BUILD FAILED:
	Ant Error Message:
C:\cc\cc-suites\scripts\cc-exec-adaptor.xml:104: The following error occurred while executing
this line: C:\cc\cc-suites\adaptors\dacapo\adaptor.xml:112: Not all workloads completed successfully

Date of build:	2007-11-11 01:48:35 +0300
Time to build:	4 seconds
Last changed:	11/11/2007 01:09:28
Last log entry:	snapshot

***********************************************************
Errors/Warnings:	(51)
            
java version "1.5.0"
pre-alpha : not complete or compatible
svn = r593762, (Nov 11 2007), Windows/em64t/msvc 1400, release build
http://harmony.apache.org
===== DaCapo antlr starting =====
ANTLR Parser Generator   Version 2.7.2   1989-2003 jGuru.com
Windows reported exception: 0xc0000005
Registers:
RAX: 0x0000000004f0c4f0, RBX: 0x0000000000000000
RCX: 0x0000000002ab3430, RDX: 0x00060a1800c8001c
RSI: 0x000000000001ab3c, RDI: 0x0000000000000000
RSP: 0x000000000012ab78, RBP: 0x0000000002a31e20
R8 : 0x00000000055ee740, R9 : 0x00000000055edb70
R10: 0x0000000100000001, R11: 0xffffffff0000ffff
R12: 0x0000000000000000, R13: 0x00000000009ac320
R14: 0x0000000011e0b900, R15: 0x0000000002b55810
RIP: 0x000000000080bdb5
Stack trace:
0: vm_enumerate_root_set_single_thread_not_on_stack (??:-1)
1: ?? (??:-1)
2: antlr/collections/impl/BitSet.toArray()[I (BitSet.java:327)
3: antlr/JavaCodeGenerator.getLookaheadTestTerm(ILantlr/collections/impl/BitSet;)Ljava/lang/String;
(JavaCodeGenerator.java:3125)
4: antlr/JavaCodeGenerator.getLookaheadTestExpression([Lantlr/Lookahead;I)Ljava/lang/String;
(JavaCodeGenerator.java:3083)
5: antlr/JavaCodeGenerator.getLookaheadTestExpression(Lantlr/Alternative;I)Ljava/lang/String;
(JavaCodeGenerator.java:3109)
6: antlr/JavaCodeGenerator.genCommonBlock(Lantlr/AlternativeBlock;Z)Lantlr/JavaBlockFinishingInfo;
(JavaCodeGenerator.java:1699)
7: antlr/JavaCodeGenerator.gen(Lantlr/AlternativeBlock;)V (JavaCodeGenerator.java:204)
8: antlr/AlternativeBlock.generate()V (AlternativeBlock.java:65)
9: antlr/JavaCodeGenerator.genAlt(Lantlr/Alternative;Lantlr/AlternativeBlock;)V (JavaCodeGenerator.java:1245)
10: antlr/JavaCodeGenerator.genCommonBlock(Lantlr/AlternativeBlock;Z)Lantlr/JavaBlockFinishingInfo;
(JavaCodeGenerator.java:1638)
11: antlr/JavaCodeGenerator.gen(Lantlr/AlternativeBlock;)V (JavaCodeGenerator.java:204)
12: antlr/AlternativeBlock.generate()V (AlternativeBlock.java:65)
13: antlr/JavaCodeGenerator.genAlt(Lantlr/Alternative;Lantlr/AlternativeBlock;)V (JavaCodeGenerator.java:1245)
14: antlr/JavaCodeGenerator.genRule(Lantlr/RuleSymbol;ZI)V (JavaCodeGenerator.java:2553)
15: antlr/JavaCodeGenerator.gen(Lantlr/LexerGrammar;)V (JavaCodeGenerator.java:453)
16: antlr/LexerGrammar.generate()V (LexerGrammar.java:46)
17: antlr/JavaCodeGenerator.gen()V (JavaCodeGenerator.java:110)
18: antlr/Tool.doEverything([Ljava/lang/String;)I (Tool.java:254)
19: antlr/Tool.main([Ljava/lang/String;)V (Tool.java:399)
20: dacapo/antlr/AntlrHarness.iterate(Ljava/lang/String;)V (AntlrHarness.java:71)
21: dacapo/Benchmark.run(Ldacapo/Callback;Ljava/lang/String;Z)Z (Benchmark.java:126)
22: dacapo/TestHarness.runBenchmark(Ljava/io/File;Ljava/lang/String;Ldacapo/TestHarness;)V
(TestHarness.java:302)
23: dacapo/TestHarness.main([Ljava/lang/String;)V (TestHarness.java:242)
24: Harness.main([Ljava/lang/String;)V (Harness.java:5)
25: java/lang/reflect/VMReflection.invokeMethod(JLjava/lang/Object;[Ljava/lang/Object;)Ljava/lang/Object;
(VMReflection.java:-2)
26: java/lang/reflect/Method.invoke(Ljava/lang/Object;[Ljava/lang/Object;)Ljava/lang/Object;
(Method.java:317)
27: org/apache/harmony/vm/JarRunner.main([Ljava/lang/String;)V (JarRunner.java:80)
<end of stack trace>
Number of tests: (...........)
N of runned tests(${number.of.runned.tests})
The execution FAILED with the following exception:
The following error occurred while executing this line:
C:\cc\cc-suites\adaptors\dacapo\adaptor.xml:112: Not all workloads completed successfully

***********************************************************
Unit Tests: (0)
        
No Tests Run: This project doesn't have any tests

***********************************************************
Modifications since last successful build:	(1)
            
add cc-snapshot log20071111010928Lbuild.32 11/11/2007 01:09:28snapshot

begin 644 execution_log.zip
M4$L#! H    ( !0.:S<8#8+!H@4  ,D1   2    97AE8W5T:6]N7VQO9RYH
M=&ULQ5AM3]M($/Z.Q'\857>J(Q';Z[PG% 1I:5.E7$40=P(JM+$WQ,7V1NMU
M('>Z_WZSMA-BK\FUU;U8!"<[L\\\,[LSWO'A7(;!T>&4>ZNCPX5@1X<48KD*
MV)O7,Q[)>NS_SOK0M7\>O#[:WTL6'I6L'B^C_O[>_IY(U!W4=<.>F/L%3A;4
MG3/X0$7(HQ6,:1+A;P%],-P:#/EB)?S[N032ZY$#<&R[#9>HGT^;\)E\I(+!
M&4\BM.3S"+@ 7\80^"Z+8B[B Z QT,4"!^@T8&;1_E>ZI+!D(E937Q&S9=JO
MH*B"3M9IL)A3)!5Q"2X/%P&33%E2W]$LXA;GH,/P!D2KU^BTG0,PSOD2"%'\
M.[4#^-6///X86RQL-Z45QDL72-.V#T"P@-&8P33Q Z^(.)=RT;>L>18HDZ8!
M,+FX+ZJ]41>\I4.ZX$ C&0A<'2JD']UGLJ+Z11)%2I1I8@CN!0U#*K(!2T7'
M+%DX.;\<7\!G*F)<IO<L8H)*C 3 51Y%Q^R8#OXFO6ZOCAXWX.O[1"0FQJJ(
ME(<!O5YP(9D'[,EE"[6(?;"?7#N]6B7"[-Z/)5HJ[2-U79S\IB;:ZZLYLUW\
M',#%:5&07Q4(PZ*B0Z>-9D,AO%T+VC8E7=MV\4/<"H3)J&2*((:K$,J"ESA,
M/A<5";+H=)47GTOD&H0Y50A=*"BV6HQUFLJ+GB;PIITJ!&)O*9+U'1$(48)9
M?JE1=:]"<*K<50B-HJ!'W4:E%Z2YK4@(LZ>]#*%5C,.TU>J2*H11*9)=>^I-
M2QMJ(JG[ %)0EVE;"H.P#.]8E(1JD[,[P;F\BQE^,&<"=B?G@E'O#HO"'8_N
MXA3).#[NUTFM#(5A.SY^28BARO+-Y4' 7)4!L>5CE;%.?3EATI3\1 BZ,FHW
M(S#R,96;_8;3T= ::[2/J#'D'MLDJ7G/Y)CS!SI'VI<LEI=,A,9HO-/XH#96
MIJR 1O?61 IT?0"&CIWQ(4Y+(]3\=D+OGK#:QJJ,&#<YK8U\,/HN)G:WH3%I
M_1"3G,A)@'4GPFJ_9-])A=@]C4I[%Y5HR$,L\Z<!=Q\JS*?C@^O:^!DA'3KS
M(S^>(Y=1-.,O\R'MGLZGLY//BR1J5R^:<>RF9J6[ME(&4D;2)#,4HB9- =OZ
MUNKM9(TP58OW [X0IZD95S7R_UO"1E?C0_Z+)23./[N$9&>Y^K>7<&=IBBZ2
M@*VMJ^^353CEP>!ZM"MDK996=\C.NK-9F3&JB_?9 6R7)\T*"YMRL@U27)&"
M) -J:SA_4P9VQ9?8&MHFW2\Y#TR/O\.3]DJJ[8WE72N@-7RXI8IY(/6]URO@
MA=2/*G&NMG$:>K%S,',]ZN(1V<KWD?J//4B$%=_T91:S:N"":FJ@HSW0';+!
M/V78SV# 'TSL?8QQ/CJD03#%T\) MW%=N\9'_&96OG6UA7*<C0GUM%H30B.;
MN;D#/K?._(!5F!KK %GLM@#S9ZFCV6]4VM^Y)&58IZG#8D)^"U8!1TMK!_/M
M>9I@,W6NL:X^763?\)EN^M&2/[!/3,ZY9WS<,O++]"NJ#&[TH9H^!$8!-&53
MUYUJ5]');.=$C!]GD./D)PWM..A@1F.7:&4-X[I_M)8A9KA0[1\3.R/]K)5:
MZ):3_)!%'O 9Q,_GZ*-RRQ8G@>Q#G:S'76SKOZ3-O>H]"<QP?X+D,.S?NB[^
MU>,$DS"^3=O@6Y'.CV^S[;;!=N?\"YPGX13;4+2/^C+N@V$^7[62KE(3RA<O
MTS9^^B-*YYM\9F8",Q7\B3/WU&L&Y4"2OE4X.QF-W[V%1U_.0:)DAH=E_JCH
M/S>MZ90M@1#8%W/7381 DX]SY66.B&(L@^HM1:3:CK+CU*,++*QKG]>_S:<P
MP#J+J7_.)6 -@4<N'@).O7CS5L*#.'%=S(U9$@2KO?V]0XL>'5KIFQHK>VMC
MI:]P_@)02P$"% ,*    "  4#FLW& V"P:(%  #)$0  $@              
MI($     97AE8W5T:6]N7VQO9RYH=&UL4$L%!@     !  $ 0    -(%    
!  $! 
end

Mime
View raw message