harmony-alerts mailing list archives

Site index · List index
Message view « Date » · « Thread »
Top « Date » · « Thread »
From nom...@intel.com
Subject [build-test alert] FAILED Linux ia64: classlib debug
Date Fri, 09 Nov 2007 13:21:41 GMT

BUILD FAILED:
	Ant Error Message:
/export/users/cc/scripts/cc-exec-adaptor.xml:104: The following error occurred while executing
this line: /export/users/cc/adaptors/classlib/adaptor.xml:49: The following error occurred
while executing this line: /export/users/cc/build/checkouts/classlib/build.xml:282: The following
error occurred while executing this line: /export/users/cc/build/checkouts/classlib/make/depends.xml:367:
The following error occurred while executing this line: /export/users/cc/build/checkouts/classlib/make/depends.xml:418:
The following error occurred while executing this line: /export/users/cc/build/checkouts/classlib/make/depends.xml:446:
java.net.ConnectException: Connection timed out

Date of build:	2007-11-09 05:17:39 -0800
Time to build:	3 minutes 42 seconds
Last changed:	11/09/2007 04:48:46
Last log entry:	Upgrading bcprov.jar to version 1.38.

***********************************************************
Errors/Warnings:	(22)
            
[cc-ant]: Test Suite 'classlib' execution. Repository updated: true
[cc-ant]: Result: failed.superiors = '${failed.superiors}'
[cc-ant]: Do cleanup for /export/users/cc/build/checkouts/classlib
Checking depends/jars/yoko_M2-20070130/yoko.jar
Checksum verified (true)
Checking depends/jars/yoko_M2-20070130/yoko-core.jar
Checksum verified (true)
Checking depends/jars/yoko_M2-20070130/yoko-rmi-impl.jar
Checksum verified (true)
Checking depends/jars/yoko_M2-20070130/yoko-rmi-spec.jar
Checksum verified (true)
Checking depends/jars/bcel-5.2/bcel-5.2.jar
Checksum verified (true)
Checking depends/jars/xalan-j_2.7.0/xalan.jar
Checksum verified (true)
Checking depends/jars/xerces_2.9.1/xerces.zip
Checksum verified (true)
Checking depends/jars/junit_3.8.2/junit.jar
Checksum verified (true)
Checking depends/jars/bcprov-jdk15-138/bcprov.jar
Fetching depends/jars/bcprov-jdk15-138/bcprov.jar
The execution FAILED with the following exception:
The following error occurred while executing this line:
/export/users/cc/adaptors/classlib/adaptor.xml:49: The following error occurred while executing
this line:
/export/users/cc/build/checkouts/classlib/build.xml:282: The following error occurred while
executing this line:
/export/users/cc/build/checkouts/classlib/make/depends.xml:367: The following error occurred
while executing this line:
/export/users/cc/build/checkouts/classlib/make/depends.xml:418: The following error occurred
while executing this line:
/export/users/cc/build/checkouts/classlib/make/depends.xml:446: java.net.ConnectException:
Connection timed out

***********************************************************
Unit Tests: (0)
        
No Tests Run: This project doesn't have any tests

***********************************************************
Modifications since last successful build:	(1)
            
modified hindessm  /harmony/enhanced/classlib/trunk/make/depends.properties 11/09/2007 04:48:46
Upgrading bcprov.jar to version 1.38.

begin 644 execution_log.zip
M4$L#! H    ( + J:3==:YWUW@(  ,$+   2    97AE8W5T:6]N7VQO9RYH
M=&ULS5;);MLP$+WK*^92N#U0\I+%45T#19:B0 KTD)X"(Z#)D46;(@62\I*O
M+RG;B5W'0!HD<72BAISWW@P'G.GEKI#]WE#S1;]7&NSW*%BWD/BMD6GEB!7W
MF$*W^>EKHQ]5):<.B9VJ-(+PW2++]0!N&2-4N4$*%QJ81*JJ$C)M(,%YJ8U+
M*HO&)HPEPTI(GK <V417SILDM5:*X1INCFP ?\*ZH!-,.):HN(U+HTLT3J#=
M.KCU<X6.Y4*- .<.C:(2A,,"A'(:&H7FE43/IQ6KC$'E$NNHXM3PQC9W'2)_
M!/'>!J?""JW@^*QSW&[&^S6LO9]RBDSETW91E5*P^I /:HS,@:(%>ID@BI"K
M&'ZO[#>Z)-<X10FK\!? ,1-*. ]KEVL/DPEC7?#?2;9E1I0^R8_9B^>%!!\V
MT!$-C$\X[;NAI+Z0;:@HRD+2R>J:TB@B7,^4U)1O%\AY@ MWLSJ9C*EG6^B)
MOOO5)NUF\[39ZC1K0^RW/(Y!*N5B RZ8"CU%D@F)1&1D^"2)K0J8HA&9\*GY
M[$R%7UZJA#!M\ /),84@OD;D!Y-D2V0'D31D*,EQW'Y8'$3%G$JJR/BN'9_&
MS>7?872@86B]C+.XM?J)[T7Y[CK&E7^@[CIQUU],O7ZC;-P6$RZ,/^2!PVOJ
M?]+_>,W^J23_KDW)F$]:QZ35Z3ZK^+9=5H9]P6X"/C2J9P/"TGV$;@ _T#GO
MG$+N7)DFR6PVBX>Z4FS!J'428VU&R9IX!W4'[D:_6M;V*;XTQH\"HZ7NE\L.
M3?4-E$8W.4+HWE5HJW#U_>?UY07,A,O!^9U,2ZEGR[&"81G.I+7+QD8=GV;U
M8,%AEOMZ7B/Z;9<+"]*WZC3:D4\Y+9TV&[I7EM!=TZ.S%%Z-:F^FZHV:K]UM
MOP?AUF07>#LGIP?A/6IU#\-[=)+"F$YIK-#%YUHI/^Y=/I07K"RA')THO R/
M%_42VN\E]82>+*?UI![=_P)02P$"% ,*    " "P*FDW76N=]=X"  #!"P  
M$@              I($     97AE8W5T:6]N7VQO9RYH=&UL4$L%!@     !
-  $ 0     X#      $! 
end

Mime
View raw message