harmony-alerts mailing list archives

Site index · List index
Message view « Date » · « Thread »
Top « Date » · « Thread »
From nom...@intel.com
Subject [build-test alert] FAILED Linux x86: jdktools-test debug
Date Fri, 09 Nov 2007 10:43:37 GMT

BUILD FAILED:
	Ant Error Message:
/export/users/cc/cc-common/scripts/cc-exec-adaptor.xml:104: The following error occurred while
executing this line: /export/users/cc/cc-common/adaptors/jdktools-test/adaptor.xml:28: The
following error occurred while executing this line: /export/users/cc/cc-common/build/checkouts/hdk/working_jdktools/build.xml:242:
The following error occurred while executing this line: /export/users/cc/cc-common/build/checkouts/hdk/working_jdktools/make/build-test.xml:97:
There were test errors.

Date of build:	2007-11-09 16:23:47 +0600
Time to build:	19 minutes 42 seconds
Last changed:	11/09/2007 13:25:57
Last log entry:	hdk

***********************************************************
Errors/Warnings:	(226)
            
Result: 1
========================================
Testing jdktools binaries...
========================================
Compiling JPDA tests
Since fork is false, ignoring memoryMaximumSize setting
----------
1. WARNING in /export/users/cc/cc-common/build/checkouts/hdk/working_jdktools/modules/jpda/test/common/unit/org/apache/harmony/jpda/tests/framework/DebuggeeRegister.java
(at line 58)
registered.add(debuggee);
^^^^^^^^^^^^^^^^^^^^^^^^
Type safety: The method add(Object) belongs to the raw type LinkedList. References to generic
type LinkedList<E> should be parameterized
----------
----------
2. WARNING in /export/users/cc/cc-common/build/checkouts/hdk/working_jdktools/modules/jpda/test/common/unit/org/apache/harmony/jpda/tests/framework/TestOptions.java
(at line 505)
internalProperties.put(name, value);
^^^^^^^^^^^^^^^^^^^^^^^^^^^^^^^^^^^
Type safety: The method put(Object, Object) belongs to the raw type HashMap. References to
generic type HashMap<K,V> should be parameterized
----------
----------
3. WARNING in /export/users/cc/cc-common/build/checkouts/hdk/working_jdktools/modules/jpda/test/common/unit/org/apache/harmony/jpda/tests/framework/jdwp/PacketDispatcher.java
(at line 114)
eventQueue.add(eventPacket);
^^^^^^^^^^^^^^^^^^^^^^^^^^^
Type safety: The method add(Object) belongs to the raw type List. References to generic type
List<E> should be parameterized
----------
4. WARNING in /export/users/cc/cc-common/build/checkouts/hdk/working_jdktools/modules/jpda/test/common/unit/org/apache/harmony/jpda/tests/framework/jdwp/PacketDispatcher.java
(at line 249)
replies.put(new Integer(replyPacket.getId()),
replyPacket);
^^^^^^^^^^^^^^^^^^^^^^^^^^^^^^^^^^^^^^^^^^^^^^^^^^^^^^^^^^^^^^^^^^^^^^^^^^^^^^^^^^^^^^^^^^
Type safety: The method put(Object, Object) belongs to the raw type Hashtable. References
to generic type Hashtable<K,V> should be parameterized
----------
5. WARNING in /export/users/cc/cc-common/build/checkouts/hdk/working_jdktools/modules/jpda/test/common/unit/org/apache/harmony/jpda/tests/framework/jdwp/PacketDispatcher.java
(at line 284)
commands.put(Id, command);
^^^^^^^^^^^^^^^^^^^^^^^^^
Type safety: The method put(Object, Object) belongs to the raw type Hashtable. References
to generic type Hashtable<K,V> should be parameterized
----------
6. WARNING in /export/users/cc/cc-common/build/checkouts/hdk/working_jdktools/modules/jpda/test/common/unit/org/apache/harmony/jpda/tests/framework/jdwp/PacketDispatcher.java
(at line 355)
commands.put(Id, command);
^^^^^^^^^^^^^^^^^^^^^^^^^
Type safety: The method put(Object, Object) belongs to the raw type Hashtable. References
to generic type Hashtable<K,V> should be parameterized
----------
----------
7. WARNING in /export/users/cc/cc-common/build/checkouts/hdk/working_jdktools/modules/jpda/test/common/unit/org/apache/harmony/jpda/tests/framework/jdwp/VmMirror.java
(at line 1834)
frames.add(frame);
^^^^^^^^^^^^^^^^^
Type safety: The method add(Object) belongs to the raw type ArrayList. References to generic
type ArrayList<E> should be parameterized
----------
8. WARNING in /export/users/cc/cc-common/build/checkouts/hdk/working_jdktools/modules/jpda/test/common/unit/org/apache/harmony/jpda/tests/framework/jdwp/VmMirror.java
(at line 1902)
vars.add(var);
^^^^^^^^^^^^^
Type safety: The method add(Object) belongs to the raw type ArrayList. References to generic
type ArrayList<E> should be parameterized
----------
9. WARNING in /export/users/cc/cc-common/build/checkouts/hdk/working_jdktools/modules/jpda/test/common/unit/org/apache/harmony/jpda/tests/framework/jdwp/VmMirror.java
(at line 2122)
fields.add(superClassFields.toArray()[i]);
^^^^^^^^^^^^^^^^^^^^^^^^^^^^^^^^^^^^^^^^^
Type safety: The method add(Object) belongs to the raw type ArrayList. References to generic
type ArrayList<E> should be parameterized
----------
10. WARNING in /export/users/cc/cc-common/build/checkouts/hdk/working_jdktools/modules/jpda/test/common/unit/org/apache/harmony/jpda/tests/framework/jdwp/VmMirror.java
(at line 2132)
fields.add(field);
^^^^^^^^^^^^^^^^^
Type safety: The method add(Object) belongs to the raw type ArrayList. References to generic
type ArrayList<E> should be parameterized
----------
----------
11. WARNING in /export/users/cc/cc-common/build/checkouts/hdk/working_jdktools/modules/jpda/test/common/unit/org/apache/harmony/jpda/tests/jdwp/DebuggerOnDemand/OnthowDebuggerLaunchDebuggee.java
(at line 94)
class ExceptionForDebugger extends Exception {
^^^^^^^^^^^^^^^^^^^^
The serializable class ExceptionForDebugger does not declare a static final serialVersionUID
field of type long
----------
----------
12. WARNING in /export/users/cc/cc-common/build/checkouts/hdk/working_jdktools/modules/jpda/test/common/unit/org/apache/harmony/jpda/tests/jdwp/Events/ClassUnloadDebuggee.java
(at line 32)
import java.util.LinkedList;
^^^^^^^^^^^^^^^^^^^^
The import java.util.LinkedList is never used
----------
13. WARNING in /export/users/cc/cc-common/build/checkouts/hdk/working_jdktools/modules/jpda/test/common/unit/org/apache/harmony/jpda/tests/jdwp/Events/ClassUnloadDebuggee.java
(at line 97)
boolean isOutOfMemory = false;
^^^^^^^^^^^^^
The local variable isOutOfMemory is never read
----------
14. WARNING in /export/users/cc/cc-common/build/checkouts/hdk/working_jdktools/modules/jpda/test/common/unit/org/apache/harmony/jpda/tests/jdwp/Events/ClassUnloadDebuggee.java
(at line 171)
public Class loadClass(String name) throws ClassNotFoundException {
^^^^^
Type safety: The return type Class for loadClass(String) from the type ClassUnloadDebuggee.CustomLoader
needs unchecked conversion to conform to Class<?> from the type ClassLoader
----------
15. WARNING in /export/users/cc/cc-common/build/checkouts/hdk/working_jdktools/modules/jpda/test/common/unit/org/apache/harmony/jpda/tests/jdwp/Events/ClassUnloadDebuggee.java
(at line 179)
public Class findClass(String name) throws ClassNotFoundException {
^^^^^
Type safety: The return type Class for findClass(String) from the type ClassUnloadDebuggee.CustomLoader
needs unchecked conversion to conform to Class<?> from the type ClassLoader
----------
----------
16. WARNING in /export/users/cc/cc-common/build/checkouts/hdk/working_jdktools/modules/jpda/test/common/unit/org/apache/harmony/jpda/tests/jdwp/Events/CombinedEvents002Test.java
(at line 100)
boolean expectColocatedEvents = (testedMethodStartCodeIndex == testedMethodEndCodeIndex);
^^^^^^^^^^^^^^^^^^^^^
The local variable expectColocatedEvents is never read
----------
----------
17. WARNING in /export/users/cc/cc-common/build/checkouts/hdk/working_jdktools/modules/jpda/test/common/unit/org/apache/harmony/jpda/tests/jdwp/Events/CombinedEvents003Test.java
(at line 53)
private boolean eventMethodExitReceived = false;
^^^^^^^^^^^^^^^^^^^^^^^
The field CombinedEvents003Test.eventMethodExitReceived is never read locally
----------
18. WARNING in /export/users/cc/cc-common/build/checkouts/hdk/working_jdktools/modules/jpda/test/common/unit/org/apache/harmony/jpda/tests/jdwp/Events/CombinedEvents003Test.java
(at line 76)
int EXPECTED_EVENTS_COUNT = EXPECTED_EVENTS_ARRAY.length;
^^^^^^^^^^^^^^^^^^^^^
The local variable EXPECTED_EVENTS_COUNT is never read
----------
----------
19. WARNING in /export/users/cc/cc-common/build/checkouts/hdk/working_jdktools/modules/jpda/test/common/unit/org/apache/harmony/jpda/tests/jdwp/Events/CombinedEventsTest.java
(at line 84)
int EXPECTED_EVENTS_COUNT = EXPECTED_EVENTS_ARRAY.length;
^^^^^^^^^^^^^^^^^^^^^
The local variable EXPECTED_EVENTS_COUNT is never read
----------
20. WARNING in /export/users/cc/cc-common/build/checkouts/hdk/working_jdktools/modules/jpda/test/common/unit/org/apache/harmony/jpda/tests/jdwp/Events/CombinedEventsTest.java
(at line 212)
int EXPECTED_EVENTS_COUNT = EXPECTED_EVENTS_ARRAY.length;
^^^^^^^^^^^^^^^^^^^^^
The local variable EXPECTED_EVENTS_COUNT is never read
----------
21. WARNING in /export/users/cc/cc-common/build/checkouts/hdk/working_jdktools/modules/jpda/test/common/unit/org/apache/harmony/jpda/tests/jdwp/Events/CombinedEventsTest.java
(at line 348)
int EXPECTED_EVENTS_COUNT = EXPECTED_EVENTS_ARRAY.length;
^^^^^^^^^^^^^^^^^^^^^
The local variable EXPECTED_EVENTS_COUNT is never read
----------
22. WARNING in /export/users/cc/cc-common/build/checkouts/hdk/working_jdktools/modules/jpda/test/common/unit/org/apache/harmony/jpda/tests/jdwp/Events/CombinedEventsTest.java
(at line 732)
String failureMessage = "## FAILURE during checking events! !";
^^^^^^^^^^^^^^
The local variable failureMessage is never read
----------
23. WARNING in /export/users/cc/cc-common/build/checkouts/hdk/working_jdktools/modules/jpda/test/common/unit/org/apache/harmony/jpda/tests/jdwp/Events/CombinedEventsTest.java
(at line 894)
String failureMessage = "## FAILURE during checking events !";
^^^^^^^^^^^^^^
The local variable failureMessage is never read
----------
----------
24. WARNING in /export/users/cc/cc-common/build/checkouts/hdk/working_jdktools/modules/jpda/test/common/unit/org/apache/harmony/jpda/tests/jdwp/Events/CombinedEventsTestCase.java
(at line 135)
long methodStartCodeIndex = lineTableReply.getNextValueAsLong();
^^^^^^^^^^^^^^^^^^^^
The local variable methodStartCodeIndex is never read
----------
25. WARNING in /export/users/cc/cc-common/build/checkouts/hdk/working_jdktools/modules/jpda/test/common/unit/org/apache/harmony/jpda/tests/jdwp/Events/CombinedEventsTestCase.java
(at line 187)
long methodStartCodeIndex = reply.getNextValueAsLong();
^^^^^^^^^^^^^^^^^^^^
The local variable methodStartCodeIndex is never read
----------
----------
26. WARNING in /export/users/cc/cc-common/build/checkouts/hdk/working_jdktools/modules/jpda/test/common/unit/org/apache/harmony/jpda/tests/jdwp/Events/ExceptionTest.java
(at line 188)
long frameID = reply.getNextValueAsFrameID();
^^^^^^^
The local variable frameID is never read
----------
----------
27. WARNING in /export/users/cc/cc-common/build/checkouts/hdk/working_jdktools/modules/jpda/test/common/unit/org/apache/harmony/jpda/tests/jdwp/ThreadReference/FramesTest.java
(at line 450)
frames.add(new FrameStruct(frameID, loc));
^^^^^^^^^^^^^^^^^^^^^^^^^^^^^^^^^^^^^^^^^
Type safety: The method add(Object) belongs to the raw type Vector. References to generic
type Vector<E> should be parameterized
----------
----------
28. WARNING in /export/users/cc/cc-common/build/checkouts/hdk/working_jdktools/modules/jpda/test/common/unit/org/apache/harmony/jpda/tests/jdwp/share/JDWPUnitDebuggeeProcessWrapper.java
(at line 233)
argv.add(val);
^^^^^^^^^^^^^
Type safety: The method add(Object) belongs to the raw type Vector. References to generic
type Vector<E> should be parameterized
----------
29. WARNING in /export/users/cc/cc-common/build/checkouts/hdk/working_jdktools/modules/jpda/test/common/unit/org/apache/harmony/jpda/tests/jdwp/share/JDWPUnitDebuggeeProcessWrapper.java
(at line 253)
return (String[])argv.toArray(args);
^^^^^^^^^^^^^^^^^^
Type safety: The method toArray(Object[]) belongs to the raw type Vector. References to generic
type Vector<E> should be parameterized
----------
29 problems (29 warnings)
JPDA exclude list: /export/users/cc/cc-common/build/checkouts/hdk/working_classlib/deploy/build/jdktools.jpda.exclude
Running JPDA tests
Debugger JVM=/export/users/cc/cc-common/build/checkouts/hdk/target/hdk/jdk/jre/bin/java
Debuggee JVM=/export/users/cc/cc-common/build/checkouts/hdk/target/hdk/jdk/jre/bin/java
SAMSA exclude list: /export/users/cc/cc-common/build/checkouts/hdk/working_classlib/deploy/build/jdktools.samsa.exclude
Running SAMSA tests
test.jre.home=/export/users/cc/cc-common/build/checkouts/hdk/target/hdk/jdk/jre
Run jdk/bin/java -version in /export/users/cc/cc-common/build/checkouts/hdk/working_jdktools/build/test_report
java version "1.5.0"
pre-alpha : not complete or compatible
svn = r593442, (Nov  9 2007), Linux/ia32/gcc 4.1.0, debug build
http://harmony.apache.org
Run jdk/bin/javac -version in /export/users/cc/cc-common/build/checkouts/hdk/working_jdktools/build/test_report
Run jdk/bin/javah in /export/users/cc/cc-common/build/checkouts/hdk/working_jdktools/build/test_report
Run jdk/bin/javadoc in /export/users/cc/cc-common/build/checkouts/hdk/working_jdktools/build/test_report
Run jdk/bin/jarsigner in /export/users/cc/cc-common/build/checkouts/hdk/working_jdktools/build/test_report
Run jdk/bin/keytool -help in /export/users/cc/cc-common/build/checkouts/hdk/working_jdktools/build/test_report
Compiling TOOLS tests
Since fork is false, ignoring memoryMaximumSize setting
----------
1. WARNING in /export/users/cc/cc-common/build/checkouts/hdk/working_jdktools/modules/tools/src/test/java/org/apache/harmony/tests/tools/javah/Test/Test01.java
(at line 24)
private static final long xxx2 = 1;
^^^^
The field Test01.xxx2 is never read locally
----------
1 problem (1 warning)
TOOLS exclude list: /export/users/cc/cc-common/build/checkouts/hdk/working_classlib/deploy/build/jdktools.tools.exclude
Running TOOLS tests
test.jre.home=/export/users/cc/cc-common/build/checkouts/hdk/target/hdk/jdk/jre
The test report is in /export/users/cc/cc-common/build/checkouts/hdk/working_jdktools/build/test_report/html/index.html
The execution FAILED with the following exception:
The following error occurred while executing this line:
/export/users/cc/cc-common/adaptors/jdktools-test/adaptor.xml:28: The following error occurred
while executing this line:
/export/users/cc/cc-common/build/checkouts/hdk/working_jdktools/build.xml:242: The following
error occurred while executing this line:
/export/users/cc/cc-common/build/checkouts/hdk/working_jdktools/make/build-test.xml:97: There
were test errors.

***********************************************************
Unit Tests: (161)
        
error: testNestedTypes001 org.apache.harmony.jpda.tests.jdwp.ReferenceType.NestedTypesTest
Unit Test Error Details:	(1)
                
Test: testNestedTypes001Class: org.apache.harmony.jpda.tests.jdwp.ReferenceType.NestedTypesTestorg.apache.harmony.jpda.tests.framework.TestErrorException:
org.apache.harmony.jpda.tests.framework.jdwp.exceptions.TimeoutException: Connection was closed
	at org.apache.harmony.jpda.tests.framework.jdwp.VmMirror.performCommand(VmMirror.java:1590)
	at org.apache.harmony.jpda.tests.jdwp.ReferenceType.NestedTypesTest.testNestedTypes001(NestedTypesTest.java:75)
	at java.lang.reflect.VMReflection.invokeMethod(VMReflection.java)
Caused by: org.apache.harmony.jpda.tests.framework.jdwp.exceptions.TimeoutException: Connection
was closed
	at org.apache.harmony.jpda.tests.framework.jdwp.PacketDispatcher.run(PacketDispatcher.java:600)

***********************************************************
Modifications since last successful build:	(1)
            
add cc-hdk log20071109132557Lbuild.388 11/09/2007 13:25:57hdk

begin 644 execution_log.zip
M4$L#! H    ( &^%:3?\6R3JAQ(  "=_   2    97AE8W5T:6]N7VQO9RYH
M=&UL[5U[<]LXDO_;^A38V;I:N\JBWL]1?.6SG8TSL9VUG,Q>I7(IF(0D)A3!
M!4C;VM1\]^L&2$FD)$JR88^26M6,0X) HX%?O]@$P=XH''M'O5ON3(YZ@6!'
M/4ID./'8J[\-N!\6I?MOUB7M\G_]^K>C0A0X-&1%>>=W"X6B9&$4%+\ZWT+.
M/5F\EU@85TF7B@@:G$:!Y]IPT2&!X%^9'1*?CAEQ?>*. RY"B[R/RV]X4'S'
M[IB'-0,FP@EQV,#UW=#EOM3'0&;@"AEB^Q)[0 *E2#(A2[8-_Q5M/AYSOR1M
MX0:A+,6$7":MA[%'J.\0.J38=V[SV\CUG)(]8O8W'@&9D?.M=,_%-]<??DG&
M6!K3;RS30:$0,AEV"P1_GY@]XI])X=6&O\(-M(4>2-(#N75]*I"T96U.I6![
MC/I%9$06@?L@ H8*-@\FQ:^"%0>NQQ <>S3F3KHDKM+5HRC"]4A=48,9?W-<
M\9F<"*:PA)/NDV=05\+.O@B&E%ZB*UDHJ!,]0VFL3O@X<#W$X.W[TV.BJ[\$
M3R7;HU*RN+.O]([:\]Q46Q4B>21L1A1:).3/WGO?];$[:$9<20;4D^R0N$.?
M"^1HS,9<3"[H@SN.QGVP%@3L DIOBD9Q^DL55RSR^_'UY?GEWXWHH9;3TE>P
M06H\I;AU!):CQ,6P1 ,*-$HC*J!X,JLH2P,!M@@IED[9;30<,G;-AJX,F;"0
MUQ379)^&!.!@I-$^2%W9$W$CYEC4<?:=F-;!KR1=[_]6_%*U;B8!S"8=L'#2
M)3<C!G,=CC@8+J!\=8N6\H#<,H_[0R4'(=00])Z$V.R=ZW]CSCM@QB+7;  <
M 8BJVI#Y3+AVMEKO[(C($8\\!VB2@.)\P$  4&<3)%<45W<08+2N5X%R);G8
MEAL9<%T?)L2GWON9J0>;NH]>[)#<42\"G#>#>5O$L1N-^"%9A_P;*D<7-,B%
M/:[3^^WPXW.@7MM!U+\Z]T'I/;6_L?#4E0$-H46N;E<J]0S^$)'XX3\B%C&E
MW.I44]P"=X,:OE:WGZS5]9\!R&J]LV"E(11-M)?=DW-0["$3^U@^T:2M(0O/
MG?V#@\,TU36_.0J/L 6/_#V+"0GIK<?6&A%5Z\EFI/%3B%D[:R^P6[C1T')V
M[AR2N&!CR?CA@6W^#,#6&ME X#_ KBAN[2K>'\<7KA \W^&W:UD-5E2D\O;J
M<"W QKS[L1!TLM;%3VL]T<^W?VC<.N5J!K<[*C1J<)"+V0^*5^='QJM:J6;Q
M&KC,<S1B,H)[JQ-,0[S6A2%7L[9_\,G]_.B8Z@?%N5+^L8&NY0"M#G]6@[H*
MS]U)>"D4XUR7N/)/&08PI2L?)O0^*7Y'(]\>)0FQ/*@["[$O:C Y>["9RK2\
MYB(A2MA#R"!XFETDW]-M]:W4>C4>8:Y1N-1S_XU!#<GIT^$ ML]#XC"H)1C!
MIQPT!-@'KD^]F,Y'@ $:?C@_)4HZ"1]HL4"1>@KLNY,&4["?8>9"EI25_>![
MG#J;8+R@S/JQ#<%3*PI=SYIE$W]=ANAFD.90Q?RSS^X 3YBZS0SH[J2BGC#S
MG59FYF^!&T9]F(^K*+P:7*@</'FED_/+YY[DS[K';5 #")=<I4IIPM-I%XQN
M-NV[DSAZPK176I7,O ?1K0<V0]$A2$8=[?=#]2@$$\$'X'4$OY>ZSB4/7_/(
M=]:8.K*!JQ,LC(2OS9'N?\#% @\'9"#X6'F^6<W,B$\B&?+Q.R@"1'W&P!2C
MF0<$F -WLOZ=MH+H&^$,>AGCH:+4^^^C91UH6AL)QNZD>IXD&-F,8DHPP*7\
MZ8*1Y6'7!6.5O.Q.!BDE+WQ\BTL0]&FY7,5G2KD24RZO,.$P(HA;3S@:X#"A
M"*9\'WMESH6*</LA%5#'8>>^PQ[(JU=D_NH90)U<RP;42ZW_IEY@.6];>X-5
MV.Y.MB@/V]HZ;!NUK#$0[AW,%YE"C)1BJ![<\)K9S+T#E<KWU[G(+<%.1ZS+
MN5_%00I*C;XWV0B[W<D8/0F[5G/Q&2\Y^^?[LY.;L],O9Q_/+F_Z7TZN/ES>
M %K9\N/KZ^/_M3SF#\/1$A ?I7++^S:F<KN3.%H-VSK,%IZS_"2857<GV?-X
M<*J5A;O$GP2='4O=/ J=6CV[8.EG06=',RQ;H=-:R+#$]P\#ZGJ18!=,2CID
M@,PO?_TK>7U\_N[#]1EQ(E5'C0@/E*^7?R%_^663),PZ?#)=;P_,CB9@MO,X
M"^G-QP.S([BL@FM'$S<+<)U0F7^+7LL^M,<<;OS ('L[I9K<X+Q>X_H=7/MS
MR1["C[BD[QAN8OWA_M+[JL<8O*4<;*]6.YI'V1ZG=C:WF8>3^$'@687:;F8S
MIDFHM5F,=C9\4&"I1X/GIROP>:VOYD*TUMK%/1@#8L=2#S<C'-#TN61)S=E:
MMU1O9)-*<^M5<%VC(@.N*K+#_7@*#W%J#_[\Y^@?X2H7N<]B=95G6I>^8_D+
M"1=8Z>WI[^\_0(LD(_M><)@8^;N@0;!F\6$MFX2B8G@7+X'Q7F8)S$M!6MVQ
M),:3L5M((,8I_3AU_^GS@0(S60@#)W)5FG?Z>Z3J)GUHK*'G'4 ;7P($)S"6
M9!].[JGP85+D0:$0@+N!J2^R!]N+')9^@TN]MQ5?@7F6X:-?TU++"CSWMN2 
M=^.3N&XB/Q:*@Q5WI%YU7/8^V77D^TO>)DLN$S)=J?#VX\6K+1F%8 5<KCK\
MBO^#-$(45IJ*W$(O[#EZ^?05%68V5- <2VN.%6N.GBHU>@LUQ_KHBC"BW@54
M D6PXN47Z/92%+% $GR)E%0.R6M]YR.[I'Q(SG -DCZ\<<>,,(\&DCE=TK0Z
M#2*9_61"=:O<JAJA5+,Z-5,\52L=0Y0:U;JAT;7+9N:I;C5K;5/8=6IYE&J;
M4JI4K4HS=\JKFY)J6Y6V&?#,"53+JK4-350%]*621ZJ^*2FX6ZJWS @"S%2E
M94K,*V84IEFWZDTS3($6U\TP5;?:C5Q*S8TG"C2FG"M3&VM,RVKE$MI*88P0
M:EO-AAG-0Y9RU64;R6R;<U2Y0K"Q"E>:5LV05T#%,T;(&"5SV)E"SI1K:>4[
MA&U8JANCU##F..NF(HRJ.4-0,>?LC%&JFC'A;?!UIF)?4Q8%(WMS\;@Q&<]W
MFEM)@3%MR0]]MW)136-W&Z8BGGK+V.@,W;<8=5$-4Y0Z95,AM#E*[?Q[C3_)
M9AJ3I\JN:0O$!9U'4:HLL;[E)=;WK'^S2>9HFG7$1*9UJ1;#XJ%Z9J*>P)^=
M&C%\YH(@4V&"J?M/H&1.4,MF!+4*XF5FQAM6M9,;)FR<T:B"I-;,#*\.4;49
M\&!X33-14,MJ&O.DY:8Q2C53BM<V%KNLN2G>@E*Y;L9KU:U*.]>L-#;FJ6Q5
M&L:<C2%7"F)0->7>*X8"S[95-:0N%8PYS%$R,^6*E+GQ&<OCMZJY<KY%*M%0
M%JF]+KNYA2EO=<S(9L,R!%W=:G9R(_0MYKMAC%(S/V>S^2.*VKKA;1,.&W,O
M+6//.MIU4RG7EK%THBFK CPU#)DZJV'(%N"S05-^JF7H00XF(PP9E::QP,!4
M<%^W:L:>=U6KQDQ!8]7HEMR//GZ5Q!ONS:VO->#(6E4S^#:;5J-LQEZTK*JA
M9UDMJV;L&7E]6<+B46M3ZL84H6(HO=<$3[U2?K<=7JUM1J=@R@V%[3"\FJ$'
M$$C*S/!PHDP]RF@92H0VIXZC$/+('A7C%TVDVAV^FY0RU7Y:QJ:[Q'?7+,OK
M'U_T7V9=GJ1C.5N8AQS8W+<IS,LE!P9<O<6^WD4=/P?@<^*K/"()V4-X2!RN
MMF[@X0@W,U^WL$^/2U5(7<<2ZZL Z\['[.E+[K)]XR<"ILOP2#'9H<' LMCE
M6_)#UP_,_DR.E<LB;[3+(GJC*"9(E^S;!^2$!Q/A#D<AJ70Z('K5<KFI5IG&
MS?I\$-[C+DQJ#PRJ]K_@@K@@K9YK,U^";!T2"K@$ZIL1N*]EJGLUVF2POT D
M9Y5_(:D:((1%Z@4C"BSAOD\P],!C(<-^\!@Z!:JI)O+.QU<8&AT(+N"V9/^2
MWQ'20>9;!X>X4WKT4')IK5H:VC9:7@N41VWP3M1<I6B-PC#HEI(EPXF'!V>?
M"Z#]@@B>V9X+*D_>XE3J#PP ?F4T)(<0S-1P=#,<S__G LY$@+-15H"V+'+L
M>41=!B/#@,D[YEBYXQL]_[#>7IX7U?=+R(BI?4RT@JMUR107+*=JITX^X)MT
MW6416;S0%T=@7>!'0SYQO7_\9]+3FX[A#B_R:#7M:8-4*2'%6\Y#10(D<D1Z
M^/=(J<K0A1B/J-)[%R8:UT[#>)GOH(7B&3K+?[A@VV$#&GEAO#D:TLN9 F!H
M@1G\K6 (E[8_-S^<]!#"HQ0AE#PDIK]J,N5',,<5S$8;[OI;\"0#9KL#5WU2
M)FMJLOPXI*<[X6(R92KA)R5S"5=V_*D0D)M49QNQ-^V+W(]<>[1(= !F4[\7
MA:\;4#')9]_U01&RG9RKPOC;'W/BIMY@@$YH%/(Q6$RU/4@^?;!?MQS,2A8N
MW/E(Q+X2M1WN7_)Y32G6/"T5-*B=^7#3DP@X(O^"VR.-WURCC:978JBB)O)V
M@GL"@MYG\+]F$L05(JA<R^9P^P5L&W1TBAWIK0Q=]&@XD<#]A(4Y_(%+&2+"
M+\"AZ.NN1LP+K"7F=6_&S??8)OY!WAY?JU"2 (PT#=Q<?90M=S!9TFZU%,5M
M]N!'XN: ,M)SL#59:%W\QB82](V17G+T1=G!/?5.H@Y5M.PEU]/M59%Z_65&
M $^!@"I=WSA $9[O74J P0$"4]Z2L@76IVWGFNV19$,B*)\V)?M@.AQW,  Y
MT%MW+>GR(,.>FCA 1-OD+ZAG2%]]QRL>6.[DPD6%\_+F5O^UBL2M4PBEE0U=
MP%+9ECTU)'[GPAT$=1SU53#JQ<X@VZ$'"I)N <-E]XGK@+. 2[D0#!9M)B"N
M48+CN#+PZ(1@$9@9W M+DGW0(#"5X T3N436$QXS$Q=*2GHW_>,O'Z[?'2')
ME"S!#1@@3\<!&MH1%VXX66B.?6L2>/1%*<J\1*B"! .H-L]LFAC,P\.$]$8<
M5!AF#R(W>?2]VT-=/OI#31-<5M$<:#%4(G$E-3ZL=4B8-;1T14M7M,"$="O5
M6GU)5UH7\.\4\'E%2/6W_^;FYCV&Z/VKD]_Z!PO4$$"A;;SV#TAM9O.1IBTF
M0<B'@@;@+Q5=N*-(P!?+*:JVO82[I%21S&B87,[$5CRH_?G&U*=#=(;+#<&L
MHS1O,PNPFDE0,E-<HOG70HYJ34-,!*SL+,WIM$$>JRBDYGF=U]/5_<VS.]\D
MC]^Q8Y[;<;R%A^,.Y[,'V0[3LYMNM)SEA4  A >=."FB<W[^8"!U\EO<=Z2B
M@-2EA*WOQ5[\'0UM*/Z8+]$^'\MZ^O"+^N#6T1^699'BVQX&84FE'"Y\?N\G
M7^N0:3;VE'0(]J^]O;_KNT66$@NX$B4)][DV.$.V\/;V3O H[2,$NTOL/.XV
M'<EL8[6G9@AM]<%,O4,.YI:'(RTM$'MG6CH,DQG@2:[9F-\Q DX.;A&4&U]J
M4/:*&FIH<:8.4D/#WI3#1=,K0X='V?[@_AGH0NL^@SL/Q2C6U0&%*Y+[:QAI
MIB&*&C2[&4'0JL0ND5RN8T0"<T,31#)M]4[0T/I<;PE-4TSOVR.X%3] 0I2<
M]*_UYA,9$L"@[7$?9FKZ^5&HC6RK&5NLK4(?!]&D_C =,64J0U#EA[:"[ST>
MXBSJN<LPJE!9B(7VBI)Y ]U^*F\0FT)A'&>EB"A3,<U: EM98DGDF&8^)US<
MF\7&'Y/(>+Y'-;VK5>D-@I>CS=K(?,^H=#H%!6%$=R_30DM:NM],@GF#KW;>
M7%V]Z\]_MC-^FWQ6H_&?[VBNVQ%!GTEAZVT1L*]E^R'H$>O**D>FOK"H_I0K
M^1]F6[%Q:FIK?K7%S,/#0Y6\(I5UVQY,?TMWE=%;I,:,*9*/WP UV96 [%>2
M/0G6;4F@A?(EGGWHOR_U[".K;,_Y[&.#Y^>S*<#/!\CX43H$('TTAGI+ZCX%
MT/.>GV^\+JEJ56IF'GIWK%K^(IF->2I;Y6K[:0_Q=&!3!&M59.,@G&!1G!"<
M%F3/,1E7U(%@MZ#YUV<P"D%]J7<,!TZ[I-ZIUL=I:4$%11Z(;H.J^1PA:@D_
M>%YR<5\O"P\+!0FWW.&4[P(XH-F)G@4U-4(G @L%9!0=4Z0".[VV0_MGE9'D
MF.Q4^_TEVVIU59.Y"SCOA-MV) 2HW/W(]:84X7*(L1(:R&XA9_34H7"/(>14
MZ16723%^@[Q;;>N]70SWO/F\:R[JU3^/#?5I]EF\H!CJM!0_$!?=XQ\E<UH5
MK$*O1(]Z);#B\/>6.Q/X!X7DZ/\!4$L! A0#"@    @ ;X5I-_Q;).J'$@  
M)W\  !(              *2!     &5X96-U=&EO;E]L;V<N:'1M;%!+!08 
1     0 ! $    "W$@     ! 
end

Mime
View raw message