harmony-alerts mailing list archives

Site index · List index
Message view « Date » · « Thread »
Top « Date » · « Thread »
From nom...@intel.com
Subject [build-test alert] FAILED Linux x86_64: ehwa
Date Wed, 07 Nov 2007 06:35:48 GMT
svn.revision=592322
BUILD FAILED:
	Ant Error Message:
/export/users/cc/cc-suites/scripts/cc-exec-adaptor.xml:104: The following error occurred while
executing this line: /export/users/cc/cc-suites/adaptors/ehwa/adaptor.xml:116: The following
error occurred while executing this line: /export/users/cc/cc-suites/scripts/framework.xml:1069:
Java returned: 1

Date of build:	2007-11-07 12:25:46 +0600
Time to build:	9 minutes 55 seconds
Last changed:	11/07/2007 02:53:26
Last log entry:	snapshot

***********************************************************
Errors/Warnings:	(91)
            
[exec] Result: 25
[echo]
[echo]
[echo] ========================== EHWA.log =======================
[echo]
[echo] Eclipse Home = /export/users/cc/cc-suites/build/libs/eclipse-3.2.1-lnx-x86_64/eclipse
[echo] Tested JRE = /export/users/cc/cc-suites/build/checkouts/snapshot/hdk/jdk/jre
[echo] Tested JRE options for Eclipse launching =
[echo] Delay factor = 2
[echo]
[echo] --- Automated EHWA scenario for Eclipse 3.2.1 ---
[echo]
[echo] Start:
[echo]
[echo] Run Eclipse
[echo] Select workspace
[echo]  wait window 'Workspace Launcher' to appear ...
[echo]  window 'Workspace Launcher' appeared
[echo] Press 'OK' button
[echo]  wait window '' to close ...
[echo]  window '' successfully closed
[echo] Close Welcome page
[echo]  wait window 'Java - Eclipse SDK' to appear ...
[echo]  window 'Java - Eclipse SDK' appeared
[echo] Create new project
[echo]  wait window 'New' to appear ...
[echo]  window 'New' appeared
[echo] Select new Java project
[echo]  wait window 'New Java Project' to appear ...
[echo]  window 'New Java Project' appeared
[echo] Type 'EHWA' as project name
[echo] Press 'Finish' button
[echo]  wait window 'New Java Project ' to close ...
[echo]  window 'New Java Project ' successfully closed
[echo] Create new Java class
[echo]  wait window 'Java - Eclipse SDK' to appear ...
[echo]  window 'Java - Eclipse SDK' appeared
[echo]  wait window 'New' to appear ...
[echo]  window 'New' appeared
[echo] Select new Java class for 'EHWA' project
[echo]  wait window 'Java Class' to appear ...
[echo]  window 'Java Class' appeared
[echo] Type 'EHWA' as class name, press 'Finish' button
[echo] Select the 'public static void main(String[] args)' checkbox
[echo] Press 'Finish' button
[echo]  wait window 'New Java Class ' to close ...
[echo]  window 'New Java Class ' successfully closed
[echo] Put System.out.println("Hello, world"); into EHWA class
[echo]  wait window 'Java - EHWA.java - Eclipse SDK' to appear ...
[echo]  window 'Java - EHWA.java - Eclipse SDK' appeared
[echo] Save EHWA class
[echo] Run EHWA class
[echo] Exit Eclipse
[echo]  wait window 'Java - EHWA.java - Eclipse SDK' to appear ...
[echo]  window 'Java - EHWA.java - Eclipse SDK' appeared
[echo]  wait window 'Java - EHWA.java - Eclipse SDK ' to close ...
[echo] ERROR: Failed to close 'Java - EHWA.java - Eclipse SDK ' window during 240 sec!
[echo]
[echo] Print error screen picture:
[echo] 	Picture was saved to /export/users/cc/cc-suites/build/results/ehwa/20071107_1225/error.xwd.
Use 'xwud -in error.xwd' to view the saved file.
[echo]
[echo] Kill Eclipse:
[echo] 	Found 1 Eclipse processes
[echo] 	Process 0:
[echo] 	Eclipse process was killed
[echo]
[echo]
[echo] EHWA FAILED!
[echo]
[echo] ======================= eclipse.log =======================
[echo] Install location:
[echo]     file:/export/users/cc/cc-suites/build/libs/eclipse-3.2.1-lnx-x86_64/eclipse/
[echo] Configuration file:
[echo]     file:/export/users/cc/cc-suites/build/libs/eclipse-3.2.1-lnx-x86_64/eclipse/configuration/config.ini
loaded
[echo] Configuration location:
[echo]     file:/export/users/cc/cc-suites/build/libs/eclipse-3.2.1-lnx-x86_64/eclipse/configuration/
[echo] Framework located:
[echo]     file:/export/users/cc/cc-suites/build/libs/eclipse-3.2.1-lnx-x86_64/eclipse/plugins/org.eclipse.osgi_3.2.1.R32x_v20060919.jar
[echo] Framework classpath:
[echo]     file:/export/users/cc/cc-suites/build/libs/eclipse-3.2.1-lnx-x86_64/eclipse/plugins/org.eclipse.osgi_3.2.1.R32x_v20060919.jar
[echo] Debug options:
[echo]     file:/export/users/cc/cc-suites/tests/ehwa/.options not found
[echo] Time to load bundles: 110
[echo] Starting application: 4504
[echo] Application Started: 59231
[echo]
[echo] ===========================================================
BUILD FAILED
/export/users/cc/cc-suites/tests/ehwa/ehwa_run.xml:209: EHWA FAILED!
Total time: 9 minutes 54 seconds
The execution FAILED with the following exception:
The following error occurred while executing this line:
/export/users/cc/cc-suites/adaptors/ehwa/adaptor.xml:116: The following error occurred while
executing this line:
/export/users/cc/cc-suites/scripts/framework.xml:1069: Java returned: 1

***********************************************************
Unit Tests: (0)
        
No Tests Run: This project doesn't have any tests

***********************************************************
Modifications since last successful build:	(1)
            
add cc-snapshot log20071107025326Lbuild.31 11/07/2007 02:53:26snapshot

begin 644 execution_log.zip
M4$L#! H    ( '9D9S>! BQX) 8  "T@   2    97AE8W5T:6]N7VQO9RYH
M=&ULU5I;;]I*$'YN?L6<2D>T4K&!7-K0-%*:BWK3:412]2&JHF4]P":+U_*N
MN9Q??V;7AN($&TR3M,=*4(AG9[_Y/+<=.!B8H3P\Z*I@>G@0Q7AXP$";J<1W
MM9X*35V+?[$-;QI_OZT=;B51P S6]2AL;VW%";V"O:YNV(C]@/>)D$%/2)+'
MP9A=DX W&<J<3.[-/0WIW\@'Z@?4ZW7H)"&<?OA^!)ICR&*A0(5@!@@]):4:
MB[ /7(4]T4]B9@3=HT6%"B]1&PS@4^<4WH&/DTC%QD\TQMKGG'[J.A$&M=^U
M9OA\@/Q6)4;[.F21'BCC#X);_\;^QKC.)BJRD#1M5BA]RJ6(-,('-<1U0$G1
MU3ZFB^K;7LMKUF4XJ4_>[%WO[<QN%.YV@I)-H<>X43'MUBJC?K.K^%$[.CV6
M&"5,>Y68<21ZQ/-*T<SF=>6\$3%+3Z78[8XELM ZUNS9Y!W,\[S"I1=LA,!H
M030%U2M08-0#/68_I]?K,GZ;1$NP63AD%KU:J_;>@(U0_<0XK@*4:-#Y(!H+
M)! Q6D></@H,7\7]^3-7NB_^*$!<Q>A1\C-B>"]:?RNP-+__=DB>1F/WT86A
MUL&A&BU&Z5C%MSIB')=%Z(8&V#1$V*F4^7/UY7D#DLB5/K!+[2:E^>(X1N;0
MQ*@3:?0"JF7+KH:W)) MHQI#;]JK^<]TIV:T&HW7S6;C]76SU=HMSF.&Q29?
M=PMES\ELC:] (_X*%M_NYDG5I\H>0X"&";GTZ4^04]GL=+YVVG!&0L0#93(N
M%?E [1-)0MTA]VZROS/_N#CY##6@CB%08PB2V-+>VFD0;OX7, .> W6=^>.U
M<U0ODB!%B"2XO?0I.C =9U0;[A!:R%CN1D1 C-<C0[PA:LWZ6%R9BE6^*[Q@
MSFN1P'HX%V\\;=/RN[HVZX<S2R5+0CZP+E/"U]WN:@-F;<M[1"W2T,5WOO%=
MQ.-(=-+5]W#!W=Y@H>O%,P#%VBG!<K.0C8N]><R$F05D[?M\P1?'-<8U&]<L
MBI"5)]%2%>EZ#(K3%Z4D#;6OGVO038RA_FQ-P+6?:6<M=#70">>T62^1<IJN
M#(HW.W::OZ/D-L@BR@OK OMT+^]59G*9BI5,IE4)0AQ34E,WU@O61/P/CBM#
M=&M68LJ\T6)R-E4'EJX[3]=M@O*.@I60+Z<1%3(;^B2LYXA#-BSQ@,R+ST0H
M]*"J)]\%"55=>XF":K[^TW.<&BX96?.'N_L&+IP_B#7=.6RM8]ABV_18H9&2
M;HM,YGP58\4I.;9*-N,_6UHU/E+8-CI>$>)*49 Q8*=)M2CI2L%!&^K'.8R4
M"&#(1/CBPMA&\>H'L+BO7];264)731X[%!T;FP?B;'FE,#Q/#%Q,J0\:>M1 
M>:XSE>&+YQ]02O7*EG09/'_Y%NC?*NU--@K4Y;WYQD%;I&YU -AAS3IFS&>0
M*^1.)V3MR@;ISR:E"KIUW?.A#VO5.]=SZ\J <4S93?,8,81(<)/$6-('/SM/
M18@2#9J<):B<J^\<<1T ;S(.//AF"9B,DP#J(H3Y#<?H2% 8VZR4;FJKA+>!
MT9^%E#-"R\P\4TD84#6:<4]YW^8,+/'T9^>I##3*%-]1Z'B\)5!E.6B#PZB-
MS+.CCU].3TI<H_K9&68CL8W.SA]#*B7$OU3<3;1*#O5TN8],'FB05MQEY:;0
M;LLG Y6?[J7O/*J0Q \+RLX4.<Q/3V8>=^&V9S'U'_;(FT+$X.D01C+IBU#?
M&W=G ZS.=FMR/:(TM-?8;^Y3FHW7,,+5N8B9P?_1C!/L)OW9$.?7#%@8_WJS
MJ5"H##7)E#&+&U0Q=%V]=6UJ_\) HFX#58'RB8PM<52>J0M-?1QV=AL[A4N.
M?DJFR\GG8'>_M=U\T.GARJMXXOG^V\<O)UEBSMU8C_#%SX_;K<9^.Y?HB[>]
M5)1WP7ZNTH9]&(HP(:6PNV-;!Q4&>FOKDBJK'=PFCKQ4(;4:9G#G<V6<<(S2
M='.9O^'Z",5Y$E,K!>.!/<9E&NFV&0CMIL;MK1)36< BH^+,VNR=,[;9W&O#
M(^Q(C8^(B-[>+,[3W1I[Q*UKQ6*D=B>TCM3<.O#9X8'OO@W@I]\,\-W7!/X#
M4$L! A0#"@    @ =F1G-X$"+'@D!@  +2   !(              *2!    
I &5X96-U=&EO;E]L;V<N:'1M;%!+!08      0 ! $    !4!@     ! 
end

Mime
View raw message