harmony-alerts mailing list archives

Site index · List index
Message view « Date » · « Thread »
Top « Date » · « Thread »
From nom...@intel.com
Subject [build-test alert] FAILED Linux x86: jdktools-test debug
Date Tue, 06 Nov 2007 12:28:14 GMT

BUILD FAILED:
	Ant Error Message:
/export/users/cc/cc-common/scripts/cc-exec-adaptor.xml:104: The following error occurred while
executing this line: /export/users/cc/cc-common/adaptors/jdktools-test/adaptor.xml:28: The
following error occurred while executing this line: /export/users/cc/cc-common/build/checkouts/hdk/working_jdktools/build.xml:242:
The following error occurred while executing this line: /export/users/cc/cc-common/build/checkouts/hdk/working_jdktools/make/build-test.xml:97:
There were test errors.

Date of build:	2007-11-06 18:08:40 +0600
Time to build:	19 minutes 25 seconds
Last changed:	11/06/2007 16:10:32
Last log entry:	hdk

***********************************************************
Errors/Warnings:	(226)
            
Result: 1
========================================
Testing jdktools binaries...
========================================
Compiling JPDA tests
Since fork is false, ignoring memoryMaximumSize setting
----------
1. WARNING in /export/users/cc/cc-common/build/checkouts/hdk/working_jdktools/modules/jpda/test/common/unit/org/apache/harmony/jpda/tests/framework/DebuggeeRegister.java
(at line 58)
registered.add(debuggee);
^^^^^^^^^^^^^^^^^^^^^^^^
Type safety: The method add(Object) belongs to the raw type LinkedList. References to generic
type LinkedList<E> should be parameterized
----------
----------
2. WARNING in /export/users/cc/cc-common/build/checkouts/hdk/working_jdktools/modules/jpda/test/common/unit/org/apache/harmony/jpda/tests/framework/TestOptions.java
(at line 505)
internalProperties.put(name, value);
^^^^^^^^^^^^^^^^^^^^^^^^^^^^^^^^^^^
Type safety: The method put(Object, Object) belongs to the raw type HashMap. References to
generic type HashMap<K,V> should be parameterized
----------
----------
3. WARNING in /export/users/cc/cc-common/build/checkouts/hdk/working_jdktools/modules/jpda/test/common/unit/org/apache/harmony/jpda/tests/framework/jdwp/PacketDispatcher.java
(at line 114)
eventQueue.add(eventPacket);
^^^^^^^^^^^^^^^^^^^^^^^^^^^
Type safety: The method add(Object) belongs to the raw type List. References to generic type
List<E> should be parameterized
----------
4. WARNING in /export/users/cc/cc-common/build/checkouts/hdk/working_jdktools/modules/jpda/test/common/unit/org/apache/harmony/jpda/tests/framework/jdwp/PacketDispatcher.java
(at line 249)
replies.put(new Integer(replyPacket.getId()),
replyPacket);
^^^^^^^^^^^^^^^^^^^^^^^^^^^^^^^^^^^^^^^^^^^^^^^^^^^^^^^^^^^^^^^^^^^^^^^^^^^^^^^^^^^^^^^^^^
Type safety: The method put(Object, Object) belongs to the raw type Hashtable. References
to generic type Hashtable<K,V> should be parameterized
----------
5. WARNING in /export/users/cc/cc-common/build/checkouts/hdk/working_jdktools/modules/jpda/test/common/unit/org/apache/harmony/jpda/tests/framework/jdwp/PacketDispatcher.java
(at line 284)
commands.put(Id, command);
^^^^^^^^^^^^^^^^^^^^^^^^^
Type safety: The method put(Object, Object) belongs to the raw type Hashtable. References
to generic type Hashtable<K,V> should be parameterized
----------
6. WARNING in /export/users/cc/cc-common/build/checkouts/hdk/working_jdktools/modules/jpda/test/common/unit/org/apache/harmony/jpda/tests/framework/jdwp/PacketDispatcher.java
(at line 355)
commands.put(Id, command);
^^^^^^^^^^^^^^^^^^^^^^^^^
Type safety: The method put(Object, Object) belongs to the raw type Hashtable. References
to generic type Hashtable<K,V> should be parameterized
----------
----------
7. WARNING in /export/users/cc/cc-common/build/checkouts/hdk/working_jdktools/modules/jpda/test/common/unit/org/apache/harmony/jpda/tests/framework/jdwp/VmMirror.java
(at line 1834)
frames.add(frame);
^^^^^^^^^^^^^^^^^
Type safety: The method add(Object) belongs to the raw type ArrayList. References to generic
type ArrayList<E> should be parameterized
----------
8. WARNING in /export/users/cc/cc-common/build/checkouts/hdk/working_jdktools/modules/jpda/test/common/unit/org/apache/harmony/jpda/tests/framework/jdwp/VmMirror.java
(at line 1902)
vars.add(var);
^^^^^^^^^^^^^
Type safety: The method add(Object) belongs to the raw type ArrayList. References to generic
type ArrayList<E> should be parameterized
----------
9. WARNING in /export/users/cc/cc-common/build/checkouts/hdk/working_jdktools/modules/jpda/test/common/unit/org/apache/harmony/jpda/tests/framework/jdwp/VmMirror.java
(at line 2122)
fields.add(superClassFields.toArray()[i]);
^^^^^^^^^^^^^^^^^^^^^^^^^^^^^^^^^^^^^^^^^
Type safety: The method add(Object) belongs to the raw type ArrayList. References to generic
type ArrayList<E> should be parameterized
----------
10. WARNING in /export/users/cc/cc-common/build/checkouts/hdk/working_jdktools/modules/jpda/test/common/unit/org/apache/harmony/jpda/tests/framework/jdwp/VmMirror.java
(at line 2132)
fields.add(field);
^^^^^^^^^^^^^^^^^
Type safety: The method add(Object) belongs to the raw type ArrayList. References to generic
type ArrayList<E> should be parameterized
----------
----------
11. WARNING in /export/users/cc/cc-common/build/checkouts/hdk/working_jdktools/modules/jpda/test/common/unit/org/apache/harmony/jpda/tests/jdwp/DebuggerOnDemand/OnthowDebuggerLaunchDebuggee.java
(at line 94)
class ExceptionForDebugger extends Exception {
^^^^^^^^^^^^^^^^^^^^
The serializable class ExceptionForDebugger does not declare a static final serialVersionUID
field of type long
----------
----------
12. WARNING in /export/users/cc/cc-common/build/checkouts/hdk/working_jdktools/modules/jpda/test/common/unit/org/apache/harmony/jpda/tests/jdwp/Events/ClassUnloadDebuggee.java
(at line 32)
import java.util.LinkedList;
^^^^^^^^^^^^^^^^^^^^
The import java.util.LinkedList is never used
----------
13. WARNING in /export/users/cc/cc-common/build/checkouts/hdk/working_jdktools/modules/jpda/test/common/unit/org/apache/harmony/jpda/tests/jdwp/Events/ClassUnloadDebuggee.java
(at line 97)
boolean isOutOfMemory = false;
^^^^^^^^^^^^^
The local variable isOutOfMemory is never read
----------
14. WARNING in /export/users/cc/cc-common/build/checkouts/hdk/working_jdktools/modules/jpda/test/common/unit/org/apache/harmony/jpda/tests/jdwp/Events/ClassUnloadDebuggee.java
(at line 171)
public Class loadClass(String name) throws ClassNotFoundException {
^^^^^
Type safety: The return type Class for loadClass(String) from the type ClassUnloadDebuggee.CustomLoader
needs unchecked conversion to conform to Class<?> from the type ClassLoader
----------
15. WARNING in /export/users/cc/cc-common/build/checkouts/hdk/working_jdktools/modules/jpda/test/common/unit/org/apache/harmony/jpda/tests/jdwp/Events/ClassUnloadDebuggee.java
(at line 179)
public Class findClass(String name) throws ClassNotFoundException {
^^^^^
Type safety: The return type Class for findClass(String) from the type ClassUnloadDebuggee.CustomLoader
needs unchecked conversion to conform to Class<?> from the type ClassLoader
----------
----------
16. WARNING in /export/users/cc/cc-common/build/checkouts/hdk/working_jdktools/modules/jpda/test/common/unit/org/apache/harmony/jpda/tests/jdwp/Events/CombinedEvents002Test.java
(at line 100)
boolean expectColocatedEvents = (testedMethodStartCodeIndex == testedMethodEndCodeIndex);
^^^^^^^^^^^^^^^^^^^^^
The local variable expectColocatedEvents is never read
----------
----------
17. WARNING in /export/users/cc/cc-common/build/checkouts/hdk/working_jdktools/modules/jpda/test/common/unit/org/apache/harmony/jpda/tests/jdwp/Events/CombinedEvents003Test.java
(at line 53)
private boolean eventMethodExitReceived = false;
^^^^^^^^^^^^^^^^^^^^^^^
The field CombinedEvents003Test.eventMethodExitReceived is never read locally
----------
18. WARNING in /export/users/cc/cc-common/build/checkouts/hdk/working_jdktools/modules/jpda/test/common/unit/org/apache/harmony/jpda/tests/jdwp/Events/CombinedEvents003Test.java
(at line 76)
int EXPECTED_EVENTS_COUNT = EXPECTED_EVENTS_ARRAY.length;
^^^^^^^^^^^^^^^^^^^^^
The local variable EXPECTED_EVENTS_COUNT is never read
----------
----------
19. WARNING in /export/users/cc/cc-common/build/checkouts/hdk/working_jdktools/modules/jpda/test/common/unit/org/apache/harmony/jpda/tests/jdwp/Events/CombinedEventsTest.java
(at line 84)
int EXPECTED_EVENTS_COUNT = EXPECTED_EVENTS_ARRAY.length;
^^^^^^^^^^^^^^^^^^^^^
The local variable EXPECTED_EVENTS_COUNT is never read
----------
20. WARNING in /export/users/cc/cc-common/build/checkouts/hdk/working_jdktools/modules/jpda/test/common/unit/org/apache/harmony/jpda/tests/jdwp/Events/CombinedEventsTest.java
(at line 212)
int EXPECTED_EVENTS_COUNT = EXPECTED_EVENTS_ARRAY.length;
^^^^^^^^^^^^^^^^^^^^^
The local variable EXPECTED_EVENTS_COUNT is never read
----------
21. WARNING in /export/users/cc/cc-common/build/checkouts/hdk/working_jdktools/modules/jpda/test/common/unit/org/apache/harmony/jpda/tests/jdwp/Events/CombinedEventsTest.java
(at line 348)
int EXPECTED_EVENTS_COUNT = EXPECTED_EVENTS_ARRAY.length;
^^^^^^^^^^^^^^^^^^^^^
The local variable EXPECTED_EVENTS_COUNT is never read
----------
22. WARNING in /export/users/cc/cc-common/build/checkouts/hdk/working_jdktools/modules/jpda/test/common/unit/org/apache/harmony/jpda/tests/jdwp/Events/CombinedEventsTest.java
(at line 732)
String failureMessage = "## FAILURE during checking events! !";
^^^^^^^^^^^^^^
The local variable failureMessage is never read
----------
23. WARNING in /export/users/cc/cc-common/build/checkouts/hdk/working_jdktools/modules/jpda/test/common/unit/org/apache/harmony/jpda/tests/jdwp/Events/CombinedEventsTest.java
(at line 894)
String failureMessage = "## FAILURE during checking events !";
^^^^^^^^^^^^^^
The local variable failureMessage is never read
----------
----------
24. WARNING in /export/users/cc/cc-common/build/checkouts/hdk/working_jdktools/modules/jpda/test/common/unit/org/apache/harmony/jpda/tests/jdwp/Events/CombinedEventsTestCase.java
(at line 135)
long methodStartCodeIndex = lineTableReply.getNextValueAsLong();
^^^^^^^^^^^^^^^^^^^^
The local variable methodStartCodeIndex is never read
----------
25. WARNING in /export/users/cc/cc-common/build/checkouts/hdk/working_jdktools/modules/jpda/test/common/unit/org/apache/harmony/jpda/tests/jdwp/Events/CombinedEventsTestCase.java
(at line 187)
long methodStartCodeIndex = reply.getNextValueAsLong();
^^^^^^^^^^^^^^^^^^^^
The local variable methodStartCodeIndex is never read
----------
----------
26. WARNING in /export/users/cc/cc-common/build/checkouts/hdk/working_jdktools/modules/jpda/test/common/unit/org/apache/harmony/jpda/tests/jdwp/Events/ExceptionTest.java
(at line 188)
long frameID = reply.getNextValueAsFrameID();
^^^^^^^
The local variable frameID is never read
----------
----------
27. WARNING in /export/users/cc/cc-common/build/checkouts/hdk/working_jdktools/modules/jpda/test/common/unit/org/apache/harmony/jpda/tests/jdwp/ThreadReference/FramesTest.java
(at line 450)
frames.add(new FrameStruct(frameID, loc));
^^^^^^^^^^^^^^^^^^^^^^^^^^^^^^^^^^^^^^^^^
Type safety: The method add(Object) belongs to the raw type Vector. References to generic
type Vector<E> should be parameterized
----------
----------
28. WARNING in /export/users/cc/cc-common/build/checkouts/hdk/working_jdktools/modules/jpda/test/common/unit/org/apache/harmony/jpda/tests/jdwp/share/JDWPUnitDebuggeeProcessWrapper.java
(at line 233)
argv.add(val);
^^^^^^^^^^^^^
Type safety: The method add(Object) belongs to the raw type Vector. References to generic
type Vector<E> should be parameterized
----------
29. WARNING in /export/users/cc/cc-common/build/checkouts/hdk/working_jdktools/modules/jpda/test/common/unit/org/apache/harmony/jpda/tests/jdwp/share/JDWPUnitDebuggeeProcessWrapper.java
(at line 253)
return (String[])argv.toArray(args);
^^^^^^^^^^^^^^^^^^
Type safety: The method toArray(Object[]) belongs to the raw type Vector. References to generic
type Vector<E> should be parameterized
----------
29 problems (29 warnings)
JPDA exclude list: /export/users/cc/cc-common/build/checkouts/hdk/working_classlib/deploy/build/jdktools.jpda.exclude
Running JPDA tests
Debugger JVM=/export/users/cc/cc-common/build/checkouts/hdk/target/hdk/jdk/jre/bin/java
Debuggee JVM=/export/users/cc/cc-common/build/checkouts/hdk/target/hdk/jdk/jre/bin/java
SAMSA exclude list: /export/users/cc/cc-common/build/checkouts/hdk/working_classlib/deploy/build/jdktools.samsa.exclude
Running SAMSA tests
test.jre.home=/export/users/cc/cc-common/build/checkouts/hdk/target/hdk/jdk/jre
Run jdk/bin/java -version in /export/users/cc/cc-common/build/checkouts/hdk/working_jdktools/build/test_report
java version "1.5.0"
pre-alpha : not complete or compatible
svn = r592353, (Nov  6 2007), Linux/ia32/gcc 4.1.0, debug build
http://harmony.apache.org
Run jdk/bin/javac -version in /export/users/cc/cc-common/build/checkouts/hdk/working_jdktools/build/test_report
Run jdk/bin/javah in /export/users/cc/cc-common/build/checkouts/hdk/working_jdktools/build/test_report
Run jdk/bin/javadoc in /export/users/cc/cc-common/build/checkouts/hdk/working_jdktools/build/test_report
Run jdk/bin/jarsigner in /export/users/cc/cc-common/build/checkouts/hdk/working_jdktools/build/test_report
Run jdk/bin/keytool -help in /export/users/cc/cc-common/build/checkouts/hdk/working_jdktools/build/test_report
Compiling TOOLS tests
Since fork is false, ignoring memoryMaximumSize setting
----------
1. WARNING in /export/users/cc/cc-common/build/checkouts/hdk/working_jdktools/modules/tools/src/test/java/org/apache/harmony/tests/tools/javah/Test/Test01.java
(at line 24)
private static final long xxx2 = 1;
^^^^
The field Test01.xxx2 is never read locally
----------
1 problem (1 warning)
TOOLS exclude list: /export/users/cc/cc-common/build/checkouts/hdk/working_classlib/deploy/build/jdktools.tools.exclude
Running TOOLS tests
test.jre.home=/export/users/cc/cc-common/build/checkouts/hdk/target/hdk/jdk/jre
The test report is in /export/users/cc/cc-common/build/checkouts/hdk/working_jdktools/build/test_report/html/index.html
The execution FAILED with the following exception:
The following error occurred while executing this line:
/export/users/cc/cc-common/adaptors/jdktools-test/adaptor.xml:28: The following error occurred
while executing this line:
/export/users/cc/cc-common/build/checkouts/hdk/working_jdktools/build.xml:242: The following
error occurred while executing this line:
/export/users/cc/cc-common/build/checkouts/hdk/working_jdktools/make/build-test.xml:97: There
were test errors.

***********************************************************
Unit Tests: (161)
        
error: testNestedTypes001 org.apache.harmony.jpda.tests.jdwp.ReferenceType.NestedTypesTest
Unit Test Error Details:	(1)
                
Test: testNestedTypes001Class: org.apache.harmony.jpda.tests.jdwp.ReferenceType.NestedTypesTestorg.apache.harmony.jpda.tests.framework.TestErrorException:
org.apache.harmony.jpda.tests.framework.jdwp.exceptions.TimeoutException: Connection was closed
	at org.apache.harmony.jpda.tests.framework.jdwp.VmMirror.performCommand(VmMirror.java:1590)
	at org.apache.harmony.jpda.tests.jdwp.ReferenceType.NestedTypesTest.testNestedTypes001(NestedTypesTest.java:75)
	at java.lang.reflect.VMReflection.invokeMethod(VMReflection.java)
Caused by: org.apache.harmony.jpda.tests.framework.jdwp.exceptions.TimeoutException: Connection
was closed
	at org.apache.harmony.jpda.tests.framework.jdwp.PacketDispatcher.run(PacketDispatcher.java:600)

***********************************************************
Modifications since last successful build:	(1)
            
add cc-hdk log20071106161032Lbuild.374 11/06/2007 16:10:32hdk

begin 644 execution_log.zip
M4$L#! H    ( (.39C=?.BY@D!(  "A_   2    97AE8W5T:6]N7VQO9RYH
M=&UL[5U[<]LXDO_;^A38V;I:N\JBWL]1?.6SG8TSL9VUG,Q>I7(IF(0D)A3!
M!4C;VM1\]^L&2$FD)$JR88^26M6,PP?0:/2ON]%H@F!O%(Z]H]XM=R9'O4"P
MHQXE,IQX[-7?!MP/B]+]-^N2=OF_?OW;42$*'!JRHKSSNX5"4;(P"HI?G6\A
MYYXLWDN\&!=)7Q415#B- L^UX:9# L&_,CLD/ATSXOK$'0=<A!9Y'U^_X4'Q
M';MC'I8,F @GQ&$#UW=#E_M2'P.9@2MDB/5+[ $)E"+)A"S9-OQ7M/EXS/V2
MM(4;A+(4$W*9M![&'J&^0^B08MNYU6\CUW-*]HC9WW@$9$;.M](]%]]<?_@E
MZ6-I3+^Q3 .%0LADV"T0_'UB]HA_)H57&_X*-U 76B!)"^36]:E TI:U.96"
M[3'J%Y$1603N@P@8*M@\F!2_"E8<N!Y#<.S1F#OI*W&1KNY%$>Y'ZH[JS/B;
MXXK/Y$0PA26<=)\L05T(&_LB&%)ZB:9DH:!.M(326)WP<>!ZB,';]Z?'1!=_
M"9Y*MD>E9'%C7^D=M>>YJ;8J1/)(V(PHM$C(G[WUONMC<U"-N)(,J"?9(7&'
M/A?(T9B-N9A<T =W'(W[X"T(^ 74WA2-XO27NERQR._'UY?GEW\W8H=:3TM?
MP0>I_I3BVA%XCA(7PQ(-*- HC:B RY-905D:"/!%2+%TRFZCX9"Q:S9T9<B$
MA;RFN";[-"0 !R.-]D'JSIZ(*S''HHZS[\2T#GXEZ7+_M^*7*G4S"4":=,#"
M29?<C!C(.AQQ<%Q ^>H6/>4!N64>]X=*#T(H(>@]";':.]?_QIQWP(Q%KMD 
M. (05;$A\YEP[6RQWMD1D2,>>0[0) %%>4!' %!G$R177*[N(,#H7:\"-93D
M8EMN9,!U?1"(3[WW,U<//G4?1[%#<D>]"'#>#.9M$<=F-.*'9!WR;Z@<7= @
M%_:X3.^WPX_/@7IM!U'_ZMP'I??4_L;"4U<&-(0:N;9=J=0S^$-$XH?_B%C$
ME'&K4TUQ"]P-6OA:VWZR5==_!B"K]<Z"EX90-+%>=D_.P;"'3.SC]8DF;0U9
M>.[L'QP<IJFN^<U1>(0O>.3O65Q(2&\]MM:)J%)/=B.-GT+-VEE_@<W"1$/K
MV;ES2.(+&VO&#P]L\V< MM;(!@+_ 7;%Y=:NXOUQ?.$*P?,'_'8M:\&*BE2C
MO3I<"["QT?U8"#I9.\1/2SUQG&__T+AURM4,;G=4:-3@(!>S'Q2OSH^,5[52
MS>(U<)GG:,1D!'.K$TQ#O-870ZZDMG_PR?W\Z)CJ!\6Y4OZQ@:[E *T.?U:'
MN@K/W4EX*13C7)>X\D\9!C"E*Q\$>I]<?D<CWQXE";$\J#L+L2]:,#E[L)G*
MM+SF(B%*V$/(('B:W23?TW7U5&J]&8\PURA<ZKG_QJ"&Y+3I< #;YR%Q&)02
MC.!3#AH"[ /7IUY,YR/  !4_G)\2I9V$#[1:H$H]!?;=28,IV,\P<R%+RLM^
M\#U.G4TP7C!F_=B&X*D5A:YGS;*)ORY#=#-(<ZAB_MEG=X GB&XS![H[J:@G
M2+[3RDC^%KAAU =Y7$7AU>!"Y>#)*YV<7RY[DB]UC]M@!A NN<J4TH2G8A>,
M;B;VW4D</4'LE58E(_<@NO7 9R@Z!,FHH_U^J!Z%8"+X $8=P>^E+G/)P]<\
M\ITUKHYL,-0)%D;"U^Y(MS_@8H&' S(0?*Q&OEG)3(]/(AGR\3NX!(CZC($K
M1C</"# '9K+^G?:".#;"&;0RQD-%J???1\L:T+0V4HS=2?4\23&R&<648L"0
M\J<K1I:'75>,5?JR.QFDE+[P\2TN0="GY7(5GRGE:DRYO,*%0X\@;CWAZ(##
MA"*X\GULE3D7*L+MAU1 &8>=^PY[(*]>D?F[9P!U<B\;4"_U_IN. LMYVWHT
M6(7M[F2+\K"MK<.V4<LZ ^'>@;S(%&*D%$/UX(;7S&;N'9A4_GB=B]P2['3$
MNIS[51RDH-3H>Y.-L-N=C-&3L&LU%Y_QDK-_OC\[N3D[_7+V\>SRIO_EY.K#
MY0V@E;U^?'U]_+^6Q_QA.%H"XJ-,;GG;QDQN=Q)'JV%;A]G"<Y:?!+/J[B1[
M'@].M;(P2_Q)T-FQU,VCT*G5LPN6?A9T=C3#LA4ZK84,2SQ_&%#7BP2[8%+2
M(0-D?OGK7\GKX_-W'Z[/B!.I,JI'>*#&>OD7\I=?-DG"K,,GT_3VP.QH F:[
M$6<AO?EX8'8$EU5P[6CB9@&N$RKSI^BU[$-[S.'&#PRRTRE5Y0;E>HWK=W#M
MSR5["#_BDKYCF,3ZP_VE\ZK'.+RE'&QO5CN:1]D>IW8VMYF'D_A!X%F%VFYF
M,Z9)J+59C'8V?%!@J4>#YZ<K\'FM[^9"M-;;Q2T8 V+'4@\W(^S0]+ED2<EL
M[;!4;V232G/K57!=HR(#0U5DA_NQ" ]1M =__G/TCW"7B]QGL;K(,ZU+W['\
MA80;K/3V]/?W'Z!&DI%]+S@(1OXN:!"L67Q8RR:AJ!C>Q4M@O)=9 O-2D%9W
M+(GQ9.P6$HAQ2C].W7_Z?*# 3!;"P(E<E>:=_AYINDD;&FMH>0?0QI< 81 8
M2[(/)_=4^" 4>5 H!##<@.B+[,'V(H>EW^!2[VW%=T#.,GST:UIJ68'GWI8<
M&-WX)"Z;Z(^%ZF#%#:E7'9>]3W8=^?Z2M\F2VX1,5RJ\_7CQ:DM&(5B!(5<=
M?L7_01LA"BM-56ZA%?8<K7SZB@8SZRI8CJ4MQXHM1XM*]=Y"R[$^NB*,J'<!
MA< 0K'CY!0Y[*8IX01)\B914#LEK/?.175(^)&>X!DD?WKAC1IA' \F<+FE9
MY5:;2&8_F5+=*I=;1BC5K';=%*5*K6.H=_5JW1!/K8:9WM6M1K-I"KM&;N]J
MFU*J5*Q..Y=4=5-2;:M<-P->U6HW*T8HM:Q&-5?DVPBJW:SED:IOW+V653&D
M4FAZ55-J7C;C6)IUJ]8T9\5F!-6PFIW<[C4W%E3%JE=RN[>QQ8!V=DPYJ4[5
MC!ZTK4[-#$]@Q?E.:AM*N9:WC;GDL[2Q#5= H5JF;-@8'5-2:AF*#&#$JYER
M3QUC?LZ4R;5;#6-::6:X0TJF(HR*.9[RA^!M*!ER34 I7\.W"'JJA@9@D'C;
M6'18,2,GX*ELS//6C.E3_O"[#:7\B&XK7V#*.U7-1&'@, W%<\"3*>1:AJ(Y
MH&0N(JB8\DZMCC%*;6,2-S0>($_&U,F8BK?J?_(<O[+$[.I+HH*S_LTFB:-I
MTA'SF-:E6@N+A^J1B7H ?W9JPC-4C*E7S9Q2&(OO#.4., PV-="T# W(#0@2
M<GNW<3ZC6H,)C)GXM6XU#>7:H'N&8L463-)-1><=8]G-3L/8C*%LBI*IL:8*
M<C*5]2GG\]38F*>VU304P%8-^I6.(?! 4%4SE%I6Q="84$'=-*,'2,H,>$"I
M4S-CQ,A4W=0\K5G+[=_&L] F>&!3BM VI @-JV'(LS1@/FMJCKUFI-HB=5O/
MCZRWH=0T]"RG;M6-12SFLIM-0P^],$8T-N@9"P[:QN+69M,,I8I5-Q645XP]
M0VTVS4T4S*A38YWWW:9WI@*?JC%MJE1,"7RU7BZ9D#Y^E<0;[LVMKS7P',N4
MMVBVK(:A,;%I[,EH$^8WA@;\6O[S_ZTHF>&I;M4,)0H1.T.S-^A>_A/D;18E
M&*($W:LUC4FJUC050U8-/?B%>,T0I28.'-K=%T(>V:-B_*:)5-O#=Y.K3!&8
M7F/3;>*[:];E]8\O^B^S,$_2L9RMS$,.;.[;% 1SR8$!5^^QK[=1Q^\!^)SX
M*I-(0O80'A*'J[T;>#C"W<S7K>S3_5(%4O?QBO55@'OG8_;T-7?9MO$; =-U
M>*28;-%@8%WL\CWYH>D'9G\FQVK,(F_TF$7T3E%,D"[9MP_("0\FPAV.0E+I
M=$#WJN5R4RTSC:OU^2"\QVV8U"885&V P05Q05T]UV:^!-TZ)!1P"=1'(W!C
MRU3SJK=)9W^I6##U^86D2H 2%JD7C"BPA!L_0=<#CX4,V\%C:!2HIJK(.Q_?
M86ATJK4&3";V+_D=(4UDOG5PB%NE1P\EE]:JI:%MXR,_"ZQ'[?!.E*Q2M$9A
M&'1+R9KA9(B'T3X70/L%$3RS/1=LGKQ%4>HO# !^9:O5 L!J5@U[-\/Q_'\N
MX$P$*(VR K1ED6//(^HV>!D&3-XQQ\KMW^CYN_7V\KRH/F!"1DQM9*(-7"U,
MIKAB.54Z=?(!7Z7K+@O)XI6^V /K K\:\HGK#>0_DY[>=0RW>)%'JVE/*Z2N
M$E*\Y3Q4)$ C1Z2'?X^4J0Q="/*(NGKO@J!Q\33TE_D.>BB>H;/\ARNV'3:@
MD1?&NZ,AO1P1 $,+S.!O!4.XMOVY^>&DAQ >I0BAYB$Q_5F3*3^".:Y@-OIP
MU]^")QDPVQVXZILR65>3Y<<A/=T(%Y,I4PD_*9U+N++C;X6 WJ0:VXB]:5OD
M?N3:HT6B W";^L4H?-^ BDD^^ZX/AI!MY%Q=C#_^,:=NZA4&:(1&(1^#QU3[
M@^33!_]UR\&M9.'"K8]$/%:BM<,$)I_7E&'-TU)!@]J:#W<]B8 C\B^8'VG\
MYBIM)%Z)H8H2Y.T$-P4$N\_@?\TDJ"N$4+F>S>'V"_@V:.@4&])[&;HXHJ$@
M@?L)"W/X@R%EB B_ (>BKYL:,2^PEKC7O1DWWV.?^ =Y>WRM0DD",-(T<'/E
M4;?<P61)O=5:%-?9@Q^)JP/*2,_!VF2A=O$;FTBP-T9ZR=$7Y0?WU$N).E31
MNI?<3]=7E]3[+S,"> H$U-7UE0-4X?G6I008'" PY2VYML#ZM.Y<M3V2[$@$
MUZ=5R3ZX#L<=#$ /]-Y=2YH\R+"G! >(:)_\!>T,Z:L/><4=RQ4NW%0X+Z]N
M]5^K2-PZA5!:^= %+)5OV5-=XG<NS""HXZC/@E$O'@RR#7I@(.D:T%UVGPP=
M<!9P*1>"P:+-!,0U2G$<5P8>G1"\!&X&-\.29!\L"%PEC(:)7B+K"8\9P862
MDMY-__C+A^MW1T@RI4LP P/DZ3A 1SOBP@TG"]6Q;4T"C[XH0YG7"'4AP0"*
MS3.;)@9R>)B0WHB#"8/T('*31]^[/;3EHS^4F."VBN; BJ$0B0NI_F&I0\*L
MH:4+6KJ@!2ZD6ZG6ZDN:TK: ?Z> SQM"JKW]-S<W[S%$[U^=_-8_6*"&  KM
MX_7X@-1F/A]IVF(2A'PH: #CI:(+,XH$?+&<HJK;2[A+KBJ2&0N3RYG8B@>U
M0=^8^G2(@^%R1S!K*,W;S .L9A*,S!27Z/ZUDJ-9TQ 3 2L;2W,ZK9#'*BJI
M>5[G[71U>_/LSE?)XW?LF.=V'._AX;C#^>Q!ML&T=-.5EK.\$ B \N @3HHX
M.#]_,) Z^2UN.U)10.I6PM;W8B_^D(9V%'_,7]%C/E[KZ<,OZHM;1W]8ED6*
M;WL8A"6%<KCP^;V??*Y#IMG84]HAV+_V]OZN9XLLI19P)THR[G-U4$*V\/;V
M3O H/48(=I?X>=QN.I+9RFI3S1#JZH.9>8<<W"T/1UI;(/;.U'08)C-@)+EF
M8W['" QR,$50P_A2A[)7U%!#C3-UD.H:MJ8&7'2],G1XE&T/YL] %VKW&<P\
M%*-85@<4KDCFU]#33$54-:AV,X*@5:E=HKE<QX@$9$,31#)U]5;04/M<[PE-
M4TSOVR.8BA\@(4I.^M=Z]XD,"6#0]K@/DII^?Q1*(]M*8HNE5>CC()K4'Z8C
MIDQA"*K\T%;PO<=#E**67891A<I"++17E,P;Z/I3?8/8%"[&<5:*B'(5TZPE
ML)4EED2.:>9SPL6]66S\,8F,YUM4XEUM2F\0O!QKUD[F>\:DTRDH"".Z>YD:
M6M/2[682S!M\MO/FZNI=?_Z[G?'KY+,2C?]\2'/=E@CZ3 I;[XN ;2W;$$'W
M6!=6.3+UB47UIUS)_S+;BIU34WOSJSUF'AX>JN05J:S;]V#Z6[JMC-XC-69,
MD7S\#JC)M@1DOY)L2K!N3P*ME"_Q[$/_?:EG'UEC>\YG'QL\0)^) +\?(.-G
MZ1" ]-$9ZCVI^Q1 SWN OO&ZI*I5,;1.']=SFEDK5;;*\=/<1S_$TX%-$;Q5
MD8V#<(*7XH3@]$+V')-Q11T(=@N:?WT&O1#4EWK+<."T2QJU<GF<UA8T4.2!
MZ#IHFL\1HI;PB^<E%S?VLO"P4) PY0ZG?!=@ )J=:"DHT0B=""P4D%$<F"(5
MV.G%'7I\5AE)CLE.M>%?LJ]65U69NX%R)]RV(R' Y.Y'KC>E"+=#C)70078+
M.;VG#H4YAI!3HU=<)I?Q(^3=:EMO[F*XY<WEKKFH5_\\-M2WV6?Q@F*HTU+\
M0%QTCW^4SFE3L J]$CWJE<"+P]];[DS@'U22H_\'4$L! A0#"@    @ @Y-F
M-U\Z+F"0$@  *'\  !(              *2!     &5X96-U=&EO;E]L;V<N
::'1M;%!+!08      0 ! $    # $@     ! 
end

Mime
View raw message