harmony-alerts mailing list archives

Site index · List index
Message view « Date » · « Thread »
Top « Date » · « Thread »
From nom...@intel.com
Subject [build-test alert] FAILED Windows 2003 x86_64: jdktools-test debug
Date Tue, 06 Nov 2007 03:47:29 GMT

BUILD FAILED:
	Ant Error Message:
C:\cc\cc-common\scripts\cc-exec-adaptor.xml:104: The following error occurred while executing
this line: C:\cc\cc-common\adaptors\jdktools-test\adaptor.xml:28: The following error occurred
while executing this line: C:\cc\cc-common\build\checkouts\hdk\working_jdktools\build.xml:242:
The following error occurred while executing this line: C:\cc\cc-common\build\checkouts\hdk\working_jdktools\make\build-test.xml:97:
There were test errors.

Date of build:	2007-11-06 08:27:31 +0600
Time to build:	79 minutes 50 seconds
Last changed:	11/06/2007 00:58:46
Last log entry:	hdk

***********************************************************
Errors/Warnings:	(226)
            
Result: 1
========================================
Testing jdktools binaries...
========================================
Compiling JPDA tests
Since fork is false, ignoring memoryMaximumSize setting
----------
1. WARNING in C:\cc\cc-common\build\checkouts\hdk\working_jdktools\modules\jpda\test\common\unit\org\apache\harmony\jpda\tests\framework\DebuggeeRegister.java
(at line 58)
registered.add(debuggee);
^^^^^^^^^^^^^^^^^^^^^^^^
Type safety: The method add(Object) belongs to the raw type LinkedList. References to generic
type LinkedList<E> should be parameterized
----------
----------
2. WARNING in C:\cc\cc-common\build\checkouts\hdk\working_jdktools\modules\jpda\test\common\unit\org\apache\harmony\jpda\tests\framework\TestOptions.java
(at line 505)
internalProperties.put(name, value);
^^^^^^^^^^^^^^^^^^^^^^^^^^^^^^^^^^^
Type safety: The method put(Object, Object) belongs to the raw type HashMap. References to
generic type HashMap<K,V> should be parameterized
----------
----------
3. WARNING in C:\cc\cc-common\build\checkouts\hdk\working_jdktools\modules\jpda\test\common\unit\org\apache\harmony\jpda\tests\framework\jdwp\PacketDispatcher.java
(at line 114)
eventQueue.add(eventPacket);
^^^^^^^^^^^^^^^^^^^^^^^^^^^
Type safety: The method add(Object) belongs to the raw type List. References to generic type
List<E> should be parameterized
----------
4. WARNING in C:\cc\cc-common\build\checkouts\hdk\working_jdktools\modules\jpda\test\common\unit\org\apache\harmony\jpda\tests\framework\jdwp\PacketDispatcher.java
(at line 249)
replies.put(new Integer(replyPacket.getId()),
replyPacket);
^^^^^^^^^^^^^^^^^^^^^^^^^^^^^^^^^^^^^^^^^^^^^^^^^^^^^^^^^^^^^^^^^^^^^^^^^^^^^^^^^^^^^^^^^^^
Type safety: The method put(Object, Object) belongs to the raw type Hashtable. References
to generic type Hashtable<K,V> should be parameterized
----------
5. WARNING in C:\cc\cc-common\build\checkouts\hdk\working_jdktools\modules\jpda\test\common\unit\org\apache\harmony\jpda\tests\framework\jdwp\PacketDispatcher.java
(at line 284)
commands.put(Id, command);
^^^^^^^^^^^^^^^^^^^^^^^^^
Type safety: The method put(Object, Object) belongs to the raw type Hashtable. References
to generic type Hashtable<K,V> should be parameterized
----------
6. WARNING in C:\cc\cc-common\build\checkouts\hdk\working_jdktools\modules\jpda\test\common\unit\org\apache\harmony\jpda\tests\framework\jdwp\PacketDispatcher.java
(at line 355)
commands.put(Id, command);
^^^^^^^^^^^^^^^^^^^^^^^^^
Type safety: The method put(Object, Object) belongs to the raw type Hashtable. References
to generic type Hashtable<K,V> should be parameterized
----------
----------
7. WARNING in C:\cc\cc-common\build\checkouts\hdk\working_jdktools\modules\jpda\test\common\unit\org\apache\harmony\jpda\tests\framework\jdwp\VmMirror.java
(at line 1834)
frames.add(frame);
^^^^^^^^^^^^^^^^^
Type safety: The method add(Object) belongs to the raw type ArrayList. References to generic
type ArrayList<E> should be parameterized
----------
8. WARNING in C:\cc\cc-common\build\checkouts\hdk\working_jdktools\modules\jpda\test\common\unit\org\apache\harmony\jpda\tests\framework\jdwp\VmMirror.java
(at line 1902)
vars.add(var);
^^^^^^^^^^^^^
Type safety: The method add(Object) belongs to the raw type ArrayList. References to generic
type ArrayList<E> should be parameterized
----------
9. WARNING in C:\cc\cc-common\build\checkouts\hdk\working_jdktools\modules\jpda\test\common\unit\org\apache\harmony\jpda\tests\framework\jdwp\VmMirror.java
(at line 2122)
fields.add(superClassFields.toArray()[i]);
^^^^^^^^^^^^^^^^^^^^^^^^^^^^^^^^^^^^^^^^^
Type safety: The method add(Object) belongs to the raw type ArrayList. References to generic
type ArrayList<E> should be parameterized
----------
10. WARNING in C:\cc\cc-common\build\checkouts\hdk\working_jdktools\modules\jpda\test\common\unit\org\apache\harmony\jpda\tests\framework\jdwp\VmMirror.java
(at line 2132)
fields.add(field);
^^^^^^^^^^^^^^^^^
Type safety: The method add(Object) belongs to the raw type ArrayList. References to generic
type ArrayList<E> should be parameterized
----------
----------
11. WARNING in C:\cc\cc-common\build\checkouts\hdk\working_jdktools\modules\jpda\test\common\unit\org\apache\harmony\jpda\tests\jdwp\DebuggerOnDemand\OnthowDebuggerLaunchDebuggee.java
(at line 94)
class ExceptionForDebugger extends Exception {
^^^^^^^^^^^^^^^^^^^^
The serializable class ExceptionForDebugger does not declare a static final serialVersionUID
field of type long
----------
----------
12. WARNING in C:\cc\cc-common\build\checkouts\hdk\working_jdktools\modules\jpda\test\common\unit\org\apache\harmony\jpda\tests\jdwp\Events\ClassUnloadDebuggee.java
(at line 32)
import java.util.LinkedList;
^^^^^^^^^^^^^^^^^^^^
The import java.util.LinkedList is never used
----------
13. WARNING in C:\cc\cc-common\build\checkouts\hdk\working_jdktools\modules\jpda\test\common\unit\org\apache\harmony\jpda\tests\jdwp\Events\ClassUnloadDebuggee.java
(at line 97)
boolean isOutOfMemory = false;
^^^^^^^^^^^^^
The local variable isOutOfMemory is never read
----------
14. WARNING in C:\cc\cc-common\build\checkouts\hdk\working_jdktools\modules\jpda\test\common\unit\org\apache\harmony\jpda\tests\jdwp\Events\ClassUnloadDebuggee.java
(at line 171)
public Class loadClass(String name) throws ClassNotFoundException {
^^^^^
Type safety: The return type Class for loadClass(String) from the type ClassUnloadDebuggee.CustomLoader
needs unchecked conversion to conform to Class<?> from the type ClassLoader
----------
15. WARNING in C:\cc\cc-common\build\checkouts\hdk\working_jdktools\modules\jpda\test\common\unit\org\apache\harmony\jpda\tests\jdwp\Events\ClassUnloadDebuggee.java
(at line 179)
public Class findClass(String name) throws ClassNotFoundException {
^^^^^
Type safety: The return type Class for findClass(String) from the type ClassUnloadDebuggee.CustomLoader
needs unchecked conversion to conform to Class<?> from the type ClassLoader
----------
----------
16. WARNING in C:\cc\cc-common\build\checkouts\hdk\working_jdktools\modules\jpda\test\common\unit\org\apache\harmony\jpda\tests\jdwp\Events\CombinedEvents002Test.java
(at line 100)
boolean expectColocatedEvents = (testedMethodStartCodeIndex == testedMethodEndCodeIndex);
^^^^^^^^^^^^^^^^^^^^^
The local variable expectColocatedEvents is never read
----------
----------
17. WARNING in C:\cc\cc-common\build\checkouts\hdk\working_jdktools\modules\jpda\test\common\unit\org\apache\harmony\jpda\tests\jdwp\Events\CombinedEvents003Test.java
(at line 53)
private boolean eventMethodExitReceived = false;
^^^^^^^^^^^^^^^^^^^^^^^
The field CombinedEvents003Test.eventMethodExitReceived is never read locally
----------
18. WARNING in C:\cc\cc-common\build\checkouts\hdk\working_jdktools\modules\jpda\test\common\unit\org\apache\harmony\jpda\tests\jdwp\Events\CombinedEvents003Test.java
(at line 76)
int EXPECTED_EVENTS_COUNT = EXPECTED_EVENTS_ARRAY.length;
^^^^^^^^^^^^^^^^^^^^^
The local variable EXPECTED_EVENTS_COUNT is never read
----------
----------
19. WARNING in C:\cc\cc-common\build\checkouts\hdk\working_jdktools\modules\jpda\test\common\unit\org\apache\harmony\jpda\tests\jdwp\Events\CombinedEventsTest.java
(at line 84)
int EXPECTED_EVENTS_COUNT = EXPECTED_EVENTS_ARRAY.length;
^^^^^^^^^^^^^^^^^^^^^
The local variable EXPECTED_EVENTS_COUNT is never read
----------
20. WARNING in C:\cc\cc-common\build\checkouts\hdk\working_jdktools\modules\jpda\test\common\unit\org\apache\harmony\jpda\tests\jdwp\Events\CombinedEventsTest.java
(at line 212)
int EXPECTED_EVENTS_COUNT = EXPECTED_EVENTS_ARRAY.length;
^^^^^^^^^^^^^^^^^^^^^
The local variable EXPECTED_EVENTS_COUNT is never read
----------
21. WARNING in C:\cc\cc-common\build\checkouts\hdk\working_jdktools\modules\jpda\test\common\unit\org\apache\harmony\jpda\tests\jdwp\Events\CombinedEventsTest.java
(at line 348)
int EXPECTED_EVENTS_COUNT = EXPECTED_EVENTS_ARRAY.length;
^^^^^^^^^^^^^^^^^^^^^
The local variable EXPECTED_EVENTS_COUNT is never read
----------
22. WARNING in C:\cc\cc-common\build\checkouts\hdk\working_jdktools\modules\jpda\test\common\unit\org\apache\harmony\jpda\tests\jdwp\Events\CombinedEventsTest.java
(at line 732)
String failureMessage = "## FAILURE during checking events! !";
^^^^^^^^^^^^^^
The local variable failureMessage is never read
----------
23. WARNING in C:\cc\cc-common\build\checkouts\hdk\working_jdktools\modules\jpda\test\common\unit\org\apache\harmony\jpda\tests\jdwp\Events\CombinedEventsTest.java
(at line 894)
String failureMessage = "## FAILURE during checking events !";
^^^^^^^^^^^^^^
The local variable failureMessage is never read
----------
----------
24. WARNING in C:\cc\cc-common\build\checkouts\hdk\working_jdktools\modules\jpda\test\common\unit\org\apache\harmony\jpda\tests\jdwp\Events\CombinedEventsTestCase.java
(at line 135)
long methodStartCodeIndex = lineTableReply.getNextValueAsLong();
^^^^^^^^^^^^^^^^^^^^
The local variable methodStartCodeIndex is never read
----------
25. WARNING in C:\cc\cc-common\build\checkouts\hdk\working_jdktools\modules\jpda\test\common\unit\org\apache\harmony\jpda\tests\jdwp\Events\CombinedEventsTestCase.java
(at line 187)
long methodStartCodeIndex = reply.getNextValueAsLong();
^^^^^^^^^^^^^^^^^^^^
The local variable methodStartCodeIndex is never read
----------
----------
26. WARNING in C:\cc\cc-common\build\checkouts\hdk\working_jdktools\modules\jpda\test\common\unit\org\apache\harmony\jpda\tests\jdwp\Events\ExceptionTest.java
(at line 188)
long frameID = reply.getNextValueAsFrameID();
^^^^^^^
The local variable frameID is never read
----------
----------
27. WARNING in C:\cc\cc-common\build\checkouts\hdk\working_jdktools\modules\jpda\test\common\unit\org\apache\harmony\jpda\tests\jdwp\ThreadReference\FramesTest.java
(at line 450)
frames.add(new FrameStruct(frameID, loc));
^^^^^^^^^^^^^^^^^^^^^^^^^^^^^^^^^^^^^^^^^
Type safety: The method add(Object) belongs to the raw type Vector. References to generic
type Vector<E> should be parameterized
----------
----------
28. WARNING in C:\cc\cc-common\build\checkouts\hdk\working_jdktools\modules\jpda\test\common\unit\org\apache\harmony\jpda\tests\jdwp\share\JDWPUnitDebuggeeProcessWrapper.java
(at line 233)
argv.add(val);
^^^^^^^^^^^^^
Type safety: The method add(Object) belongs to the raw type Vector. References to generic
type Vector<E> should be parameterized
----------
29. WARNING in C:\cc\cc-common\build\checkouts\hdk\working_jdktools\modules\jpda\test\common\unit\org\apache\harmony\jpda\tests\jdwp\share\JDWPUnitDebuggeeProcessWrapper.java
(at line 253)
return (String[])argv.toArray(args);
^^^^^^^^^^^^^^^^^^
Type safety: The method toArray(Object[]) belongs to the raw type Vector. References to generic
type Vector<E> should be parameterized
----------
29 problems (29 warnings)
JPDA exclude list: C:\cc\cc-common\build\checkouts\hdk\working_classlib\deploy\build\jdktools.jpda.exclude
Running JPDA tests
Debugger JVM=C:\cc\cc-common\build\checkouts\hdk\target\hdk\jdk\jre/bin/java
Debuggee JVM=C:\cc\cc-common\build\checkouts\hdk\target\hdk\jdk\jre/bin/java
SAMSA exclude list: C:\cc\cc-common\build\checkouts\hdk\working_classlib\deploy\build\jdktools.samsa.exclude
Running SAMSA tests
test.jre.home=C:\cc\cc-common\build\checkouts\hdk\target\hdk\jdk\jre
Run jdk/bin/java -version in C:\cc\cc-common\build\checkouts\hdk\working_jdktools\build\test_report
java version "1.5.0"
pre-alpha : not complete or compatible
svn = r592117, (Nov  6 2007), Windows/em64t/msvc 1400, debug build
http://harmony.apache.org
Run jdk/bin/javac -version in C:\cc\cc-common\build\checkouts\hdk\working_jdktools\build\test_report
Run jdk/bin/javah in C:\cc\cc-common\build\checkouts\hdk\working_jdktools\build\test_report
Run jdk/bin/javadoc in C:\cc\cc-common\build\checkouts\hdk\working_jdktools\build\test_report
Run jdk/bin/jarsigner in C:\cc\cc-common\build\checkouts\hdk\working_jdktools\build\test_report
Run jdk/bin/keytool -help in C:\cc\cc-common\build\checkouts\hdk\working_jdktools\build\test_report
Compiling TOOLS tests
Since fork is false, ignoring memoryMaximumSize setting
----------
1. WARNING in C:\cc\cc-common\build\checkouts\hdk\working_jdktools\modules\tools\src\test\java\org\apache\harmony\tests\tools\javah\Test\Test01.java
(at line 24)
private static final long xxx2 = 1;
^^^^
The field Test01.xxx2 is never read locally
----------
1 problem (1 warning)
TOOLS exclude list: C:\cc\cc-common\build\checkouts\hdk\working_classlib\deploy\build\jdktools.tools.exclude
Running TOOLS tests
test.jre.home=C:\cc\cc-common\build\checkouts\hdk\target\hdk\jdk\jre
The test report is in C:\cc\cc-common\build\checkouts\hdk\working_jdktools\build\test_report\html\index.html
The execution FAILED with the following exception:
The following error occurred while executing this line:
C:\cc\cc-common\adaptors\jdktools-test\adaptor.xml:28: The following error occurred while
executing this line:
C:\cc\cc-common\build\checkouts\hdk\working_jdktools\build.xml:242: The following error occurred
while executing this line:
C:\cc\cc-common\build\checkouts\hdk\working_jdktools\make\build-test.xml:97: There were test
errors.

***********************************************************
Unit Tests: (161)
        
error: testSetValues004 org.apache.harmony.jpda.tests.jdwp.ObjectReference.SetValues004Test
Unit Test Error Details:	(1)
                
Test: testSetValues004Class: org.apache.harmony.jpda.tests.jdwp.ObjectReference.SetValues004Testorg.apache.harmony.jpda.tests.framework.TestErrorException:
Debuggee process did not finish during timeout
	at org.apache.harmony.jpda.tests.jdwp.share.JDWPUnitDebuggeeProcessWrapper.WaitForProcessExit(JDWPUnitDebuggeeProcessWrapper.java:284)
	at org.apache.harmony.jpda.tests.jdwp.share.JDWPUnitDebuggeeProcessWrapper.finishProcessAndRedirectors(JDWPUnitDebuggeeProcessWrapper.java:87)
	at org.apache.harmony.jpda.tests.jdwp.share.JDWPUnitDebuggeeWrapper.stop(JDWPUnitDebuggeeWrapper.java:109)
	at org.apache.harmony.jpda.tests.jdwp.share.JDWPTestCase.internalTearDown(JDWPTestCase.java:108)
	at org.apache.harmony.jpda.tests.jdwp.share.JDWPSyncTestCase.internalTearDown(JDWPSyncTestCase.java:83)
	at org.apache.harmony.jpda.tests.jdwp.share.JDWPRawTestCase.tearDown(JDWPRawTestCase.java:118)
Caused by: java.lang.IllegalThreadStateException: process has not exited
	at java.lang.Runtime$SubProcess.exitValue(Runtime.java:357)
	at org.apache.harmony.jpda.tests.jdwp.share.JDWPUnitDebuggeeProcessWrapper.WaitForProcessExit(JDWPUnitDebuggeeProcessWrapper.java:279)
	at org.apache.harmony.jpda.tests.jdwp.share.JDWPUnitDebuggeeProcessWrapper.finishProcessAndRedirectors(JDWPUnitDebuggeeProcessWrapper.java:87)
	... 14 more

***********************************************************
Modifications since last successful build:	(1)
            
add cc-hdk log20071106005846Lbuild.303 11/06/2007 00:58:46hdk

begin 644 execution_log.zip
M4$L#! H    ( .Q-9C=T!L.TEA(  #I_   2    97AE8W5T:6]N7VQO9RYH
M=&UL[5UM<]LXDOYL5^4_8&?K:NTJB]'[VRJ^\MG.QIG8SEE.YJZB7 HF(8D)
M17 !TK8V-?_]N@%2$DF)DFTX=E*KFG%($&@T^NEN-)L@V!N'$V^_=\6=Z7XO
M$&R_1XD,IQY[];<A]\.2=/_%NJ1=_H^__VW_Q784.#1D)7GM=U]LO]@N219&
M0>FK\RWDW).E&ZF+XVK9<A%ALZ,H\%P;KCLD$/PKLT/BTPDCKD_<2<!%:)'W
M<?DE#TKOV#7SL&; 1#@E#ANZOANZW)?Z&,@,72%#;'_8'=@V_%>R^63"_8&T
MA1N$<A"W=IFT;B<>H;Y#Z(ABA_DV5Y'K.0-[S.QO/(*V8^?;X(:+;ZX_^I(,
M:#"AWUB&*@XP9#*$$1+\?6+VF'\FVZ\V_&U?0F/HA"2=D"O7IP*I6];F5) -
MVV/4+R$SL@1C"*)0B=_FP;3T5;#2T/681L0>3[B3+8NK=9,1E:!.I*^J@4V^
M.:[X3 X%4R#"2?=^4M25L(LO@B'RC]>!Q,&H4RV7#$J'?!*X'DK_[?NC Q*W
M>#1F!K9'I61)%U_I-;47F:BV*D3R2-B,*%Q(R!^IS[[K8R?0CKB2#*DGV1YQ
M1SX7R,>$3;B8GM);=Q)-^N )"!@\*FF:2&GV2Y=7+/+'P<79R=D_[F]H6O4&
M7\&CJ'$,XM81.($!%Z,!#2C0&(RI@.+IO*(<# 6X%:0X.&)7T6C$V 4;N3)D
MPD(&T[R2'1H2$#XCC?9N^M*6B)LQQZ*.L^/$U';_3C(5_V_%+UWM<AJ (.F0
MA=,NN1PS$',XYN"2@/;Y%3J^77+%/.Z/%/ AU!#TAH38[)WK?V/..V#'(A=L
M"#P!?JK:B/E,N':V6N]XG\@QCSP':)* HDQ@*("ELQF(J\JKSP5<])OG@9H1
MBG$M-[+ NCZ(PJ?>^[DG!V>Y@]/1'KFF7@08;PCQG='&CC3:>V0=ZF^H')_2
MH!#RN$[O][V/CX1X[;D@_M6Y"0;OJ?V-A4>N#&@(+8IMNE*I9[&'L,(/_SMB
M$5-&K4XUS;M@;M*RU]JT 6NN_[P85NN=O&.&4#(Q6G9#3L">1TSL8/E4$[=&
M+#QQ=G9W]S)TU_P62-S'!]SW]SB^(Z17'EOK/50M _ZC\1/K6#OG)[!CN&'0
M2G;B[)&X8'.M^!4P;?Z\F-8:N7G_WY@6E;>>%=8?)Z>N$'S-_-ZNY0Q7T9%J
M<E>'Z\$U-YD?"$&G:V?T6:T'3^OMGQ"R3KF:A>R:"@T8'!3#]?-"U?GYH*I6
MJCFHAB[S' V6C.#FZ1"S"Z]U8<B5N'9V/[F?[Q\\_;P05\H_(\:U(HS5X:_L
M05=B^<1)+(5@G+\2Y_X1PSAE<.Z#(&^2XG<T\NUQDN0JA+F3CV_1<,GQK<U4
M#N4U%PE9PFY#!E'2_"+YGFFL[Y4VL-XQI@Z%2SWW7QB]D()>'0Y ^SPD#H-:
M@A%\($%#@'SH^M2+Z7QD0D+##R='1.DFX4.M$JA.#X3\B5-;"O)CS$?(@7*K
M'WR/4V<C?/-&K)^I$#RUHM#UK'EN,&O.Y"YP%M#%5++/K@'+2&[L,Y\XN_00
MH7=:6:%? 3^,^B"(\R@\'YZJ/#IYI1/L*\1.U@C<XS9H/T1&KK*@-.F9Q 6C
MFTK\B7-!#Y%XI57)BCR(KCSP$8H204+J:*<?JB<9F-+=A1E&\!NIZYSQ\#6/
M?&>=<R.;3&R"A9'PM0/2' RYR'&Q2X:"3]0\-Z^9&?5A)$,^>0=% *;/&+A?
M=.Z  G/@-M6_UGX/9T(X@UXFZN$04NK]Y_ZR#C2M#77BB7,W#].)7'XPI1,P
M>SP#G<AR\?QU8J6N/'%.**4K?'*%2P'T:;E<Q8="Q=I2+J]RVNPV@-#TD*/#
M#1.:X+QWL%_FG*H@MA]2 74<=N([[):\>D46KQX#R,FU7-2\U-]O[/>7<W</
M_[\2UR?._Q3A6EN+:Z.6<P+"O09)D1F\2"N&Z=8-+YC-W&LPI#6S<R%JRW#3
M8>GR$:SB(06C1MZ;;@C;$^> '@9;J[GDV2PY_I_WQX>7QT=?CC\>GUWVOQR>
M?SB[!*"RY0<7%P?_:WG,'X7C9?C=S]*6]V[2TIXX%[0:LK5XY9^3_$)X59\X
M?_, 7*J5_ W@+P3,<TC&W ^86CVWK.A7 N8YI4SN!DPKGS*)[P^&U/4BP4Z9
ME'3$ )3?_OI7\OK@Y-V'BV/B1*J.&A,>J!E=_H7\Y;>-LBIKH<ET?A],GE-&
MY8ZS2SY->7],GA$D*Z%Z3JF8'%2'5*ZY\Z[EGK!C%C9.]V?OE%2;2Y3H!:ZQ
MP04Z9^PV_(C+[0[@SM0?[2R_9;J7BUO*PWVLZ3EE1NX!43N7HRR"2/Q$R*Q$
M[!GE)V8)I?5YB78N3E! J6=Z)T<KL'FMKQ;#L][!Q7V8!.$Y)!,NQSB0V6/$
M@9+6^EFHWLBEB!;6E.!Z0T4(9J;(#G=BX>VA4'>?PU/OCW"5B\+'I[K*XRT1
M?PXI"0D7V.#MT1_O/T"+)*?Z7G 0B/Q#T"!8MR:PEDLI43&ZCM>I>#]JG<J/
M@[/Z'-(2#X<MGPF,,_)QYOW3YUV%8[):!4[DRESM['=?BTUZT3!#W\\":'RO
M#CS_1)(=.+FAP@?!R%U\62J >08@*+%;VXL<EGEA2KTF%5\"><OP;B]%J<?_
MGGLU<& RX].X;J(]%BJ#%5./7QQ<^MK61>3[RU[:2JX3,EM5\/;CZ:M-.(1P
M!*96=?@5_Q?L)<1:+^>:EJ/-S-'^]!7-8SXNL!-+VXD5VXD6C1JJA79B?71%
M&%'O%"J!UEOQL@B<V](DL402? .35/;(:WTK([NDO$>.<7&0/KQT)XPPCP:2
M.5W,@Y5;'2*9_7!:E995+E<,T6I:U8HIODS2:EG5AB%2;:O2:)ECJV..5J-6
M#&-M4UKU#M"J%=*J;DJK5K5J57,J4:L4\W47>37+Q7QM+J_V6GG5-^:K7+-,
M#;%I5=8,<7-:#:O3,,17IVS56J;4OFW,K*NU8A?1W!S"JE5N%A.[B_V8<Q&&
MZ(![:)F2>]-J-\VI:-.@NJ^AM;%%-ZM6LUXU9]+FYFJC,80QC3"EI0!AU9S8
M6P;CFG+%E,J#W-=,^G?BJV[,*QN-W=8%-G>B95#G*_5BOC9W\C6K7C4UZX/L
MVZ;TOF7.W;0,LM5<*_J[\%6KWL]U5;*T6GB;L6R,Q_W+36X9=0IBEEZP^DRG
MD66Y7$=^U/.TXR,C FP8\T'@&XU%*$VS4WBC_LSF)),W,";#G::YZ!YURYQI
M=LR9N3F785):YC2K;5!6YM(23:,12MN8]9B4%]!JF=+Y!M RYYG->8C.N@S:
MQMF29AF&:%#MZZ:<_/H4P.8)VHI5;II359,W,F8G6(/F: Q'DV-LKL6QL2FM
M=LOJE,VE33IM4_("EU,W-V67.X;XPH<<QFBAO$S9=M-81LXD*9./<5IK0^>[
MY"^;QIZ7= P^2VB;N[5M&XTM*^UB)[&YZ)M6O58LKLUIM==F"^_R>,E<M@,F
MCH8Y9]^HF9IH&T;Y,G>'W3"7;P>V&H;4OF;N^6S#JAD+QDW>)$"T5#/WL,K<
M#0>@V#2G$0:5JU,SJ/.K@\ME.;7[+_-XP[V%U;\&IG68/DV91AMNO"JFU*9C
MM=J&3 ,"/6-^%VC5C05Z98-/'LR9!L#8K)@35\-4U(BT3-WSFAPCT&IT#,G>
MJ$JTK+:I:+8%LTNRU./%=L@C>UR*WXJ1:@?Y[KR<*2(+I6RVDWQW_?K"_L%I
M_Q$7&$HZD0LK#+%?F_LV!;F<<>C6U5OQZ\W7\7,!/B<^P_?[2<ANPSWB<+6#
M! _':C?T]4L4]8!4C70%++*^"G#]?,+NN8PPUR5^1&"VMI"4D@TB[KN:=\5&
M_=#A+;,_DP,U=Y$W>NXB>CLJ)DB7[-B[Y) '4^&.QB%X\PZH6K5<;JJ5L7&S
M/A^&-[C/D]IZ@ZIM-[@@+FBGY]K,EZ!&>X0"#H'Z< 1ND9GN7PTR&>-O%:MA
ME7\CZ2J@;27J!6,*3.'>4C#ZP&,APY[P&+H%NNDV\MK'URT:G6JETMHC.V?\
MFI F\M_:W2-_N+[#;^1+-FG6PY<3>6V32KT,)J.VAR=*9&EZXS ,NB]?)E-\
M/./#Y%\,G_WH^!W;G@L&3MZB'/57" "]LM5J 5PUJV;!J.8HGOS7*9R)  51
M5G"V+'+@>41=!I?")!/7S+&*AS5^K-&\/3LIJ2^8D#%3.Z9H*U8+J"FNK$Y7
M3Y]]P%?[NLLBLGAE,G)NG>*W0SYQO>G\9]+3NYGA?C)ROXCZK$FZF)#2%>>A
MH@*:."8]_+NOC&3D0IA'5.F-"T+&E=XP:N8[Z(MXEM#R'ZXO=]B01EX8[[R&
M! L% 3SE^,'?"IYP/?X/8(F3'J*YGR*%NH?D]*=.9BP)YKB"V>BS7?\N;,F 
MV>[051^6R?F:'$L.Z>E^N)C.^$I82FE@PI@=?TH$="C5W68<SCHC-V/7'N>I
M#L%UZE>X\%4)*J;K1N#Z8!G9;DY48?S-D 754^]?0#<T"OD$O*;:H61=#^"_
MKC@XF"QLN/&2B"=(] !P0[..WY2M+5)308+:!1#W7HF *_)/N&/20"XTVDS*
M$H,3)<^K*6Y "+X@JPD73(+R0O14[.<<;C^:IP/R1TA>[Y?HXI2&,@2NIRPL
M8@NFDQ'B^VB,B;[N8,R\P%KF8K?F3'R/O>*?Y.W!A0H8">!&,T@M-$!]<H?3
M)0V+-"=NM04_$A, 8)&B@^U)OGWI&YM*,#5&>LG1%^4)M]2;DSI2T0J77,\0
M4&7JE9TY!3P%"JIT@]8!:NYB_U("' Y0F'&7E.6YGS5>:+=%DAV1H'S6ENR 
MXW#<X1!"#;UCV)(^=[,,*ND!,-HM?T$#PP[4][SBL15+&*XJP)>WM_JO5?1M
M'4'LK)QH'E+E6+;4J/BU"S<+U''4]\&H%\\(N2X]L)%T$Q@RNTDF$#@+N)3Y
M@+!D,P$!CM(@QY6!1Z<$B\#'X%Y<DNQ$P,N-"_-BHJ+(?<)E5GJAI*1WV3_X
M\N'BW3[23"D5W'B! M!)@*YVS(4;3O/ML7=- X^^*+-9U Q5D" !U1;9S5 #
M6=Q.26_,P:9!A!#%R?WOW1X:]_Z?2E1P645V8-50B<25U!"QUAYAULC2%2U=
MT0*?TJU4:_5E?6FSP+\SW!=M(M7ASIO+R_<8J_?/#W_O9P49PRBTE]<S!)*;
M>WTD:HMI$/*1H ',FXHPW%TD*B!6D%2->PE_2:FBF;4VN9R-.W&AM@B<4)^.
M<$I<X1;F/:6YF_N# C;!X$SQB;."UG:T<1IB%F!U;VE>9RT*F45M-<_MHLD6
M=+C(\&*;0HXGCGE^)_&&(XX[2J4/LCVF)9QNM8+I7&@ .H0S/"GAQ/U8X4'Z
M[/>XRTC%!>EK"3O?2[WX$QW:5_RY6**C "SKZ<,OZM-=^W]:ED5*;WL8A265
M"AGQ^8V?? I$9CC94KHAV#^WMOZA[R192BG@2C1+Q2\T0D'9PMO:.L2C]'0A
MV'7B\7&'ZR@;\93TWIXA--8'<Q,/.?A='HZULD @GFWJ,$QOP*QRP2;\FA&8
M\N"604WLR]W*5HG=(E30Y%@=I(:'_:D9&)VP#!V>G5:W2G"##92A>9_!O8CB
M%2OK(,,5R0TXC#;;$G4-VEV.(9!5>I?H+M<!) $!T028;&.]#S4T/]$;4M,4
MWSOV&.[5=Y$2)8?]"[U[1I8&\&A[W =QS3Y."M61<R6V)=552.0@JM0?I2.I
M;&V(MOS05C"^QT.4I99@AE<%3CY&VBI)Y@TU@9GJ0>0*A7$ EJ*B7,8L@PF,
MY:@E466:_Z)0<FL>.W],(N?%/I60BTSK#:)89.#:WWS/6'DF307A17<KTT1K
M7;;O?+IYDV]_7IZ?O^NG/OX9OR@_K]+X]W<Y4_L[Z#,I;+W) W:P;'<'/5)=
M6:70U%<;U9]R9<U7WU;MYYKZ*(#:(^?V]K9*7I'*VDT<9K_EV^+HG5MCYA31
MA^S+FNRQ0'8JR0X+&VRPH'7QT1Z Z+\_\@%(SKC,/P#9X+GZ?/3XS0(9/V*'
M$*2/[D]OB]VG@'3A<_6-US-5VU:M8^@!8[/9L2IU0^_+XV*%Y'VDAS[)TT%.
M"9Q5B4V"<*H+XU3A0E&^!--T)1TAPKD>CSZ%40GJ2[V7.7#>)8U&LS;)J X:
M*W)#=",T4V,AZP _C#YP<5<R"P^17PGWX>&<X1?;,/LLGFI!*/D(G1U\L;V-
M3.*\%*E 3Z\#T;.TRE1R3(.JW0J3/<*ZJLG"!90_X;8="0'V=S-VO1E%N!QB
MV(2^$CK+#ITZ%.XSA)P9OF(N*<;/EG>K;;U/C9'^-A>U[KM>_=&=JR^WSX,!
MQ4:GI;B \.<&_RB-TDIO :B]EW2_]Q*\-?R]XLX4_D%]V/]_4$L! A0#"@  
M  @ [$UF-W0&P[26$@  .G\  !(              *2!     &5X96-U=&EO
@;E]L;V<N:'1M;%!+!08      0 ! $    #&$@     ! 
end

Mime
View raw message