harmony-alerts mailing list archives

Site index · List index
Message view « Date » · « Thread »
Top « Date » · « Thread »
From nom...@intel.com
Subject [build-test alert] FAILED Linux x86: ehwa
Date Mon, 05 Nov 2007 15:07:01 GMT
svn.revision=591633
BUILD FAILED:
	Ant Error Message:
/export/users.2/cc/cc-suites/scripts/cc-exec-adaptor.xml:104: The following error occurred
while executing this line: /export/users.2/cc/cc-suites/adaptors/ehwa/adaptor.xml:116: The
following error occurred while executing this line: /export/users.2/cc/cc-suites/scripts/framework.xml:1069:
Java returned: 1

Date of build:	2007-11-05 20:56:52 +0600
Time to build:	10 minutes 3 seconds
Last changed:	11/05/2007 15:38:18
Last log entry:	snapshot

***********************************************************
Errors/Warnings:	(91)
            
[exec] Result: 25
[echo]
[echo]
[echo] ========================== EHWA.log =======================
[echo]
[echo] Eclipse Home = /export/users.2/cc/cc-suites/build/libs/eclipse-3.2.l-lnx-x86/eclipse
[echo] Tested JRE = /export/users.2/cc/cc-suites/build/checkouts/snapshot/hdk/jdk/jre
[echo] Tested JRE options for Eclipse launching =
[echo] Delay factor = 2
[echo]
[echo] --- Automated EHWA scenario for Eclipse 3.2.1 ---
[echo]
[echo] Start:
[echo]
[echo] Run Eclipse
[echo] Select workspace
[echo]  wait window 'Workspace Launcher' to appear ...
[echo]  window 'Workspace Launcher' appeared
[echo] Press 'OK' button
[echo]  wait window '' to close ...
[echo]  window '' successfully closed
[echo] Close Welcome page
[echo]  wait window 'Java - Eclipse SDK' to appear ...
[echo]  window 'Java - Eclipse SDK' appeared
[echo] Create new project
[echo]  wait window 'New' to appear ...
[echo]  window 'New' appeared
[echo] Select new Java project
[echo]  wait window 'New Java Project' to appear ...
[echo]  window 'New Java Project' appeared
[echo] Type 'EHWA' as project name
[echo] Press 'Finish' button
[echo]  wait window 'New Java Project ' to close ...
[echo]  window 'New Java Project ' successfully closed
[echo] Create new Java class
[echo]  wait window 'Java - Eclipse SDK' to appear ...
[echo]  window 'Java - Eclipse SDK' appeared
[echo]  wait window 'New' to appear ...
[echo]  window 'New' appeared
[echo] Select new Java class for 'EHWA' project
[echo]  wait window 'Java Class' to appear ...
[echo]  window 'Java Class' appeared
[echo] Type 'EHWA' as class name, press 'Finish' button
[echo] Select the 'public static void main(String[] args)' checkbox
[echo] Press 'Finish' button
[echo]  wait window 'New Java Class ' to close ...
[echo]  window 'New Java Class ' successfully closed
[echo] Put System.out.println("Hello, world"); into EHWA class
[echo]  wait window 'Java - EHWA.java - Eclipse SDK' to appear ...
[echo]  window 'Java - EHWA.java - Eclipse SDK' appeared
[echo] Save EHWA class
[echo] Run EHWA class
[echo] Exit Eclipse
[echo]  wait window 'Java - EHWA.java - Eclipse SDK' to appear ...
[echo]  window 'Java - EHWA.java - Eclipse SDK' appeared
[echo]  wait window 'Java - EHWA.java - Eclipse SDK ' to close ...
[echo] ERROR: Failed to close 'Java - EHWA.java - Eclipse SDK ' window during 240 sec!
[echo]
[echo] Print error screen picture:
[echo] 	Picture was saved to /export/users.2/cc/cc-suites/build/results/ehwa/20071105_0856/error.xwd.
Use 'xwud -in error.xwd' to view the saved file.
[echo]
[echo] Kill Eclipse:
[echo] 	Found 1 Eclipse processes
[echo] 	Process 0:
[echo] 	Eclipse process was killed
[echo]
[echo]
[echo] EHWA FAILED!
[echo]
[echo] ======================= eclipse.log =======================
[echo] Install location:
[echo]     file:/export/users.2/cc/cc-suites/build/libs/eclipse-3.2.l-lnx-x86/eclipse/
[echo] Configuration file:
[echo]     file:/export/users.2/cc/cc-suites/build/libs/eclipse-3.2.l-lnx-x86/eclipse/configuration/config.ini
loaded
[echo] Configuration location:
[echo]     file:/export/users.2/cc/cc-suites/build/libs/eclipse-3.2.l-lnx-x86/eclipse/configuration/
[echo] Framework located:
[echo]     file:/export/users.2/cc/cc-suites/build/libs/eclipse-3.2.l-lnx-x86/eclipse/plugins/org.eclipse.osgi_3.2.1.R32x_v20060919.jar
[echo] Framework classpath:
[echo]     file:/export/users.2/cc/cc-suites/build/libs/eclipse-3.2.l-lnx-x86/eclipse/plugins/org.eclipse.osgi_3.2.1.R32x_v20060919.jar
[echo] Debug options:
[echo]     file:/export/users.2/cc/cc-suites/tests/ehwa/.options not found
[echo] Time to load bundles: 112
[echo] Starting application: 5353
[echo] Application Started: 64032
[echo]
[echo] ===========================================================
BUILD FAILED
/export/users.2/cc/cc-suites/tests/ehwa/ehwa_run.xml:209: EHWA FAILED!
Total time: 10 minutes 2 seconds
The execution FAILED with the following exception:
The following error occurred while executing this line:
/export/users.2/cc/cc-suites/adaptors/ehwa/adaptor.xml:116: The following error occurred while
executing this line:
/export/users.2/cc/cc-suites/scripts/framework.xml:1069: Java returned: 1

***********************************************************
Unit Tests: (0)
        
No Tests Run: This project doesn't have any tests

***********************************************************
Modifications since last successful build:	(2)
            
add cc-snapshot log20071105153818Lbuild.40 11/05/2007 15:38:18snapshot
add cc-snapshot log20071105153035Lbuild.39 11/05/2007 15:30:35snapshot

begin 644 execution_log.zip
M4$L#! H    ( -RH93=%Z^H](P8  #8@   2    97AE8W5T:6]N7VQO9RYH
M=&ULU5IM;]I($/[<_(JY2B=:J=A &MK2-%*:%Z4OND8D53]$5;2L!]AD\5K>
M-2_WZV]V;=*0L ;3-NE9"0(\._/,>&;V\9C=H1G)O=V>BF9[NTF*>[L,M)E)
M?%?KJ]C4M?@7._"Z\??;VMY6ED3,8%V/X\[65IK1*]CCXHJ-V7=XGPD9]84D
M>1Q.V"4)!-.17)!9^'!/0_X>^5!]AWJ]#MTLAJ.3;_N@.<8L%0I4#&:(T%=2
MJHF(!\!5W!>#+&5&T#E:Y%5XCMI@!!^[1_ .0IPF*C5AIC'502ODG/[J.A,&
M==BSCH1\B/Q:94:'.F:)'BH3#J/K\,K^I[B.&9584)K,>:6/N!2)1CA1(UP/
MEA0]'6*^K+X=M )9E_&T/GW=GG_K-7:(DLV@S[A1*1EKE<5^L\-_K5TT Y89
M)4QGE9AQ,0PHS"M%"Y_7E0O&%%BZ*/Z\.Y#(8IM9\TNSF&%!$'B7GK$Q J,%
MR0Q4WZ/ J%]SE<,%M4&/\>LL60+-HB&OZ-4ZU7X%MD+UP\*XB%"B09>!:"R.
M2*1HTW#V.U"$*AW<7'"E!^)/PL-5B@%U/B-&]RKU,7'EO?VQ$04:C36CO476
MQ9$:WZ[/B4JO=<(X+JO-C?';%D30:1\+;PR4]PS($K?O@5UJS93VBH,4F<.3
MHLZDT;=P+5MV,;HF@6(9;2_TH;/.!2BTYXZT&HU7S69CY[+Q>J?M[V*&I69Q
MV_7*GI+C&E^ 1OPY-*&U%T@UH*T]A0@-$W)I#DR1TZ[9[7[I=N"8A"@6U,JX
M5)0)M8\D"76'/;@JWA=9<G;X"6I E"%2$XBRU(:^];)!R/E?P P$#M1ED967
M-E>;02)!BAA)<'OIE71@NLZI#K1V_'M00O9,T">\P0BU9@/T;T#>$_XS[[P'
MW,35)U =QX-REL=C;381YZY*EL5\:'.F)&!WZ=4&H;6D=Y\XTL@5^2+UO8W'
MI:>3KF)CD0HT'1-8DPC<KMSRSM'9P&W'\PO7_-JI@W-SJ]W["V7"A)G7>NW;
MS8+/[BIB6K-.LR1!5MZC2U7DZS'R]T:*F8;:ET\UZ&7&$/5;$W#M1T=;"UT-
M=,8Y&>MG4L[RE9'?V('3_ TEM_6;4"]:%]C'>RVU<B27J5@9R7S3@Q@GU$C5
ME<V"-1'_@Y/*$-V:E9B*;+28G$_5@>7K3O-UFZ"\HV EY/-90GND;2HDK&\0
MQVQ4D@%%%A^+6.AAU4R^"Q*JIO82!=5R_4?F.#5<,O+F#T_WQTKA/#AVFRF2
MI&)..R4'5LEF<2J65LWC'+;-XA>$N%*V%A&P$Z5:DO6DX* -T7(.8R4B&#$1
M/SLSEBM>? >6#O3S6CY.Z*GI[RX9%XW-"V:^O%*YG&8&SF;$A$8!4:C L589
M/WMZ@E*J%W;KE='3YV^!OE8Y.]FHH);3\XV+RZ=N=0'8><TZ;MS,(5?('4W)
MVY5$YL\.2A5TZZ;GK[Y?J\XP3VTJ Z8I=3?-4\08$L%-EF()7WURFHM02#1H
M2I9H [9\YS[700BFDRB KS8$TTD605W$<'/"Q70LJ)!M7\K-6J8>;.#V)R'E
M/*1ECAZK+([HCF >?>K\MFM@2:X_.<UEH%&F^(Y"%\EK E76A3:X([6U>;S_
MX?/184ER5+^!AOEP;*,;Z \Q;284?ZFX&V[Y;_GMX1Z<_)J1FI\.+4RBG<6'
MPK0XYLL_!;1#4G185,;]%R _>"@787NM'J=$/^R=:8X0HP<#F,AL(&)];^1=
M3+"ZVZWIY9A:4+OQIOF&FFRZA@]NETN8&?X/O3C$7C:8SW!^%O^M(7 P'PO%
MRA!'IG;IYZ=BY,8J-K.)_<611-V!9M/_O,T-3NP.1[LSD= \Q6%G>V?;NV3_
MAV2^G'(.VB\;VWXKF\P/5Q[^F>?[KQ\^'Q9=>>'$NB&__1"YTVJ\Z2ST>;_A
M<T5M%^SS%8IZ T8BSD@KM"QW4'&DM[;.:6.UP]O,A2]72%S##.\\7,8IQR3O
M-^>+)QR14)QG*7$IF SM)*W02*?-4&@W.>YLE3K+(I88E1;^%I^<N\UFNP._
MQ2:Q'Y%0B/OS<L_M-=H47\?'4B3.$]MT:F[MAFQO-W0_"PCSGPB$[O<"_P%0
M2P$"% ,*    " #<J&4W1>OJ/2,&   V(   $@              I($     
H97AE8W5T:6]N7VQO9RYH=&UL4$L%!@     !  $ 0    %,&      $! 
end

Mime
View raw message