harmony-alerts mailing list archives

Site index · List index
Message view « Date » · « Thread »
Top « Date » · « Thread »
From nom...@intel.com
Subject [build-test alert] FAILED Linux x86_64: drlvm-reg-test debug
Date Sat, 03 Nov 2007 18:51:05 GMT

BUILD FAILED:
	Ant Error Message:
/export/users/cc/cc-common/scripts/cc-exec-adaptor.xml:104: The following error occurred while
executing this line: /export/users/cc/cc-common/adaptors/drlvm-reg-test/adaptor.xml:74: There
were drlvm-reg-test failures

Date of build:	2007-11-04 00:14:30 +0600
Time to build:	36 minutes 28 seconds
Last changed:	11/03/2007 21:45:28
Last log entry:	hdk

***********************************************************
Errors/Warnings:	(8)
            
[junit] Test org.apache.harmony.drlvm.tests.regression.h4514.Test FAILED
[junit] Test org.apache.harmony.drlvm.tests.regression.h4514.Test FAILED
BUILD FAILED
/export/users/cc/cc-common/build/checkouts/hdk/working_vm/build/make/build.xml:547: The following
error occurred while executing this line:
/export/users/cc/cc-common/build/checkouts/hdk/working_vm/build/make/targets/reg.test.run.xml:105:
There were test failures
Total time: 36 minutes 24 seconds
The execution FAILED with the following exception:
The following error occurred while executing this line:
/export/users/cc/cc-common/adaptors/drlvm-reg-test/adaptor.xml:74: There were drlvm-reg-test
failures

***********************************************************
Unit Tests: (140)
        
failure: testTrace1 org.apache.harmony.drlvm.tests.regression.h4514.Test
failure: testTrace2 org.apache.harmony.drlvm.tests.regression.h4514.Test
failure: testTrace3 org.apache.harmony.drlvm.tests.regression.h4514.Test
failure: testTrace4 org.apache.harmony.drlvm.tests.regression.h4514.Test
failure: testTrace5 org.apache.harmony.drlvm.tests.regression.h4514.Test
Unit Test Error Details:	(5)
                
Test: testTrace1Class: org.apache.harmony.drlvm.tests.regression.h4514.Testjunit.framework.AssertionFailedError:
expected:<10> but was:<27>
	at org.apache.harmony.drlvm.tests.regression.h4514.Test.testTrace1(Test.java:30)
	at java.lang.reflect.VMReflection.invokeMethod(VMReflection.java)
Test: testTrace2Class: org.apache.harmony.drlvm.tests.regression.h4514.Testjunit.framework.AssertionFailedError:
expected:<22> but was:<39>
	at org.apache.harmony.drlvm.tests.regression.h4514.Test.testTrace2(Test.java:42)
	at java.lang.reflect.VMReflection.invokeMethod(VMReflection.java)
Test: testTrace3Class: org.apache.harmony.drlvm.tests.regression.h4514.Testjunit.framework.AssertionFailedError:
expected:<34> but was:<51>
	at org.apache.harmony.drlvm.tests.regression.h4514.Test.testTrace3(Test.java:54)
	at java.lang.reflect.VMReflection.invokeMethod(VMReflection.java)
Test: testTrace4Class: org.apache.harmony.drlvm.tests.regression.h4514.Testjunit.framework.AssertionFailedError:
expected:<47> but was:<64>
	at org.apache.harmony.drlvm.tests.regression.h4514.Test.testTrace4(Test.java:67)
	at java.lang.reflect.VMReflection.invokeMethod(VMReflection.java)
Test: testTrace5Class: org.apache.harmony.drlvm.tests.regression.h4514.Testjunit.framework.AssertionFailedError:
expected:<60> but was:<77>
	at org.apache.harmony.drlvm.tests.regression.h4514.Test.testTrace5(Test.java:80)
	at java.lang.reflect.VMReflection.invokeMethod(VMReflection.java)

***********************************************************
Modifications since last successful build:	(2)
            
add cc-hdk log20071103214528Lbuild.323 11/03/2007 21:45:28hdk
add cc-hdk log20071103214528Lbuild.323 11/03/2007 21:45:28hdk

begin 644 execution_log.zip
M4$L#! H    ( & &9#>\6*#O0 P  +^$   2    97AE8W5T:6]N7VQO9RYH
M=&UL[1UK;]I*]GM^Q4A7J[LKW8S?KVP;*6G2FT1)6@5Z=U=5%1E["&YL#QK;
M"?37[QD;DA+ -N#!=!<4$0SS..]SYISQ^-T@C<+C=SWJCX_?#1DY?N>B)!V'
MY/WO?1JGATGP@QPA6_[;/W\_/LB&OIN2P^0I/CHX."RNX!/+X!HA]-4G(4G)
M-W3&_P?Q [)MU ]"DJ ^HQ&2R&A(62IE"6&)Y'GP=^C1***QU,N"T)<82;(P
M322?A4_1(2,/ARE)4CXT#/[=?7*_H5/>D(]YA"+WD10=\2@*9UK-7 "XAS[ 
MY:5'Y8V&C Y+FI!12EA\[Y,WC8K/Q!M0^/PEX7A_N#[I=*XO3]'[:J2] ?$>
M:09H#_Q'Z9FR1QCAW@O=) F#WG)P"I0P3;#+O 'V1B/L]1]*X _B(,59'(RJ
MVCP'<543P "$)4F(CR/JDS+"DA0G) H2[ <LJ6A8D-@-R]H-P^PAB+$;IQX(
M* MZU6V]X3!UD\>R43E6R]GZ@<;]X"%C;AK0N(3[_'5!DUSVK^!GX+^"#2S?
MRP[Z>R>+T4W@,9J,DY1$";J,/?R/TL&F4H 8I6G#PC0'^.N+)C#7=1!GHWH]
MN !"#Q*9>EIS#A!7Z/'@>77;]Q^@O4]ZV4-Y#U!DQ,A3D "GH(?A**9F54W"
MQ9G&)$Z3?))A2,>5< W&.*8X"3A<?1!94MH#6H?4<T/\@[-S48^9"[!]F-N^
M$HGE,(,=?#&3"=@O,G09F9?/K]$C*!^(,2-@L7T$%T?KRM)3-/DYC$?W.<?O
M@8OW.6>D' YI"CR,R@6/)+L#4 P:_%1"]WFB?B]A0557^/X-,[Z"'/"/'K<I
MO#VW%(Z#$IHQCTR<94I;8TX%1@7Y=DC "H"D"QE>TCWM?9]70KCR@-P*D#5U
MPU<2]\@401\O[=5)799;<V#48[FZDJC'O:$;!_TYQ=T)&JF*H>QI5$$CVW'V
M-*J@D:.:>QJ5TTB356M/HRH:6?J>1A4T4K2]7ZNBD:;L=:V21OK>]U?12)?W
M]JB*1H9L[&E402/3L?<TJJ"1M?=KU32R]_:HBD:VLZ=1%8T<>;^FK:21K>YI
M5$XCW5#V,60UC?9R5$4CQ]K;HPH:&;*ZR[HV<Q&Z6>P-B@K!#I&2$3[%?.UI
M6I6K+/"]K_.J'*4+P #:5W_=B$&[J%9*WZ']=T:D7A!+')@M8;<>=8M-$F3D
MA9E?%+W6KVT#<1+FY=SGS.>;$@+H,AD\F7[ (2]GXY%MWILZJBCA5R'W&SHO
M1O5!ZSP7($:TCRY.[FX^W?[G4%=-8VG7"\4VG.J!43H(0*L!J9<90(*ZEPB^
MC6F*@F@8DHC$7+3ZE*$)7D&,KBZ[B&_)0&.RO!:?UX)V  I'-=N'@N?J=P *
M6!'O !2F8^\ %+"JVP$H8-VT"U#8:OM0\+BV?2AX%GLM*#J?SM' C?U\N\4$
M&(A'_/$\&-)?-Q6D*#/OO^7^'GG,3080EM&83UTVEK,#9.4+N_7#I)]?)1%E
M%A_.;V@J/F9QD'Y#=UD<<_90]H#=H0O>'@]<!NY_C//]H$58AU]]/![P71_X
M+&#$2T_'*3G-^GW"NF^WC/X\"?\QX< <(?4/]-$-P@Q&.T+R'^B<,<J*C]T@
M(HB$[C A/GR!==M "?&VB]V%8E@VOG5OZR*DUT5(PY9ASB&T(2\4T] !9G@7
MP !3L;;/@(%BZ3:^C-/^B>?!=W7Q4NKSP5&55O"R;>SV/+]QR3*P8]B-2Y8-
M6GX^(E[C# #-UM>D_]Q>]ZUNJ)2 ?%)!/FE"OF+3_&N'Z4*(DT^5;H)\KW;>
MO6'>J/A+#-<T?"+^9Y>YD0 ]L;5Y/OVJ3.@.&'UV>R$1SHT+'O'4=X@K\,,R
MM3;LEJW+N)-'.TDJPABH:O.V2R3(P AUWI%O@Q&&"G'7$_A&$=&6NJYP_4KV
MP+"V80\,"XN0.KV5L,4VE>:QX?(F(&0Q-0B&X;UQ>!4'*ZK3PG)$E4&8.N.X
M^3!,QVNOKWX=C5=E6RL/PZ8+ZQ?>P/K]O-ND6'(81&B0J2S6H 48??K\"V"D
M8TV>7W NP2B(4\*&#*20[3YF"M9:64H#-GKSV$ 4HEJ-9S( 5E.(GUEWK;F9
MU794 6($.F_,1VF[":L%R\=Y_[*ID"BR$%.JZRVLK"Y411& #5^WSZ^H:F(S
M9VE7X8UCXFM*A^>CQ<'*=.S/)YW.^1DZ:FSP+1A2U7" 7^J"(O*F(5@;,;VJ
M0DQ_]^%\2SFC+2"D:<;+@O\ZZ#&7C3^[Z4"$J5A;N7ZAJ-G4=:F3#0G[P#LW
MOT3F$^!32E-.BH?\? <1*0VMC32-:EH./LN&(A!JPTT-5%Z0:3Z*Q):]MIO:
MQ.E:EH8OXSX_>F3<.(]XEF;Q&F83!MBRC0%@(8'/?%)C8VAU$]_2OP@+^K4)
MO)(!GE_V;D%L;!";.U*[S+**Q!AMU+D!(0%K0\W$FM/*4M=V''SCQN,3]M!\
MS5C&AO._GRS39-V6;L808I,A=\G-^WT^ [[@[XW;L<;7FIIL"DCC+S:YXO6#
MW_8O!!NSC06,)CLVODK8+;TC8FJ23:=9!(/,O4@+3D13%!E_#$A8>U/+"G[1
ML=J(=C5%53ABZOSFO W#W7;T7M%D_,$-P]O\'A<1GO'_H(RD*89<].O2'-AE
M96/QM1<.BICJ\MK:M@VD+:,VTALNUK:@DZIBXI..B/1;.WL$-%4U\&>:!-S$
M@(^KC=A*U<[F(SP.]FV>?UH);&,%J)NO@>107SG\($, O!>N KFVRH*G)4GB
M"P1X;U8Q%'!3:[O?#8HBFFJ8?#,S82P;IAPH_U]NP'U=XR62%:;:!A]M#5_!
M2"*3\1JLI=JQWW9];[2*\6XCLS7@!WGA/TF:A_%G!.(:!B/DB7\1T:+21DY>
MTVP97U-0!7H:I"+PTJUV>&<+J-TOSK%N:@FGH/Z[6:NW>-@MD%Z7=9R?7K:%
M5-8VT-%-W,EZ\"<DG])&59@?F_9BV6ZH'_0#6%5NR:AM#+L(S5:Q*<^'=9N"
M:BH._M3[3KR4FU@>= @ O*5$HVD(8(,.T74KN2W3$%#)A<#%6GBCT.Z!RBU1
M*_&'Z0C81,^7^ZU$'98B8*LFCW];40H(NX5@L_8--9MA8]27M%4R958K*RUK
MA0W,*]WLU(H5L$7HC;[P?N:-054%^#VCK>#6-E4>W+)3FL7^\HKV>CD^B)P;
M)[\C\WO@G^BCB(J-;K2P\0IP,E:H0,LK;#DUVU!F7;;$;$5O_G98,:!N4FSX
M=2I_X"DLZ8Y$](G<"+A7E __T[WC)XRYX_.01 US:M&M&%M0$4.IK_$S!M>H
M.!BF?+G!1UT+3O3QY/+Z_&SW::!C94&^41@-MB$JEI-_W7@BLXU-%[KAU"\0
MK%"3T]NX!9EC(R1LE9MW=.8J(4;]W)/MM)&^U$W+X.<]Y'4+$<+4>&E:MV0!
MDJ)BRVS%?:VRE%ZE:-E&]*U#E"P&F3:R'+J8S>NX^3RF&$BY8VLC'<X/$<<G
M:0J-/V2,D3CM#OB)CLO!^'G"]^^/T<OF<N2Y8=ASO<>ES9/IJ=G%\=PHS:?"
M>/Z<[6F/9S=(\[,87WNXKL^/Z>:W^R2#MWV7#O1U9LIOD_\<HI341/;M$&Y.
M-8Y./V 09J7 T#)<WO;WR6;]7^<'L:&QOP$ )0.L2M&"+S!HO5$BD@ZH?P]R
MQ\;W'LUB_GAFP] 59?Y$X[=]1D$ZTT76ZLW9/>]T)Z7IFAW64FAK06RWH;;R
MX^RWN3M@ U#YV8A",ET5]1'^-/O#XLSZ64-9S%O\ K,S-T[ L$2YT$-( @&^
M%BW?_EOKF/>RD][O7FB3GT#+J5G  C8N 3M$&?'1VP?&-PK!%A\6( W2*&P6
MDYF+'%+@<I*%;Y^5,'-Q^N7R^FS1^G=36G I*S[B410>&;IUA+H# JXJ#.DS
M9R[A,HRHYW&OZJ/G 3^=GXR(E^6\SX\B#H/XS4.@&X$+O.P#^8DM&)0L!U.1
MC1Q,1M S?^,_HOY$\Y93L9L_(*/0$\U$41!GT!,5.T#HV_3[%;R#M'/6@&9/
M?O+H<,P?U3T<<^1M<X4G=$^X7.3S7IZA?3"1J!_!$-C,&_*!X:I&WG'QB/>J
M+%N*(NOWLJSH&(8Z.. LG? ,]+:0(_0<I /@WPRSIS'0T<&Z4E "M>N[0[ /
M;P&>?I^SUM)G.#O;\I7'[R3W^)TT9 3>>]0?PS^NJL?_!5!+ 0(4 PH    (
M & &9#>\6*#O0 P  +^$   2              "D@0    !E>&5C=71I;VY?
>;&]G+FAT;6Q02P4&      $  0!     < P      
end

Mime
View raw message