harmony-alerts mailing list archives

Site index · List index
Message view « Date » · « Thread »
Top « Date » · « Thread »
From nom...@intel.com
Subject [build-test alert] FAILED Windows 2003 x86: jdktools-test debug
Date Fri, 02 Nov 2007 20:47:26 GMT

BUILD FAILED:
	Ant Error Message:
D:\cc\cc-common\scripts\cc-exec-adaptor.xml:104: The following error occurred while executing
this line: D:\cc\cc-common\adaptors\jdktools-test\adaptor.xml:28: The following error occurred
while executing this line: D:\cc\cc-common\build\checkouts\hdk\working_jdktools\build.xml:242:
The following error occurred while executing this line: D:\cc\cc-common\build\checkouts\hdk\working_jdktools\make\build-test.xml:97:
There were test errors.

Date of build:	2007-11-03 02:08:15 +0600
Time to build:	39 minutes 4 seconds
Last changed:	11/02/2007 21:31:46
Last log entry:	hdk

***********************************************************
Errors/Warnings:	(229)
            
Result: 1
[cc-ant]: Test Suite 'jdktools-test' execution. Repository updated: ${repository.updated}
[cc-ant]: Check for 'run' failure of hdk = ${hdk.parameters.run.failed}
[cc-ant]: Result: failed.superiors = '${failed.superiors}'
========================================
Testing jdktools binaries...
========================================
Compiling JPDA tests
Since fork is false, ignoring memoryMaximumSize setting
----------
1. WARNING in D:\cc\cc-common\build\checkouts\hdk\working_jdktools\modules\jpda\test\common\unit\org\apache\harmony\jpda\tests\framework\DebuggeeRegister.java
(at line 58)
registered.add(debuggee);
^^^^^^^^^^^^^^^^^^^^^^^^
Type safety: The method add(Object) belongs to the raw type LinkedList. References to generic
type LinkedList<E> should be parameterized
----------
----------
2. WARNING in D:\cc\cc-common\build\checkouts\hdk\working_jdktools\modules\jpda\test\common\unit\org\apache\harmony\jpda\tests\framework\TestOptions.java
(at line 505)
internalProperties.put(name, value);
^^^^^^^^^^^^^^^^^^^^^^^^^^^^^^^^^^^
Type safety: The method put(Object, Object) belongs to the raw type HashMap. References to
generic type HashMap<K,V> should be parameterized
----------
----------
3. WARNING in D:\cc\cc-common\build\checkouts\hdk\working_jdktools\modules\jpda\test\common\unit\org\apache\harmony\jpda\tests\framework\jdwp\PacketDispatcher.java
(at line 114)
eventQueue.add(eventPacket);
^^^^^^^^^^^^^^^^^^^^^^^^^^^
Type safety: The method add(Object) belongs to the raw type List. References to generic type
List<E> should be parameterized
----------
4. WARNING in D:\cc\cc-common\build\checkouts\hdk\working_jdktools\modules\jpda\test\common\unit\org\apache\harmony\jpda\tests\framework\jdwp\PacketDispatcher.java
(at line 249)
replies.put(new Integer(replyPacket.getId()),
replyPacket);
^^^^^^^^^^^^^^^^^^^^^^^^^^^^^^^^^^^^^^^^^^^^^^^^^^^^^^^^^^^^^^^^^^^^^^^^^^^^^^^^^^^^^^^^^^^
Type safety: The method put(Object, Object) belongs to the raw type Hashtable. References
to generic type Hashtable<K,V> should be parameterized
----------
5. WARNING in D:\cc\cc-common\build\checkouts\hdk\working_jdktools\modules\jpda\test\common\unit\org\apache\harmony\jpda\tests\framework\jdwp\PacketDispatcher.java
(at line 284)
commands.put(Id, command);
^^^^^^^^^^^^^^^^^^^^^^^^^
Type safety: The method put(Object, Object) belongs to the raw type Hashtable. References
to generic type Hashtable<K,V> should be parameterized
----------
6. WARNING in D:\cc\cc-common\build\checkouts\hdk\working_jdktools\modules\jpda\test\common\unit\org\apache\harmony\jpda\tests\framework\jdwp\PacketDispatcher.java
(at line 355)
commands.put(Id, command);
^^^^^^^^^^^^^^^^^^^^^^^^^
Type safety: The method put(Object, Object) belongs to the raw type Hashtable. References
to generic type Hashtable<K,V> should be parameterized
----------
----------
7. WARNING in D:\cc\cc-common\build\checkouts\hdk\working_jdktools\modules\jpda\test\common\unit\org\apache\harmony\jpda\tests\framework\jdwp\VmMirror.java
(at line 1834)
frames.add(frame);
^^^^^^^^^^^^^^^^^
Type safety: The method add(Object) belongs to the raw type ArrayList. References to generic
type ArrayList<E> should be parameterized
----------
8. WARNING in D:\cc\cc-common\build\checkouts\hdk\working_jdktools\modules\jpda\test\common\unit\org\apache\harmony\jpda\tests\framework\jdwp\VmMirror.java
(at line 1902)
vars.add(var);
^^^^^^^^^^^^^
Type safety: The method add(Object) belongs to the raw type ArrayList. References to generic
type ArrayList<E> should be parameterized
----------
9. WARNING in D:\cc\cc-common\build\checkouts\hdk\working_jdktools\modules\jpda\test\common\unit\org\apache\harmony\jpda\tests\framework\jdwp\VmMirror.java
(at line 2122)
fields.add(superClassFields.toArray()[i]);
^^^^^^^^^^^^^^^^^^^^^^^^^^^^^^^^^^^^^^^^^
Type safety: The method add(Object) belongs to the raw type ArrayList. References to generic
type ArrayList<E> should be parameterized
----------
10. WARNING in D:\cc\cc-common\build\checkouts\hdk\working_jdktools\modules\jpda\test\common\unit\org\apache\harmony\jpda\tests\framework\jdwp\VmMirror.java
(at line 2132)
fields.add(field);
^^^^^^^^^^^^^^^^^
Type safety: The method add(Object) belongs to the raw type ArrayList. References to generic
type ArrayList<E> should be parameterized
----------
----------
11. WARNING in D:\cc\cc-common\build\checkouts\hdk\working_jdktools\modules\jpda\test\common\unit\org\apache\harmony\jpda\tests\jdwp\DebuggerOnDemand\OnthowDebuggerLaunchDebuggee.java
(at line 94)
class ExceptionForDebugger extends Exception {
^^^^^^^^^^^^^^^^^^^^
The serializable class ExceptionForDebugger does not declare a static final serialVersionUID
field of type long
----------
----------
12. WARNING in D:\cc\cc-common\build\checkouts\hdk\working_jdktools\modules\jpda\test\common\unit\org\apache\harmony\jpda\tests\jdwp\Events\ClassUnloadDebuggee.java
(at line 32)
import java.util.LinkedList;
^^^^^^^^^^^^^^^^^^^^
The import java.util.LinkedList is never used
----------
13. WARNING in D:\cc\cc-common\build\checkouts\hdk\working_jdktools\modules\jpda\test\common\unit\org\apache\harmony\jpda\tests\jdwp\Events\ClassUnloadDebuggee.java
(at line 97)
boolean isOutOfMemory = false;
^^^^^^^^^^^^^
The local variable isOutOfMemory is never read
----------
14. WARNING in D:\cc\cc-common\build\checkouts\hdk\working_jdktools\modules\jpda\test\common\unit\org\apache\harmony\jpda\tests\jdwp\Events\ClassUnloadDebuggee.java
(at line 171)
public Class loadClass(String name) throws ClassNotFoundException {
^^^^^
Type safety: The return type Class for loadClass(String) from the type ClassUnloadDebuggee.CustomLoader
needs unchecked conversion to conform to Class<?> from the type ClassLoader
----------
15. WARNING in D:\cc\cc-common\build\checkouts\hdk\working_jdktools\modules\jpda\test\common\unit\org\apache\harmony\jpda\tests\jdwp\Events\ClassUnloadDebuggee.java
(at line 179)
public Class findClass(String name) throws ClassNotFoundException {
^^^^^
Type safety: The return type Class for findClass(String) from the type ClassUnloadDebuggee.CustomLoader
needs unchecked conversion to conform to Class<?> from the type ClassLoader
----------
----------
16. WARNING in D:\cc\cc-common\build\checkouts\hdk\working_jdktools\modules\jpda\test\common\unit\org\apache\harmony\jpda\tests\jdwp\Events\CombinedEvents002Test.java
(at line 100)
boolean expectColocatedEvents = (testedMethodStartCodeIndex == testedMethodEndCodeIndex);
^^^^^^^^^^^^^^^^^^^^^
The local variable expectColocatedEvents is never read
----------
----------
17. WARNING in D:\cc\cc-common\build\checkouts\hdk\working_jdktools\modules\jpda\test\common\unit\org\apache\harmony\jpda\tests\jdwp\Events\CombinedEvents003Test.java
(at line 53)
private boolean eventMethodExitReceived = false;
^^^^^^^^^^^^^^^^^^^^^^^
The field CombinedEvents003Test.eventMethodExitReceived is never read locally
----------
18. WARNING in D:\cc\cc-common\build\checkouts\hdk\working_jdktools\modules\jpda\test\common\unit\org\apache\harmony\jpda\tests\jdwp\Events\CombinedEvents003Test.java
(at line 76)
int EXPECTED_EVENTS_COUNT = EXPECTED_EVENTS_ARRAY.length;
^^^^^^^^^^^^^^^^^^^^^
The local variable EXPECTED_EVENTS_COUNT is never read
----------
----------
19. WARNING in D:\cc\cc-common\build\checkouts\hdk\working_jdktools\modules\jpda\test\common\unit\org\apache\harmony\jpda\tests\jdwp\Events\CombinedEventsTest.java
(at line 84)
int EXPECTED_EVENTS_COUNT = EXPECTED_EVENTS_ARRAY.length;
^^^^^^^^^^^^^^^^^^^^^
The local variable EXPECTED_EVENTS_COUNT is never read
----------
20. WARNING in D:\cc\cc-common\build\checkouts\hdk\working_jdktools\modules\jpda\test\common\unit\org\apache\harmony\jpda\tests\jdwp\Events\CombinedEventsTest.java
(at line 212)
int EXPECTED_EVENTS_COUNT = EXPECTED_EVENTS_ARRAY.length;
^^^^^^^^^^^^^^^^^^^^^
The local variable EXPECTED_EVENTS_COUNT is never read
----------
21. WARNING in D:\cc\cc-common\build\checkouts\hdk\working_jdktools\modules\jpda\test\common\unit\org\apache\harmony\jpda\tests\jdwp\Events\CombinedEventsTest.java
(at line 348)
int EXPECTED_EVENTS_COUNT = EXPECTED_EVENTS_ARRAY.length;
^^^^^^^^^^^^^^^^^^^^^
The local variable EXPECTED_EVENTS_COUNT is never read
----------
22. WARNING in D:\cc\cc-common\build\checkouts\hdk\working_jdktools\modules\jpda\test\common\unit\org\apache\harmony\jpda\tests\jdwp\Events\CombinedEventsTest.java
(at line 732)
String failureMessage = "## FAILURE during checking events! !";
^^^^^^^^^^^^^^
The local variable failureMessage is never read
----------
23. WARNING in D:\cc\cc-common\build\checkouts\hdk\working_jdktools\modules\jpda\test\common\unit\org\apache\harmony\jpda\tests\jdwp\Events\CombinedEventsTest.java
(at line 894)
String failureMessage = "## FAILURE during checking events !";
^^^^^^^^^^^^^^
The local variable failureMessage is never read
----------
----------
24. WARNING in D:\cc\cc-common\build\checkouts\hdk\working_jdktools\modules\jpda\test\common\unit\org\apache\harmony\jpda\tests\jdwp\Events\CombinedEventsTestCase.java
(at line 135)
long methodStartCodeIndex = lineTableReply.getNextValueAsLong();
^^^^^^^^^^^^^^^^^^^^
The local variable methodStartCodeIndex is never read
----------
25. WARNING in D:\cc\cc-common\build\checkouts\hdk\working_jdktools\modules\jpda\test\common\unit\org\apache\harmony\jpda\tests\jdwp\Events\CombinedEventsTestCase.java
(at line 187)
long methodStartCodeIndex = reply.getNextValueAsLong();
^^^^^^^^^^^^^^^^^^^^
The local variable methodStartCodeIndex is never read
----------
----------
26. WARNING in D:\cc\cc-common\build\checkouts\hdk\working_jdktools\modules\jpda\test\common\unit\org\apache\harmony\jpda\tests\jdwp\Events\ExceptionTest.java
(at line 188)
long frameID = reply.getNextValueAsFrameID();
^^^^^^^
The local variable frameID is never read
----------
----------
27. WARNING in D:\cc\cc-common\build\checkouts\hdk\working_jdktools\modules\jpda\test\common\unit\org\apache\harmony\jpda\tests\jdwp\ThreadReference\FramesTest.java
(at line 450)
frames.add(new FrameStruct(frameID, loc));
^^^^^^^^^^^^^^^^^^^^^^^^^^^^^^^^^^^^^^^^^
Type safety: The method add(Object) belongs to the raw type Vector. References to generic
type Vector<E> should be parameterized
----------
----------
28. WARNING in D:\cc\cc-common\build\checkouts\hdk\working_jdktools\modules\jpda\test\common\unit\org\apache\harmony\jpda\tests\jdwp\share\JDWPUnitDebuggeeProcessWrapper.java
(at line 233)
argv.add(val);
^^^^^^^^^^^^^
Type safety: The method add(Object) belongs to the raw type Vector. References to generic
type Vector<E> should be parameterized
----------
29. WARNING in D:\cc\cc-common\build\checkouts\hdk\working_jdktools\modules\jpda\test\common\unit\org\apache\harmony\jpda\tests\jdwp\share\JDWPUnitDebuggeeProcessWrapper.java
(at line 253)
return (String[])argv.toArray(args);
^^^^^^^^^^^^^^^^^^
Type safety: The method toArray(Object[]) belongs to the raw type Vector. References to generic
type Vector<E> should be parameterized
----------
29 problems (29 warnings)
JPDA exclude list: D:\cc\cc-common\build\checkouts\hdk\working_classlib\deploy\build\jdktools.jpda.exclude
Running JPDA tests
Debugger JVM=D:\cc\cc-common\build\checkouts\hdk\target\hdk\jdk\jre/bin/java
Debuggee JVM=D:\cc\cc-common\build\checkouts\hdk\target\hdk\jdk\jre/bin/java
SAMSA exclude list: D:\cc\cc-common\build\checkouts\hdk\working_classlib\deploy\build\jdktools.samsa.exclude
Running SAMSA tests
test.jre.home=D:\cc\cc-common\build\checkouts\hdk\target\hdk\jdk\jre
Run jdk/bin/java -version in D:\cc\cc-common\build\checkouts\hdk\working_jdktools\build\test_report
java version "1.5.0"
pre-alpha : not complete or compatible
svn = r591364, (Nov  2 2007), Windows/ia32/msvc 1310, debug build
http://harmony.apache.org
Run jdk/bin/javac -version in D:\cc\cc-common\build\checkouts\hdk\working_jdktools\build\test_report
Run jdk/bin/javah in D:\cc\cc-common\build\checkouts\hdk\working_jdktools\build\test_report
Run jdk/bin/javadoc in D:\cc\cc-common\build\checkouts\hdk\working_jdktools\build\test_report
Run jdk/bin/jarsigner in D:\cc\cc-common\build\checkouts\hdk\working_jdktools\build\test_report
Run jdk/bin/keytool -help in D:\cc\cc-common\build\checkouts\hdk\working_jdktools\build\test_report
Compiling TOOLS tests
Since fork is false, ignoring memoryMaximumSize setting
----------
1. WARNING in D:\cc\cc-common\build\checkouts\hdk\working_jdktools\modules\tools\src\test\java\org\apache\harmony\tests\tools\javah\Test\Test01.java
(at line 24)
private static final long xxx2 = 1;
^^^^
The field Test01.xxx2 is never read locally
----------
1 problem (1 warning)
TOOLS exclude list: D:\cc\cc-common\build\checkouts\hdk\working_classlib\deploy\build\jdktools.tools.exclude
Running TOOLS tests
test.jre.home=D:\cc\cc-common\build\checkouts\hdk\target\hdk\jdk\jre
The test report is in D:\cc\cc-common\build\checkouts\hdk\working_jdktools\build\test_report\html\index.html
The execution FAILED with the following exception:
The following error occurred while executing this line:
D:\cc\cc-common\adaptors\jdktools-test\adaptor.xml:28: The following error occurred while
executing this line:
D:\cc\cc-common\build\checkouts\hdk\working_jdktools\build.xml:242: The following error occurred
while executing this line:
D:\cc\cc-common\build\checkouts\hdk\working_jdktools\make\build-test.xml:97: There were test
errors.

***********************************************************
Unit Tests: (161)
        
error: testReflectedType001 org.apache.harmony.jpda.tests.jdwp.ClassObjectReference.ReflectedTypeTest
Unit Test Error Details:	(1)
                
Test: testReflectedType001Class: org.apache.harmony.jpda.tests.jdwp.ClassObjectReference.ReflectedTypeTestorg.apache.harmony.jpda.tests.framework.TestErrorException:
Debuggee process did not finish during timeout
	at org.apache.harmony.jpda.tests.jdwp.share.JDWPUnitDebuggeeProcessWrapper.WaitForProcessExit(JDWPUnitDebuggeeProcessWrapper.java:284)
	at org.apache.harmony.jpda.tests.jdwp.share.JDWPUnitDebuggeeProcessWrapper.finishProcessAndRedirectors(JDWPUnitDebuggeeProcessWrapper.java:87)
	at org.apache.harmony.jpda.tests.jdwp.share.JDWPUnitDebuggeeWrapper.stop(JDWPUnitDebuggeeWrapper.java:109)
	at org.apache.harmony.jpda.tests.jdwp.share.JDWPTestCase.internalTearDown(JDWPTestCase.java:108)
	at org.apache.harmony.jpda.tests.jdwp.share.JDWPSyncTestCase.internalTearDown(JDWPSyncTestCase.java:83)
	at org.apache.harmony.jpda.tests.jdwp.share.JDWPRawTestCase.tearDown(JDWPRawTestCase.java:118)
Caused by: java.lang.IllegalThreadStateException: process has not exited
	at java.lang.Runtime$SubProcess.exitValue(Runtime.java:357)
	at org.apache.harmony.jpda.tests.jdwp.share.JDWPUnitDebuggeeProcessWrapper.WaitForProcessExit(JDWPUnitDebuggeeProcessWrapper.java:279)
	at org.apache.harmony.jpda.tests.jdwp.share.JDWPUnitDebuggeeProcessWrapper.finishProcessAndRedirectors(JDWPUnitDebuggeeProcessWrapper.java:87)
	... 14 more

***********************************************************
Modifications since last successful build:	(1)
            
add cc-hdk log20071102213146Lbuild.316 11/02/2007 21:31:46hdk

begin 644 execution_log.zip
M4$L#! H    ( .L58S?^>3-*2Q(  $]_   2    97AE8W5T:6]N7VQO9RYH
M=&UL[3W]4]LZMC_3F?X/VKOS9F&&N/DDD$UYPP.ZI;>4/D)[WYNFCQ&VDA@<
MRRO90+9S__=WCF0GL9TX(8@2.INYE]JR='1TOG4L2^U!./3VVU?<&>VW \'V
MVY3(<.2QMW_K<3\L2?=?K$5VR__Q][_MOWX5!0X-64G>^JW7KUZ_*DD61D'I
MVKD).?=DZ4[JXKA:MEQ$V.PH"CS7AN<."02_9G9(?#IDQ/6).PRX""WR.2Z_
MX$'I([ME'M8,F A'Q&$]UW=#E_M27P.8GBMDB.V/6EW;AO]*-A\.N=^5MG"#
M4';CUBZ3UOW0(]1W".U3[##?YBIR/:=K#YA]PR-H.W!NNG=<W+A^_S(94'=(
M;U@&*@XP9#*$$1+\?6/V@'\GK]XN^7MU 8VA$Y)T0JY<GPJ$;EG+0T$T;(]1
MOX3(R!*,(8A"17Z;!Z/2M6"EGNLQS1%[,.1.MBRNUDI&5((ZD7ZJ!C:\<5SQ
MG1P*II@(-ZW5J*@K81>7@B'GGZX#B8-1MYHN&2X=\F'@>DC]#Y^/#DC<XLF0
MZ=H>E9(E75S36VI/(U%M5HCDD; 947PA(7^B/CNNCYU .^)*TJ.>9-O$[?M<
M(!Y#-N1B=$KOW6$T[( E(*#P**1I(*7Q+UU>L<@?!^>?3C[]8W5%TZ+7O0:+
MHL;1C5M'8 2Z7/2[-*  HSN@ HI'DXJRVQ-@5A!B]XA=1?T^8^>L[\J0"0L1
M3.-*-FE(@/B,-':WTH\V1-R,.19UG$TGAK;U=Y*I^']S?NEJ%Z, "$E[+!RU
MR,6  9G# 0>3!+#/KM#P;9$KYG&_KQ@?0@U![TB(S3ZZ_@US/@(Z%CEG/< )
M^*>J]9G/A&MGJ[6/]XD<\,AS "8)*-($A@*\=)9CXKSRZKHP%^WF6: \0C%?
MRXTL8UT?2.%3[_/$DH.QW$1WM$UNJ1<!CY=D\8.YC1UI;F^315Q_3^7@E :%
M+(_KM'_?_OI$'*^M"\>OG;N@^YG:-RP\<F5 0VA1K-.52CW+>P@K_/"_(Q8Q
MI=3J5L-\",]-:O9"G3:@S?67R\-J?2]OF"&43)26W9$3T.<^$YM8/M+ K3X+
M3YS-K:WM#-P%ORD0J]B 57]/8SM">N6QA=9#U3)@/QHO6,9V<W8".X8)@Q:R
M$V>;Q 7+2\6OP-.=E\O36B/G]__-TZ+RYEKQ^NOPU!6"+_#ON[6<XBHX4CEW
M=;F8N>:<^8$0=+30HX]K/=JM[[Y ENV5JUF6W5*A&087Q>QZN:S:>WFLJE:J
M.5;U7.8YFEDR@LG3(687WNG"D"MR;6Y]<[^O'CR]7!97RB^1Q[4B'JO+7]F"
MSN7E,R>Q% ?C_)4X\X\8QBG=,Q\(>9<4?Z21;P^2)%<AF_?R\2TJ+CF^MYG*
MH;SC(@%+V'W(($J:/"0_,HWU7&D)[1U@ZE"XU'/_A=$+*>C5X<!HGX?$85!+
M,((O)&@(+.^Y/O5B.%^9D-#PR\D14;))>$^+!(K3(UG^S*DMQ?)CS$?(KC*K
M7WR/4V<I_N:56+]3(7AK1:'K69/<8%:=R4/860 74\D^NP5>1G)IF_G,V:7'
M$'VOF27Z%>##J ^$.(O"L]ZIRJ.3MSK!/H?L9 '!/6Z#]$-DY"H-2H,>4UPP
MNBS%GSD7]!B*5YJ5+,F#Z,H#&Z$@$02DKC8[H7J3@2G=+? P@M])7><3#]_Q
MR'<6&3>RC&,3+(R$KPV0QJ#'10Z++=(3?*C\W*1F9M2'D0SY\",4 3-]QL#\
MHG$'+C 'IJG^K;9[Z GA#GH9XJ6"U/[/_5D=:%A+RL0SYVX>)Q.Y_&!*)L![
MK(%,9+%8?YF8*RO/G!-*R0H?7N%2 'U;+E?QI5"QM)3+\XPVNP\@-#WD:'##
M!"88[TWLESFG*HCMA%1 '8>=^ Z[)V_?DNFGQ\#DY%DN:IYI[Y>V^[.Q6\'^
MS^7K,^=_BOA:6\C71BUG!(1["Y0B8_8BK)A-]VYXSFSFWH(B+?#.A5R;Q3<=
MELX>P3P<4FS4G/=&2[+MF7- CV-;<V?&NUER_#^?CP\OCH\NC[\>?[KH7!Z>
M??ET 8S*EA^<GQ_\K^4QOQ\.9O%O-4V;W;M)37OF7-!\EBWD5_X]R2_$K^HS
MYV\>P9=J)3\!_(48LP[)F-484ZOGEA7]2HQ9IY3)PQC3S*=,XOE!C[I>)-@I
MDY+V&3#EM[_^E;P[./GXY?R8.)&JH\:$%\JCR[^0O_RV5%9E(6LRG:_"DW7*
MJ#S0N^33E*OS9(U8,I=5ZY2*R;'JD,H%,^]:[@T[9F'C=']VIJ3:7"!%SW&-
M#2[0^<3NPZ^XW.X 9J9^?W/VE&DE$S<3AU6T:9TR(RNP:#>7HRQBD7A!G)G+
ML37*3XP32HOS$KNY.$$Q2KW3.SF:PYMW^FDQ>Q8;N+@/DTQ8AV3"Q0 ',GZ-
MV%746NR%ZHU<BFAJ30FN-U2 P#-%=K@9$V\;B;JU#F^]O\)3+@I?G^HJ3[=$
M?!U2$A(>L.Z'HS\^?X$624[UL^! $/F'H$&P:$U@+9=2HJ)_&Z]3\7[6.I6?
MQ\[J.J0E'L^V?"8PSLC'F?=OW[<4'Y/5*G CY^9JQ[]5-3;I1;,9^EX+1N-W
M=6#YAY)LPLT=%3X01F[AQU(!^!E@08G=VU[DL,P'4^HSJ?@1T%N&#_LH2KW^
M]]RKK@/.C(_BNHGT6"@,5@P]_G!PYF=;YY'OS_IH*WE.R'A5P8>OIV^7P1#"
M$7"MZO(:_Q?L#<1:;R:2EH/-S,'^=HWJ,1D7Z(FE]<2*]4231@W50CVQOKHB
MC*AW"I5 ZJUX603ZMC1(+)$$O\ DE6WR3D]E9(N4M\DQ+@[2EQ?ND!'FT4 R
MIX5K7W;J%2*9;0!6V:KN[!B#52\WC<&J56IK":M::ZP$JY*#M;MGE?=F$>RX
M<[&,D*EWAMIRC:V2!5<>%# '31ZBI>;AQT=&QKY3+1Y[;5E8M8K5G#GT":SJ
MLK"J%>!)W9P,UPS*<-,4O<H+Z55?%E9CQRB]F@9A57=6TZT<K+V:M5/>,X;7
M7K5J#%:CN5L(:V=96#LUJ]XHQFMY'0*\]@S:2$-L!%=7KIB#U2R;&Z(IK!9!
M6EJMZV;%M&X05JU:+/(/<^4&\3((J[)KSFU4S$5WE8:YZ*ZR:XZ-YO "[U\Q
MAU?5H(FHU0UZQ@5C?$BT5#$V>P#:[YI3(9-1B3$/!* 6!%X/FR"94\>=ID%K
MOV-0M0WB5:V8"^*,XF703)CT'$95R&1BH&HP86'0W-?V#+I:@^YQ7=U0O;&F
M<F_0W!L4>Z-F8DW-:J->S,:E<QSUBE$W5-\U.$5;,,8'Y4L,FB^C*F0PS#&;
MNS4H]Z;R2TOD<1I+Y^.J$,J9<T.UAL&0R>#LL;IK;HS&]+%J4.ZK!L>H\#)$
M^ZI)F:@LI-=#<H[U/7.RNF-05NN[YD(FDWGH16'T@VB_8"KZH-SQ@B3M\N\Y
M,&]OT#\:C O-94W,QG)K"\N4"EE[IB(Y<XIH,H VZ1CK.P:=O\FIL<'D^,^1
M]UEOS5=? /*>>U/K@@W@WK#*%4/^KEDW^ ZW9C#=@+!,S2-J!M6L9G0>80RO
M)M++E&[4#)HXP,N4J-;,A;(*EJE0HV;P':?!Y2Q--'&Q>+U^%?+('I3B[V6D
MVEN^-2EG"LA4*1OO,=]:O/*P<W#:><*EAY(.Y=3:0^S7YKY-@2Z?.'3KZDWZ
M];;L>)" SXG/\,M_$K+[<)LX7.TMP<.!VB=]\>)%/2!5(UT!BZQK ::?#]F*
M"PQS7>+Q N-5AZ24;!VQZCK?.5OX0X?WS/Y.#I3O(N^U[R)ZHRHF2(MLVEOD
MD <CX?8'(:GL[8&H5<LP4\ ULW&S#N^%=[@#E-J4@ZH-.;@@+DBGY]K,ER!&
MVX0"'P)UI 1NGIGN7PTR&>-O%0N<V6\D706DK42]8$ !*=QU"D8?>"QDV!->
M0[< -]U&WOKX(49CKU+;J6^3S4_\EI JXM_<VB9_N+[#[^0;E]:J;X;RU@:M
MK8#&J'WCB:)8&MP@#(/6FS>)AX\=/OC^8N[93\Z^8]MS0;_)!R2C/IX F%>V
MFDW@%E@B"T8U8>+)?YW"G0B0#F7%S:9%#CR/J,=@49ADXI8Y5O&P!D\UF@^?
M3DKJ:!,R8&HK%:W$:F4UQ277Z>KINR_XS5]K5D 6+UE&S*U3/%3D&]>[T7\G
M;;W-&6XT(_>+H(^;I(L)*5UQ'BHH((@#TL:_^TI'^BY$>425WKE 9%P"#J-F
MOH.FB&<!S?[APG.']6CDA?&6; BPD!" 4PX?_,W!"1?J_P24.&DC-_=3H%#V
M$)P^ V6,DF".*]3*59"TAZ E V:[/5>=.),S-3F4'-+6_7 Q&N.5H)22P 0Q
M.SYC!&0HU=UR&(X[(W<#UQ[DH?; <NION_ ;"BI&BT;@^J 9V6Y.5&%\F,B4
MZ*D/,Z ;&H5\"$93;5VRJ >P7U<<#$R6;;@CDXC](UH F,\LPC>E:]/05(R@
MM@?$35DBP(K\$R9,FI%3C9:CLL381-'S:H0[$X(MR$K".9,@O! \%=LYA]M/
M9ND _!&"UQLINNC1D(: ]8B%16B!.^DC?Y\,,='1'0R8%UBS3.S&!(D?L57\
MDWPX.%?Q(@&^T0RGIAJ@/+F]T8R&19(3M]J 'XD! &,1HH/M2;Y]Z8:-)*@:
M(^WDZE)9P@WU2:4.5+3 )<\S %29^I9G @%O 8(J7:)U@)([W;^4P X'((RQ
M2\KRV(\;3[7;(,E625 ^;DLVP7 X;J\'H8;>2FQ&GUM9!!7U@#':+%^B@F$'
MZJ"O>&S%%(:GBN&SVUN==RKXMHX@=%9&-,]295@VU*CXK0MS!>HXZN PZL4>
M(=>E!SJ2;@)#9G>) X&[@$N9CP=+-A,0X"@)<EP9>'1$L AL#&[2)<EF!+C<
MN> 7$Q%%[!,LL]0+)27MB\[!Y9?SC_L(,R54,.\" :## $WM@ LW'.7;8^\:
M!EY=*K69E@Q5D' "JDVCFX$&M+@?D?: @TX#"2&*D_L_6FU4[OT_%:G@L8KL
M0*NA$HDKJ2%BK6W"K+ZE*UJZH@4VI56!V>>LOK1:X-\QWZ=U(M7AYON+B\\8
MJG?.#G_O9 D9LU%H*Z\]!(*;6'T$:HM1$/*^H 'X3048)A>)"(@Y(%7C=H)?
M4JI@9K5-SD;C05BHO0.'U*=]=(ESS,*DIS1V$WM0@"8HG"D\T2MH:4<=IR$F
M >;WEL9UW*(06916\]A.JVQ!A],(3[<IQ'CHF,=W&.]$XKC]5/8@VV.:PNE6
M<Y#.A08@0^CA20D=]U.%!^F[W^,N(Q47I)\EZ/PHM>.S.[2M^'.Z1$<!6-;6
MEY?J3*_]/RW+(J4/;8S"DDJ%B/C\SD_.")$93#:4; CVSXV-?^B9)$L)!3R)
MQIGXJ49(*%MX&QN'>)5V%X+=)A8?M[Z.LA%/26_Z&4)C?3%1\9"#W>7A0 L+
M!.+9I@[#[ 9XE7,VY+>,@,N#*8-R[+/-RD:)W2.KH,FQND@-#_M3'AB-L P=
MGG6K&R688 -D:-YA,!=1N&)E'62X(IF PVBS+5'6H-W%  )9)7>)['(=0!(@
M$$T8DVVL-ZB&YB=ZIVJ:PGO3'L!<?0LA47+8.=?;:F1A (ZVQWT@U_C44JB.
MF"NRS:BN0B('N4K]?CJ2RM:&:,L/;<7&SWB)M-04S."JF)./D39*DGD]#6 L
M>A"Y0F$<@*6@*),Q3F "8CEH2529QK\HE-R8Q,Y?D\AYND]%Y"+5>H]<+%)P
M;6]^9+0\DZ:"\**UD6FBI2[;=S[;O,RAH!=G9Q\[J5-!XR_H)U4:_SZP,[7Q
M@[Z3PM:[/V 'L[9]T"/5E54*31WGJ/Z4*PN.@YNWT6OJM "U><[]_7V5O"65
MA;L[C'^S]\O16[K&R"F@C]FP-=E\@6Q6DJT7EMAY0<OBD[W_T']_YON/G'*9
M?_^QQ&OUR>CQ, ,9OV&'$*2#YD_OE]VAP.G"U^I++V6J68VZH5>5#:NQX 7]
MTEB5K7*RWO&Q+_%T@%,"0U5BPR <Z<(X33A5E"_!%%U)1X=PKX>C;V%0@OI2
M;W .B+=(O;E;'6;$!A45L2&Z$:JHL7"UBZ>E=UW<JLS"2\17PAP\G"#\^A5X
MGNE;30A%'Z$S@Z]?O4(DT2=%*LC32T"TAU992HXI4+6%8;)Q6$LUF7J ]"?<
MMB,A0/?N!JXWA@B/0PR9T$[B@>N9H5.'PAQ#R+'2*^228CS+O%7=U9O7&.EO
M>5+KONO5G]VY.LY]$@@H-/::"@L(?>[PCY(H+?06,+7]ANZWWX"EAK]7W!G!
M/R@/^_\/4$L! A0#"@    @ ZQ5C-_YY,TI+$@  3W\  !(             
M *2!     &5X96-U=&EO;E]L;V<N:'1M;%!+!08      0 ! $    ![$@  
"   ! 
end

Mime
View raw message