harmony-alerts mailing list archives

Site index · List index
Message view « Date » · « Thread »
Top « Date » · « Thread »
From nom...@intel.com
Subject [build-test alert] FAILED Linux x86_64: struts_test
Date Thu, 01 Nov 2007 22:29:55 GMT
svn.revision=590919
BUILD FAILED:
	Ant Error Message:
/export/users/cc/cc-suites/scripts/cc-exec-adaptor.xml:104: The following error occurred while
executing this line: /export/users/cc/cc-suites/adaptors/struts_test/adaptor.xml:67: The following
error occurred while executing this line: /export/users/cc/cc-suites/adaptors/struts_test/adaptor.xml:229:
Test failed

Date of build:	2007-11-02 04:29:20 +0600
Time to build:	28 seconds
Last changed:	11/01/2007 20:09:34
Last log entry:	snapshot

***********************************************************
Errors/Warnings:	(2)
            
The execution FAILED with the following exception:
The following error occurred while executing this line:
/export/users/cc/cc-suites/adaptors/struts_test/adaptor.xml:67: The following error occurred
while executing this line:
/export/users/cc/cc-suites/adaptors/struts_test/adaptor.xml:229: Test failed

***********************************************************
Unit Tests: (1)
        
error: unknown org.apache.harmony.struts.test.WebAppTest
Unit Test Error Details:	(1)
                
Test: unknownClass: org.apache.harmony.struts.test.WebAppTestjunit.framework.AssertionFailedError:
Lines number mismatch: local=244, remote=24
	at org.apache.harmony.struts.test.WebAppTest.checkResponse(Unknown Source)
	at org.apache.harmony.struts.test.WebAppTest.performTest(Unknown Source)
	at org.apache.harmony.struts.test.WebAppTest.visitAnchors(Unknown Source)
	at org.apache.harmony.struts.test.WebAppTest.visitAnchors(Unknown Source)
	at org.apache.harmony.struts.test.WebAppTest.launchSpiderR(Unknown Source)
	at org.apache.harmony.struts.test.WebAppTest.test(Unknown Source)
	at org.junit.internal.runners.TestMethodRunner.executeMethodBody(TestMethodRunner.java:99)
	at org.junit.internal.runners.TestMethodRunner.runUnprotected(TestMethodRunner.java:81)
	at org.junit.internal.runners.BeforeAndAfterRunner.runProtected(BeforeAndAfterRunner.java:34)
	at org.junit.internal.runners.TestMethodRunner.runMethod(TestMethodRunner.java:75)
	at org.junit.internal.runners.TestMethodRunner.run(TestMethodRunner.java:45)
	at org.junit.internal.runners.TestClassMethodsRunner.invokeTestMethod(TestClassMethodsRunner.java:71)
	at org.junit.internal.runners.TestClassMethodsRunner.run(TestClassMethodsRunner.java:35)
	at org.junit.internal.runners.TestClassRunner$1.runUnprotected(TestClassRunner.java:42)
	at org.junit.internal.runners.BeforeAndAfterRunner.runProtected(BeforeAndAfterRunner.java:34)
	at org.junit.internal.runners.TestClassRunner.run(TestClassRunner.java:52)
	at junit.framework.JUnit4TestAdapter.run(JUnit4TestAdapter.java:32)

***********************************************************
Modifications since last successful build:	(1)
            
add cc-snapshot log20071101200934Lbuild.29 11/01/2007 20:09:34snapshot

begin 644 execution_log.zip
M4$L#! H    ( +DC8C?@OA "Q@(  ,P&   2    97AE8W5T:6]N7VQO9RYH
M=&ULQ55;;],P%'[OKS@O: _,SF5KUX:N4K6+ (V+QA!(TX1<Y[3QEL21[?2"
M^/$<-^U*Z8 Q'HB:U#DGY_O.U>YGKL@'_9%.%X-^97#0%V#=(L?CO;$N';/J
M*R;0#9^]V!NTZBH5#IF=EDFKQ2RZNF)2EZER2I>69*8F#0!<IYBCPQLX]?^J
MG"00X+S2Q@6U16,#*>G';*T<VF!4JSP-#-HZ=S:PSM3.?B&%"Z1P(E>EX+IV
M#^)"J@Q*I\WB:03^P58*3P#7Q1U!WL")00HU]?A/]'T+NL4HMY4PR-8I(BJI
MJP4QT=-'$L%8Y0A._YE.9BCO*"5$6(K*9MH%67H7W/K;8)"K43#2VC4UHMM,
MT3 /Z<M&+NT*K1-F+?3O,Z$<&VNS_FZIQW15=C8MA)G\C%&7OU11T,SGHXG\
M^K8NE;N!R[HL?>3:3+BH!$7%,V$*72YXDTCN;?@G' VKZHJ66]:,KH^7%Q"%
M='%:\57Z8T89F4EAD<4\Y)U@_<IO;96 Q_2L,%,N6^:\'8>'G6[[X(C[8=@B
M>4XD[\4$X<,*8V-/O%'(AV]/7KZ[Y <;M.@HCN.H%_;:NW#?:'T/.7P]_ QG
M<U%4.=HMW/@>-]S@LBCLANUNKQ-&N\ 7JD0+95V,T$"A;"&<S!+(M13Y<7QX
MN \&"^V0UEMV/JL6?$]"M _G0N6U\<Z$^W!FC#9V*;]2!0+FU&K4 N0@/^AU
MP*+<@7I\*>%\^.KB[+356--L4*<0AA&EI;8KP!$E446'[<*NQJ704YK\-WKZ
ME]/RP'!22XY5J6RV[$PU9F.*O&GOC3SY1]Y'3^E51MF=HZS]-KI*3%-W1YJQ
MSG,]\]PXEUCY;Y*ER0\*7RK04M;&T)XUR[R+*T12NTQ9H&T4D]9OG!:IJ&@C
MW=[$5D(^+_*D<Y3 _^"-XU[2=%=3I58_$(-^L#RL@N;@"I:GV'=02P$"% ,*
M    " "Y(V(WX+X0 L8"  #,!@  $@              I($     97AE8W5T
B:6]N7VQO9RYH=&UL4$L%!@     !  $ 0    /8"      $! 
end

Mime
View raw message