harmony-alerts mailing list archives

Site index · List index
Message view « Date » · « Thread »
Top « Date » · « Thread »
From nom...@intel.com
Subject [build-test alert] FAILED Linux x86: ehwa
Date Tue, 30 Oct 2007 11:42:47 GMT
svn.revision=589837
BUILD FAILED:
	Ant Error Message:
/export/users.2/cc/cc-suites/scripts/cc-exec-adaptor.xml:104: The following error occurred
while executing this line: /export/users.2/cc/cc-suites/adaptors/ehwa/adaptor.xml:116: The
following error occurred while executing this line: /export/users.2/cc/cc-suites/scripts/framework.xml:1069:
Java returned: 1

Date of build:	2007-10-30 17:32:36 +0600
Time to build:	10 minutes 5 seconds
Last changed:	10/30/2007 14:39:09
Last log entry:	snapshot

***********************************************************
Errors/Warnings:	(91)
            
[exec] Result: 25
[echo]
[echo]
[echo] ========================== EHWA.log =======================
[echo]
[echo] Eclipse Home = /export/users.2/cc/cc-suites/build/libs/eclipse-3.2.l-lnx-x86/eclipse
[echo] Tested JRE = /export/users.2/cc/cc-suites/build/checkouts/snapshot/hdk/jdk/jre
[echo] Tested JRE options for Eclipse launching =
[echo] Delay factor = 2
[echo]
[echo] --- Automated EHWA scenario for Eclipse 3.2.1 ---
[echo]
[echo] Start:
[echo]
[echo] Run Eclipse
[echo] Select workspace
[echo]  wait window 'Workspace Launcher' to appear ...
[echo]  window 'Workspace Launcher' appeared
[echo] Press 'OK' button
[echo]  wait window '' to close ...
[echo]  window '' successfully closed
[echo] Close Welcome page
[echo]  wait window 'Java - Eclipse SDK' to appear ...
[echo]  window 'Java - Eclipse SDK' appeared
[echo] Create new project
[echo]  wait window 'New' to appear ...
[echo]  window 'New' appeared
[echo] Select new Java project
[echo]  wait window 'New Java Project' to appear ...
[echo]  window 'New Java Project' appeared
[echo] Type 'EHWA' as project name
[echo] Press 'Finish' button
[echo]  wait window 'New Java Project ' to close ...
[echo]  window 'New Java Project ' successfully closed
[echo] Create new Java class
[echo]  wait window 'Java - Eclipse SDK' to appear ...
[echo]  window 'Java - Eclipse SDK' appeared
[echo]  wait window 'New' to appear ...
[echo]  window 'New' appeared
[echo] Select new Java class for 'EHWA' project
[echo]  wait window 'Java Class' to appear ...
[echo]  window 'Java Class' appeared
[echo] Type 'EHWA' as class name, press 'Finish' button
[echo] Select the 'public static void main(String[] args)' checkbox
[echo] Press 'Finish' button
[echo]  wait window 'New Java Class ' to close ...
[echo]  window 'New Java Class ' successfully closed
[echo] Put System.out.println("Hello, world"); into EHWA class
[echo]  wait window 'Java - EHWA.java - Eclipse SDK' to appear ...
[echo]  window 'Java - EHWA.java - Eclipse SDK' appeared
[echo] Save EHWA class
[echo] Run EHWA class
[echo] Exit Eclipse
[echo]  wait window 'Java - EHWA.java - Eclipse SDK' to appear ...
[echo]  window 'Java - EHWA.java - Eclipse SDK' appeared
[echo]  wait window 'Java - EHWA.java - Eclipse SDK ' to close ...
[echo] ERROR: Failed to close 'Java - EHWA.java - Eclipse SDK ' window during 240 sec!
[echo]
[echo] Print error screen picture:
[echo] 	Picture was saved to /export/users.2/cc/cc-suites/build/results/ehwa/20071030_0532/error.xwd.
Use 'xwud -in error.xwd' to view the saved file.
[echo]
[echo] Kill Eclipse:
[echo] 	Found 1 Eclipse processes
[echo] 	Process 0:
[echo] 	Eclipse process was killed
[echo]
[echo]
[echo] EHWA FAILED!
[echo]
[echo] ======================= eclipse.log =======================
[echo] Install location:
[echo]     file:/export/users.2/cc/cc-suites/build/libs/eclipse-3.2.l-lnx-x86/eclipse/
[echo] Configuration file:
[echo]     file:/export/users.2/cc/cc-suites/build/libs/eclipse-3.2.l-lnx-x86/eclipse/configuration/config.ini
loaded
[echo] Configuration location:
[echo]     file:/export/users.2/cc/cc-suites/build/libs/eclipse-3.2.l-lnx-x86/eclipse/configuration/
[echo] Framework located:
[echo]     file:/export/users.2/cc/cc-suites/build/libs/eclipse-3.2.l-lnx-x86/eclipse/plugins/org.eclipse.osgi_3.2.1.R32x_v20060919.jar
[echo] Framework classpath:
[echo]     file:/export/users.2/cc/cc-suites/build/libs/eclipse-3.2.l-lnx-x86/eclipse/plugins/org.eclipse.osgi_3.2.1.R32x_v20060919.jar
[echo] Debug options:
[echo]     file:/export/users.2/cc/cc-suites/tests/ehwa/.options not found
[echo] Time to load bundles: 115
[echo] Starting application: 5180
[echo] Application Started: 67254
[echo]
[echo] ===========================================================
BUILD FAILED
/export/users.2/cc/cc-suites/tests/ehwa/ehwa_run.xml:209: EHWA FAILED!
Total time: 10 minutes 4 seconds
The execution FAILED with the following exception:
The following error occurred while executing this line:
/export/users.2/cc/cc-suites/adaptors/ehwa/adaptor.xml:116: The following error occurred while
executing this line:
/export/users.2/cc/cc-suites/scripts/framework.xml:1069: Java returned: 1

***********************************************************
Unit Tests: (0)
        
No Tests Run: This project doesn't have any tests

***********************************************************
Modifications since last successful build:	(1)
            
add cc-snapshot log20071030143909Lbuild.37 10/30/2007 14:39:09snapshot

begin 644 execution_log.zip
M4$L#! H    ( %:-7C?53X@3( 8  #8@   2    97AE8W5T:6]N7VQO9RYH
M=&ULU5KK3]M($/]<_HJY2J>T4F,GH= VI4B4A_K2%06J?D 5VJPGR<+&:WG7
M>=Q??[-K)R60=>*40L^"B.!Y_&8\KYUD;V"&<G^OJZ+I_EZ2XOX> VVF$M_5
M>BHV=2W^Q3:\;OS]MK:_E241,UC7H[B]M95F] KVNKAB(_8#WF="1CTAB1X'
M8W9)!,%D*!=H%M[<D9#_C7R@?D"]7H=.%L/QA^\'H#G&+!4*5 QF@-!34JJQ
MB/O 5=P3_2QE1M ]8O(*/$=M,()/G6-X!R%.$I6:,-.8ZJ 5<DX_=9T)@SKL
M6D-"/D!^K3*C0QVS1 ^4"0?1=7AE?U-<1XU*+"A-ZKS4QUR*1"-\4$-<#Y84
M71UBSE;?#EJ!K,MX4I^\WIW]UZOL""6;0H]QHU)2UBKS_6:7_UD[;P8L,TJ8
M]BHRXWP8D)M7DA8VKTL7C,BQ]%#\<7<HD<4VLF:/9C'"@B#PLIZQ$0(CAF0*
MJN<18-3]/.5P06S09?PZ2Y9 LVC(*GJU1NV^ INA^F%A7$0HT:"+0#061R12
MM&$X_1TH0I7VYP]<Z;[XD_!PE6) E<^(X9U,?4Q<>6U_;$2!1F/5:&^2=7"H
M1C?S<ZS2:YTPCLMR<V/\M@01=.ICX5Q!><V +'%]#RRK55-:*PY39 Y/BCJ3
M1M_ M8SM8GA-! 4;M1=ZTU[G 132<T-:C<:K9F.[<=G8V?87_S/#4K/8=KVT
MIV2XQA>@$7\-36CU!5+UJ;6G$*%A0BZ-@0ERZIJ=SM=.&TZ(B'Q!I8Q+19%0
M^T244'?8@ZOB[R)*SHX^0PUH9(C4&*(LM:YOO6P0<OX7, .! W591.6EC=5F
MD$B0(D8BW%[Z)!V8CC.J#:T=?P]*2)\)>H0W&*+6K(_^!K2RAC=="5^S@M]T
MN5>E?SYYY[U@_L1\!%4L?(1IZ/'F01OB,U,ERV(^L(^UQ&&W![<-7&O'Z0.:
MOH:N?"P.U3?QN,!WU-5UN,K1WH#1S?D% +]TJN#<W"CW_G >,V%FN5[[/F?X
MXGR-:<WF#DL29.4UNE1$SH^1OS92ZFFH??U<@VYF#(U^:P*N_:QH:Z&K@<XX
M)V6]3,IISAGYE1TZR=]1<IME"=6B=8%]NE-2*WMRF8B5GLR;'L0XID*JKFP4
MK(GX'QQ7ANAX5F(JHM%B<C95!Y;SG>9\FZ"\)6 EY/-I0CW2ICX1ZSGBF U+
M(J"(XA,1"SVH&LFW04+5T%XBH%JL_XP<)X9+1M;\X>'^6"&<.\<V@R)(*L:T
M$W)HA6SFIX*U:ASGL&T4OR#$E:*U\(#=*-62K"L%!VUH+.<P4B*"(1/QLS-C
M9\6+'\#2OGY>R]<)737YW2GCO+%YPLS8*Z7+:6;@;$KSRC"@02=P4ZN,GSW]
M@%*J%[;URNCI\[= _U;Y#+%10BT?SS=.+I^XU0E@]S7KF#'?0ZZ@.YZ0M2L'
MF3_;*570K1N>]WU>JSYAGMI0!DQ3JFZ:IX@Q)(*;+,62>?7):4Y"+M&@*5BB
M#0Y=M\ZY#D(P&4<!?+,NF(RS".HBAOD-Y].1H$2V=2E7:P]\P09F?Q92SEQ:
M9NB)RN*(#I8S[U/EMU4#2V+]R6E. XTRP;<$.D]>$ZBR*K3!N='FYLG!QR_'
M1R7!4?V8"[/EV$;'W(\Q-1/ROU3<+;?\1WY[N0].[F>EYA^'%C;13N-#85I<
M\^7O NJ0Y!T6E<W^"Y ?W)6+L+U:3U(:/^S)-$>(T8,!3&36%[&^L_(N-EB=
M[=;D<D0E:+?QIOF&BFRZA@VNRR7,#/Z'5AQA-^O/-BV_BO_&$CB8+6]B96A&
MIG+IGT_%T&WG;&33]!='$G4;FLT=+X=;G-@.1]V9AM \Q&&G^;KA93GX29FS
M4\S![JO6SLM[W?*MO/P[S_??/GXY*JKRPHUU77[S0^1VJ_&FO5#G_8K/%95=
ML)^OD-<;,!1Q1E+AI9T=5!SIK:US:JQV>9LY]^4":=8P@UL?+N.$8Y+7F_/%
M&VZ04)QG*<U2,![8A6PAD6Z;@=!N<]S>*C6612PQ*BWL+=XY<YO-W3;\%ITT
M_8B$7-R;I7NNK[%+_G7S6(HT\\0VG)I;>R';WPO=UP+"_"L"H?N^P']02P$"
M% ,*    " !6C5XWU4^($R &   V(   $@              I($     97AE
E8W5T:6]N7VQO9RYH=&UL4$L%!@     !  $ 0    % &      $! 
end

Mime
View raw message