harmony-alerts mailing list archives

Site index · List index
Message view « Date » · « Thread »
Top « Date » · « Thread »
From nom...@intel.com
Subject [build-test alert] FAILED Linux x86_64: drlvm-test debug
Date Mon, 29 Oct 2007 22:48:12 GMT

BUILD FAILED:
	Ant Error Message:
/export/users/cc/cc-common/scripts/cc-exec-adaptor.xml:104: The following error occurred while executing this line: /export/users/cc/cc-common/adaptors/drlvm-test/adaptor.xml:76: There were drlvm-test failures

Date of build:	2007-10-30 03:40:14 +0600
Time to build:	67 minutes 47 seconds
Last changed:	10/30/2007 01:42:15
Last log entry:	hdk

***********************************************************
Errors/Warnings:	(21)
            
[java] Java Result: 1
[java] Java Result: 1
[java] Java Result: 130
[java] Java Result: 1
[java] Java Result: 1
[java] Java Result: 130
[java] Java Result: 1
[java] Java Result: 1
[java] Java Result: 130
[java] Java Result: 1
[java] Java Result: 1
[java] Java Result: 130
[java] Java Result: 1
[java] Java Result: 1
[java] Java Result: 130
[junit] Tests FAILED
BUILD FAILED
/export/users/cc/cc-common/build/checkouts/hdk/working_vm/build/make/build.xml:477: Some tests failed
Total time: 67 minutes 40 seconds
The execution FAILED with the following exception:
The following error occurred while executing this line:
/export/users/cc/cc-common/adaptors/drlvm-test/adaptor.xml:76: There were drlvm-test failures

***********************************************************
Unit Tests: (4069)
        
error: test_10 java.lang.ClassAnnotationsTest
error: test_11 java.lang.ClassAnnotationsTest
error: testGetAnnotation java.lang.Package5Test
error: testGetAnnotation2 java.lang.Package5Test
error: testGetAnnotation_Negative java.lang.Package5Test
error: testGetDeclaredAnnotations java.lang.Package5Test
error: testGetDeclaredAnnotations2 java.lang.Package5Test
error: testGetDeclaredAnnotationsImmutable java.lang.Package5Test
error: testGetAnnotations java.lang.Package5Test
error: testGetAnnotations2 java.lang.Package5Test
error: testGetAnnotations5 java.lang.Package5Test
error: testGetAnnotationsImmutable java.lang.Package5Test
error: testIsAnnotationPresent java.lang.Package5Test
error: testIsAnnotationPresent_Negative java.lang.Package5Test
error: testGetParameterAnnotations2 java.lang.reflect.Ctor5Test
error: testGetParameterAnnotations3 java.lang.reflect.Ctor5Test
error: testGetParameterAnnotationsImmutable java.lang.reflect.Ctor5Test
error: testGetAnnotation java.lang.reflect.Ctor5Test
error: testGetAnnotation2 java.lang.reflect.Ctor5Test
error: testGetAnnotation_Negative java.lang.reflect.Ctor5Test
error: testGetDeclaredAnnotations java.lang.reflect.Ctor5Test
error: testGetDeclaredAnnotations2 java.lang.reflect.Ctor5Test
error: testGetDeclaredAnnotationsImmutable java.lang.reflect.Ctor5Test
error: testGetAnnotations java.lang.reflect.Ctor5Test
error: testGetAnnotations2 java.lang.reflect.Ctor5Test
error: testGetAnnotations5 java.lang.reflect.Ctor5Test
error: testGetAnnotationsImmutable java.lang.reflect.Ctor5Test
error: testIsAnnotationPresent java.lang.reflect.Ctor5Test
error: testIsAnnotationPresent_Negative java.lang.reflect.Ctor5Test
error: testGetAnnotation java.lang.reflect.Field5Test
error: testGetAnnotation2 java.lang.reflect.Field5Test
error: testGetAnnotation_Negative java.lang.reflect.Field5Test
error: testGetDeclaredAnnotations java.lang.reflect.Field5Test
error: testGetDeclaredAnnotations2 java.lang.reflect.Field5Test
error: testGetDeclaredAnnotationsImmutable java.lang.reflect.Field5Test
error: testGetAnnotations java.lang.reflect.Field5Test
error: testGetAnnotations2 java.lang.reflect.Field5Test
error: testGetAnnotations5 java.lang.reflect.Field5Test
error: testGetAnnotationsImmutable java.lang.reflect.Field5Test
error: testIsAnnotationPresent java.lang.reflect.Field5Test
error: testIsAnnotationPresent_Negative java.lang.reflect.Field5Test
error: testGetParameterAnnotations2 java.lang.reflect.Method5Test
error: testGetParameterAnnotations3 java.lang.reflect.Method5Test
error: testGetParameterAnnotationsImmutable java.lang.reflect.Method5Test
error: testGetAnnotation java.lang.reflect.Method5Test
error: testGetAnnotation2 java.lang.reflect.Method5Test
error: testGetAnnotation_Negative java.lang.reflect.Method5Test
error: testGetDeclaredAnnotations java.lang.reflect.Method5Test
error: testGetDeclaredAnnotations2 java.lang.reflect.Method5Test
error: testGetDeclaredAnnotationsImmutable java.lang.reflect.Method5Test
error: testGetAnnotations java.lang.reflect.Method5Test
error: testGetAnnotations2 java.lang.reflect.Method5Test
error: testGetAnnotations5 java.lang.reflect.Method5Test
error: testGetAnnotationsImmutable java.lang.reflect.Method5Test
error: testIsAnnotationPresent java.lang.reflect.Method5Test
error: testIsAnnotationPresent_Negative java.lang.reflect.Method5Test
error: testGetAnnotation_ByDefault org.apache.harmony.lang.annotation.AllTypesTest
error: testGetAnnotation_NoDefault org.apache.harmony.lang.annotation.AllTypesTest
error: testEquals org.apache.harmony.lang.annotation.AllTypesTest
error: testEquals_ForeignImpl org.apache.harmony.lang.annotation.AllTypesTest
error: testToString org.apache.harmony.lang.annotation.AllTypesTest
error: testAnnotationType org.apache.harmony.lang.annotation.AllTypesTest
error: testAnnotation_ElementError org.apache.harmony.lang.annotation.AllTypesTest
error: testSerialization org.apache.harmony.lang.annotation.AllTypesTest
Unit Test Error Details:	(64)
                
Test: test_10Class: java.lang.ClassAnnotationsTestjava.lang.NullPointerException
	at java.lang.reflect.Proxy.newProxyInstance(Proxy.java:200)
	at org.apache.harmony.lang.annotation.AnnotationFactory.createAnnotation(AnnotationFactory.java:101)
	at org.apache.harmony.vm.VMGenericsAndAnnotations.getDefaultValue(VMGenericsAndAnnotations.java)
	at java.lang.reflect.Method.getDefaultValue(Method.java:195)
	at java.lang.ClassAnnotationsTest.test_10(ClassAnnotationsTest.java:2187)
	at java.lang.reflect.VMReflection.invokeMethod(VMReflection.java)
	at java.lang.reflect.Method.invoke(Method.java:317)
	at junit.framework.TestCase.runTest(TestCase.java:164)
	at junit.framework.TestCase.runBare(TestCase.java)
	at junit.framework.TestResult$1.protect(TestResult.java)
	at junit.framework.TestResult.runProtected(TestResult.java)
	at junit.framework.TestResult.run(TestResult.java:109)
	at junit.framework.TestCase.run(TestCase.java:120)
	at junit.framework.TestSuite.runTest(TestSuite.java:230)
	at junit.framework.TestSuite.run(TestSuite.java)
	at org.apache.tools.ant.taskdefs.optional.junit.JUnitTestRunner.run(JUnitTestRunner.java)
	at org.apache.tools.ant.taskdefs.optional.junit.JUnitTestRunner.launch(JUnitTestRunner.java:672)
	at org.apache.tools.ant.taskdefs.optional.junit.JUnitTestRunner.main(JUnitTestRunner.java:546)
Test: test_11Class: java.lang.ClassAnnotationsTestjava.lang.NullPointerException
	at java.lang.reflect.Proxy.newProxyInstance(Proxy.java:200)
	at org.apache.harmony.lang.annotation.AnnotationFactory.createAnnotation(AnnotationFactory.java:101)
	at org.apache.harmony.vm.VMGenericsAndAnnotations.getDeclaredAnnotations(VMGenericsAndAnnotations.java)
	at java.lang.reflect.Method$MethodData.getDeclaredAnnotations(Method.java:426)
	at java.lang.reflect.Method.getDeclaredAnnotations(Method.java:71)
	at java.lang.reflect.AccessibleObject.getAnnotations(AccessibleObject.java)
	at java.lang.ClassAnnotationsTest.test_11(ClassAnnotationsTest.java:2300)
	at java.lang.reflect.VMReflection.invokeMethod(VMReflection.java)
	at java.lang.reflect.Method.invoke(Method.java:317)
	at junit.framework.TestCase.runTest(TestCase.java:164)
	at junit.framework.TestCase.runBare(TestCase.java)
	at junit.framework.TestResult$1.protect(TestResult.java)
	at junit.framework.TestResult.runProtected(TestResult.java)
	at junit.framework.TestResult.run(TestResult.java:109)
	at junit.framework.TestCase.run(TestCase.java:120)
	at junit.framework.TestSuite.runTest(TestSuite.java:230)
	at junit.framework.TestSuite.run(TestSuite.java)
	at org.apache.tools.ant.taskdefs.optional.junit.JUnitTestRunner.run(JUnitTestRunner.java)
	at org.apache.tools.ant.taskdefs.optional.junit.JUnitTestRunner.launch(JUnitTestRunner.java:672)
	at org.apache.tools.ant.taskdefs.optional.junit.JUnitTestRunner.main(JUnitTestRunner.java:546)
Test: testGetAnnotationClass: java.lang.Package5Testjava.lang.NullPointerException
	at java.lang.reflect.Proxy.newProxyInstance(Proxy.java:200)
	at org.apache.harmony.lang.annotation.AnnotationFactory.createAnnotation(AnnotationFactory.java:101)
	at org.apache.harmony.vm.VMGenericsAndAnnotations.getDeclaredAnnotations(VMGenericsAndAnnotations.java)
	at java.lang.Package.getDeclaredAnnotations(Package.java:56)
	at java.lang.Package.getAnnotations(Package.java:65)
	at java.lang.Package.getAnnotation(Package.java:78)
	at org.apache.harmony.lang.AnnotatedElementTestFrame.testGetAnnotation(AnnotatedElementTestFrame.java)
	at java.lang.reflect.VMReflection.invokeMethod(VMReflection.java)
	at java.lang.reflect.Method.invoke(Method.java:317)
	at junit.framework.TestCase.runTest(TestCase.java:164)
	at junit.framework.TestCase.runBare(TestCase.java)
	at junit.framework.TestResult$1.protect(TestResult.java)
	at junit.framework.TestResult.runProtected(TestResult.java)
	at junit.framework.TestResult.run(TestResult.java:109)
	at junit.framework.TestCase.run(TestCase.java:120)
	at junit.framework.TestSuite.runTest(TestSuite.java:230)
	at junit.framework.TestSuite.run(TestSuite.java)
	at org.apache.tools.ant.taskdefs.optional.junit.JUnitTestRunner.run(JUnitTestRunner.java)
	at org.apache.tools.ant.taskdefs.optional.junit.JUnitTestRunner.launch(JUnitTestRunner.java:672)
	at org.apache.tools.ant.taskdefs.optional.junit.JUnitTestRunner.main(JUnitTestRunner.java:546)
Test: testGetAnnotation2Class: java.lang.Package5Testjava.lang.NullPointerException
	at java.lang.reflect.Proxy.newProxyInstance(Proxy.java:200)
	at org.apache.harmony.lang.annotation.AnnotationFactory.createAnnotation(AnnotationFactory.java:101)
	at org.apache.harmony.vm.VMGenericsAndAnnotations.getDeclaredAnnotations(VMGenericsAndAnnotations.java)
	at java.lang.Package.getDeclaredAnnotations(Package.java:56)
	at java.lang.Package.getAnnotations(Package.java:65)
	at java.lang.Package.getAnnotation(Package.java:78)
	at org.apache.harmony.lang.AnnotatedElementTestFrame.testGetAnnotation2(AnnotatedElementTestFrame.java)
	at java.lang.reflect.VMReflection.invokeMethod(VMReflection.java)
	at java.lang.reflect.Method.invoke(Method.java:317)
	at junit.framework.TestCase.runTest(TestCase.java:164)
	at junit.framework.TestCase.runBare(TestCase.java)
	at junit.framework.TestResult$1.protect(TestResult.java)
	at junit.framework.TestResult.runProtected(TestResult.java)
	at junit.framework.TestResult.run(TestResult.java:109)
	at junit.framework.TestCase.run(TestCase.java:120)
	at junit.framework.TestSuite.runTest(TestSuite.java:230)
	at junit.framework.TestSuite.run(TestSuite.java)
	at org.apache.tools.ant.taskdefs.optional.junit.JUnitTestRunner.run(JUnitTestRunner.java)
	at org.apache.tools.ant.taskdefs.optional.junit.JUnitTestRunner.launch(JUnitTestRunner.java:672)
	at org.apache.tools.ant.taskdefs.optional.junit.JUnitTestRunner.main(JUnitTestRunner.java:546)
Test: testGetAnnotation_NegativeClass: java.lang.Package5Testjava.lang.NullPointerException
	at java.lang.reflect.Proxy.newProxyInstance(Proxy.java:200)
	at org.apache.harmony.lang.annotation.AnnotationFactory.createAnnotation(AnnotationFactory.java:101)
	at org.apache.harmony.vm.VMGenericsAndAnnotations.getDeclaredAnnotations(VMGenericsAndAnnotations.java)
	at java.lang.Package.getDeclaredAnnotations(Package.java:56)
	at java.lang.Package.getAnnotations(Package.java:65)
	at java.lang.Package.getAnnotation(Package.java:78)
	at org.apache.harmony.lang.AnnotatedElementTestFrame.testGetAnnotation_Negative(AnnotatedElementTestFrame.java)
	at java.lang.reflect.VMReflection.invokeMethod(VMReflection.java)
	at java.lang.reflect.Method.invoke(Method.java:317)
	at junit.framework.TestCase.runTest(TestCase.java:164)
	at junit.framework.TestCase.runBare(TestCase.java)
	at junit.framework.TestResult$1.protect(TestResult.java)
	at junit.framework.TestResult.runProtected(TestResult.java)
	at junit.framework.TestResult.run(TestResult.java:109)
	at junit.framework.TestCase.run(TestCase.java:120)
	at junit.framework.TestSuite.runTest(TestSuite.java:230)
	at junit.framework.TestSuite.run(TestSuite.java)
	at org.apache.tools.ant.taskdefs.optional.junit.JUnitTestRunner.run(JUnitTestRunner.java)
	at org.apache.tools.ant.taskdefs.optional.junit.JUnitTestRunner.launch(JUnitTestRunner.java:672)
	at org.apache.tools.ant.taskdefs.optional.junit.JUnitTestRunner.main(JUnitTestRunner.java:546)
Test: testGetDeclaredAnnotationsClass: java.lang.Package5Testjava.lang.NullPointerException
	at java.lang.reflect.Proxy.newProxyInstance(Proxy.java:200)
	at org.apache.harmony.lang.annotation.AnnotationFactory.createAnnotation(AnnotationFactory.java:101)
	at org.apache.harmony.vm.VMGenericsAndAnnotations.getDeclaredAnnotations(VMGenericsAndAnnotations.java)
	at java.lang.Package.getDeclaredAnnotations(Package.java:56)
	at org.apache.harmony.lang.AnnotatedElementTestFrame.testGetDeclaredAnnotations(AnnotatedElementTestFrame.java)
	at java.lang.reflect.VMReflection.invokeMethod(VMReflection.java)
	at java.lang.reflect.Method.invoke(Method.java:317)
	at junit.framework.TestCase.runTest(TestCase.java:164)
	at junit.framework.TestCase.runBare(TestCase.java)
	at junit.framework.TestResult$1.protect(TestResult.java)
	at junit.framework.TestResult.runProtected(TestResult.java)
	at junit.framework.TestResult.run(TestResult.java:109)
	at junit.framework.TestCase.run(TestCase.java:120)
	at junit.framework.TestSuite.runTest(TestSuite.java:230)
	at junit.framework.TestSuite.run(TestSuite.java)
	at org.apache.tools.ant.taskdefs.optional.junit.JUnitTestRunner.run(JUnitTestRunner.java)
	at org.apache.tools.ant.taskdefs.optional.junit.JUnitTestRunner.launch(JUnitTestRunner.java:672)
	at org.apache.tools.ant.taskdefs.optional.junit.JUnitTestRunner.main(JUnitTestRunner.java:546)
Test: testGetDeclaredAnnotations2Class: java.lang.Package5Testjava.lang.NullPointerException
	at java.lang.reflect.Proxy.newProxyInstance(Proxy.java:200)
	at org.apache.harmony.lang.annotation.AnnotationFactory.createAnnotation(AnnotationFactory.java:101)
	at org.apache.harmony.vm.VMGenericsAndAnnotations.getDeclaredAnnotations(VMGenericsAndAnnotations.java)
	at java.lang.Package.getDeclaredAnnotations(Package.java:56)
	at org.apache.harmony.lang.AnnotatedElementTestFrame.testGetDeclaredAnnotations2(AnnotatedElementTestFrame.java)
	at java.lang.reflect.VMReflection.invokeMethod(VMReflection.java)
	at java.lang.reflect.Method.invoke(Method.java:317)
	at junit.framework.TestCase.runTest(TestCase.java:164)
	at junit.framework.TestCase.runBare(TestCase.java)
	at junit.framework.TestResult$1.protect(TestResult.java)
	at junit.framework.TestResult.runProtected(TestResult.java)
	at junit.framework.TestResult.run(TestResult.java:109)
	at junit.framework.TestCase.run(TestCase.java:120)
	at junit.framework.TestSuite.runTest(TestSuite.java:230)
	at junit.framework.TestSuite.run(TestSuite.java)
	at org.apache.tools.ant.taskdefs.optional.junit.JUnitTestRunner.run(JUnitTestRunner.java)
	at org.apache.tools.ant.taskdefs.optional.junit.JUnitTestRunner.launch(JUnitTestRunner.java:672)
	at org.apache.tools.ant.taskdefs.optional.junit.JUnitTestRunner.main(JUnitTestRunner.java:546)
Test: testGetDeclaredAnnotationsImmutableClass: java.lang.Package5Testjava.lang.NullPointerException
	at java.lang.reflect.Proxy.newProxyInstance(Proxy.java:200)
	at org.apache.harmony.lang.annotation.AnnotationFactory.createAnnotation(AnnotationFactory.java:101)
	at org.apache.harmony.vm.VMGenericsAndAnnotations.getDeclaredAnnotations(VMGenericsAndAnnotations.java)
	at java.lang.Package.getDeclaredAnnotations(Package.java:56)
	at org.apache.harmony.lang.AnnotatedElementTestFrame.testGetDeclaredAnnotationsImmutable(AnnotatedElementTestFrame.java)
	at java.lang.reflect.VMReflection.invokeMethod(VMReflection.java)
	at java.lang.reflect.Method.invoke(Method.java:317)
	at junit.framework.TestCase.runTest(TestCase.java:164)
	at junit.framework.TestCase.runBare(TestCase.java)
	at junit.framework.TestResult$1.protect(TestResult.java)
	at junit.framework.TestResult.runProtected(TestResult.java)
	at junit.framework.TestResult.run(TestResult.java:109)
	at junit.framework.TestCase.run(TestCase.java:120)
	at junit.framework.TestSuite.runTest(TestSuite.java:230)
	at junit.framework.TestSuite.run(TestSuite.java)
	at org.apache.tools.ant.taskdefs.optional.junit.JUnitTestRunner.run(JUnitTestRunner.java)
	at org.apache.tools.ant.taskdefs.optional.junit.JUnitTestRunner.launch(JUnitTestRunner.java:672)
	at org.apache.tools.ant.taskdefs.optional.junit.JUnitTestRunner.main(JUnitTestRunner.java:546)
Test: testGetAnnotationsClass: java.lang.Package5Testjava.lang.NullPointerException
	at java.lang.reflect.Proxy.newProxyInstance(Proxy.java:200)
	at org.apache.harmony.lang.annotation.AnnotationFactory.createAnnotation(AnnotationFactory.java:101)
	at org.apache.harmony.vm.VMGenericsAndAnnotations.getDeclaredAnnotations(VMGenericsAndAnnotations.java)
	at java.lang.Package.getDeclaredAnnotations(Package.java:56)
	at java.lang.Package.getAnnotations(Package.java:65)
	at org.apache.harmony.lang.AnnotatedElementTestFrame.testGetAnnotations(AnnotatedElementTestFrame.java)
	at java.lang.reflect.VMReflection.invokeMethod(VMReflection.java)
	at java.lang.reflect.Method.invoke(Method.java:317)
	at junit.framework.TestCase.runTest(TestCase.java:164)
	at junit.framework.TestCase.runBare(TestCase.java)
	at junit.framework.TestResult$1.protect(TestResult.java)
	at junit.framework.TestResult.runProtected(TestResult.java)
	at junit.framework.TestResult.run(TestResult.java:109)
	at junit.framework.TestCase.run(TestCase.java:120)
	at junit.framework.TestSuite.runTest(TestSuite.java:230)
	at junit.framework.TestSuite.run(TestSuite.java)
	at org.apache.tools.ant.taskdefs.optional.junit.JUnitTestRunner.run(JUnitTestRunner.java)
	at org.apache.tools.ant.taskdefs.optional.junit.JUnitTestRunner.launch(JUnitTestRunner.java:672)
	at org.apache.tools.ant.taskdefs.optional.junit.JUnitTestRunner.main(JUnitTestRunner.java:546)
Test: testGetAnnotations2Class: java.lang.Package5Testjava.lang.NullPointerException
	at java.lang.reflect.Proxy.newProxyInstance(Proxy.java:200)
	at org.apache.harmony.lang.annotation.AnnotationFactory.createAnnotation(AnnotationFactory.java:101)
	at org.apache.harmony.vm.VMGenericsAndAnnotations.getDeclaredAnnotations(VMGenericsAndAnnotations.java)
	at java.lang.Package.getDeclaredAnnotations(Package.java:56)
	at java.lang.Package.getAnnotations(Package.java:65)
	at org.apache.harmony.lang.AnnotatedElementTestFrame.testGetAnnotations2(AnnotatedElementTestFrame.java)
	at java.lang.reflect.VMReflection.invokeMethod(VMReflection.java)
	at java.lang.reflect.Method.invoke(Method.java:317)
	at junit.framework.TestCase.runTest(TestCase.java:164)
	at junit.framework.TestCase.runBare(TestCase.java)
	at junit.framework.TestResult$1.protect(TestResult.java)
	at junit.framework.TestResult.runProtected(TestResult.java)
	at junit.framework.TestResult.run(TestResult.java:109)
	at junit.framework.TestCase.run(TestCase.java:120)
	at junit.framework.TestSuite.runTest(TestSuite.java:230)
	at junit.framework.TestSuite.run(TestSuite.java)
	at org.apache.tools.ant.taskdefs.optional.junit.JUnitTestRunner.run(JUnitTestRunner.java)
	at org.apache.tools.ant.taskdefs.optional.junit.JUnitTestRunner.launch(JUnitTestRunner.java:672)
	at org.apache.tools.ant.taskdefs.optional.junit.JUnitTestRunner.main(JUnitTestRunner.java:546)
Test: testGetAnnotations5Class: java.lang.Package5Testjava.lang.NullPointerException
	at java.lang.reflect.Proxy.newProxyInstance(Proxy.java:200)
	at org.apache.harmony.lang.annotation.AnnotationFactory.createAnnotation(AnnotationFactory.java:101)
	at org.apache.harmony.vm.VMGenericsAndAnnotations.getDeclaredAnnotations(VMGenericsAndAnnotations.java)
	at java.lang.Package.getDeclaredAnnotations(Package.java:56)
	at java.lang.Package.getAnnotations(Package.java:65)
	at org.apache.harmony.lang.AnnotatedElementTestFrame.testGetAnnotations5(AnnotatedElementTestFrame.java)
	at java.lang.reflect.VMReflection.invokeMethod(VMReflection.java)
	at java.lang.reflect.Method.invoke(Method.java:317)
	at junit.framework.TestCase.runTest(TestCase.java:164)
	at junit.framework.TestCase.runBare(TestCase.java)
	at junit.framework.TestResult$1.protect(TestResult.java)
	at junit.framework.TestResult.runProtected(TestResult.java)
	at junit.framework.TestResult.run(TestResult.java:109)
	at junit.framework.TestCase.run(TestCase.java:120)
	at junit.framework.TestSuite.runTest(TestSuite.java:230)
	at junit.framework.TestSuite.run(TestSuite.java)
	at org.apache.tools.ant.taskdefs.optional.junit.JUnitTestRunner.run(JUnitTestRunner.java)
	at org.apache.tools.ant.taskdefs.optional.junit.JUnitTestRunner.launch(JUnitTestRunner.java:672)
	at org.apache.tools.ant.taskdefs.optional.junit.JUnitTestRunner.main(JUnitTestRunner.java:546)
Test: testGetAnnotationsImmutableClass: java.lang.Package5Testjava.lang.NullPointerException
	at java.lang.reflect.Proxy.newProxyInstance(Proxy.java:200)
	at org.apache.harmony.lang.annotation.AnnotationFactory.createAnnotation(AnnotationFactory.java:101)
	at org.apache.harmony.vm.VMGenericsAndAnnotations.getDeclaredAnnotations(VMGenericsAndAnnotations.java)
	at java.lang.Package.getDeclaredAnnotations(Package.java:56)
	at java.lang.Package.getAnnotations(Package.java:65)
	at org.apache.harmony.lang.AnnotatedElementTestFrame.testGetAnnotationsImmutable(AnnotatedElementTestFrame.java)
	at java.lang.reflect.VMReflection.invokeMethod(VMReflection.java)
	at java.lang.reflect.Method.invoke(Method.java:317)
	at junit.framework.TestCase.runTest(TestCase.java:164)
	at junit.framework.TestCase.runBare(TestCase.java)
	at junit.framework.TestResult$1.protect(TestResult.java)
	at junit.framework.TestResult.runProtected(TestResult.java)
	at junit.framework.TestResult.run(TestResult.java:109)
	at junit.framework.TestCase.run(TestCase.java:120)
	at junit.framework.TestSuite.runTest(TestSuite.java:230)
	at junit.framework.TestSuite.run(TestSuite.java)
	at org.apache.tools.ant.taskdefs.optional.junit.JUnitTestRunner.run(JUnitTestRunner.java)
	at org.apache.tools.ant.taskdefs.optional.junit.JUnitTestRunner.launch(JUnitTestRunner.java:672)
	at org.apache.tools.ant.taskdefs.optional.junit.JUnitTestRunner.main(JUnitTestRunner.java:546)
Test: testIsAnnotationPresentClass: java.lang.Package5Testjava.lang.NullPointerException
	at java.lang.reflect.Proxy.newProxyInstance(Proxy.java:200)
	at org.apache.harmony.lang.annotation.AnnotationFactory.createAnnotation(AnnotationFactory.java:101)
	at org.apache.harmony.vm.VMGenericsAndAnnotations.getDeclaredAnnotations(VMGenericsAndAnnotations.java)
	at java.lang.Package.getDeclaredAnnotations(Package.java:56)
	at java.lang.Package.getAnnotations(Package.java:65)
	at java.lang.Package.getAnnotation(Package.java:78)
	at java.lang.Package.isAnnotationPresent(Package.java:93)
	at org.apache.harmony.lang.AnnotatedElementTestFrame.testIsAnnotationPresent(AnnotatedElementTestFrame.java)
	at java.lang.reflect.VMReflection.invokeMethod(VMReflection.java)
	at java.lang.reflect.Method.invoke(Method.java:317)
	at junit.framework.TestCase.runTest(TestCase.java:164)
	at junit.framework.TestCase.runBare(TestCase.java)
	at junit.framework.TestResult$1.protect(TestResult.java)
	at junit.framework.TestResult.runProtected(TestResult.java)
	at junit.framework.TestResult.run(TestResult.java:109)
	at junit.framework.TestCase.run(TestCase.java:120)
	at junit.framework.TestSuite.runTest(TestSuite.java:230)
	at junit.framework.TestSuite.run(TestSuite.java)
	at org.apache.tools.ant.taskdefs.optional.junit.JUnitTestRunner.run(JUnitTestRunner.java)
	at org.apache.tools.ant.taskdefs.optional.junit.JUnitTestRunner.launch(JUnitTestRunner.java:672)
	at org.apache.tools.ant.taskdefs.optional.junit.JUnitTestRunner.main(JUnitTestRunner.java:546)
Test: testIsAnnotationPresent_NegativeClass: java.lang.Package5Testjava.lang.NullPointerException
	at java.lang.reflect.Proxy.newProxyInstance(Proxy.java:200)
	at org.apache.harmony.lang.annotation.AnnotationFactory.createAnnotation(AnnotationFactory.java:101)
	at org.apache.harmony.vm.VMGenericsAndAnnotations.getDeclaredAnnotations(VMGenericsAndAnnotations.java)
	at java.lang.Package.getDeclaredAnnotations(Package.java:56)
	at java.lang.Package.getAnnotations(Package.java:65)
	at java.lang.Package.getAnnotation(Package.java:78)
	at java.lang.Package.isAnnotationPresent(Package.java:93)
	at org.apache.harmony.lang.AnnotatedElementTestFrame.testIsAnnotationPresent_Negative(AnnotatedElementTestFrame.java)
	at java.lang.reflect.VMReflection.invokeMethod(VMReflection.java)
	at java.lang.reflect.Method.invoke(Method.java:317)
	at junit.framework.TestCase.runTest(TestCase.java:164)
	at junit.framework.TestCase.runBare(TestCase.java)
	at junit.framework.TestResult$1.protect(TestResult.java)
	at junit.framework.TestResult.runProtected(TestResult.java)
	at junit.framework.TestResult.run(TestResult.java:109)
	at junit.framework.TestCase.run(TestCase.java:120)
	at junit.framework.TestSuite.runTest(TestSuite.java:230)
	at junit.framework.TestSuite.run(TestSuite.java)
	at org.apache.tools.ant.taskdefs.optional.junit.JUnitTestRunner.run(JUnitTestRunner.java)
	at org.apache.tools.ant.taskdefs.optional.junit.JUnitTestRunner.launch(JUnitTestRunner.java:672)
	at org.apache.tools.ant.taskdefs.optional.junit.JUnitTestRunner.main(JUnitTestRunner.java:546)
Test: testGetParameterAnnotations2Class: java.lang.reflect.Ctor5Testjava.lang.reflect.InvocationTargetException
	at java.lang.reflect.VMReflection.invokeMethod(VMReflection.java)
	at java.lang.reflect.Method.invoke(Method.java:317)
	at java.lang.reflect.Method5Test.getParamAnnotations(Method5Test.java:81)
	at java.lang.reflect.Method5Test.testGetParameterAnnotations2(Method5Test.java:113)
	at java.lang.reflect.VMReflection.invokeMethod(VMReflection.java)
	at java.lang.reflect.Method.invoke(Method.java:317)
	at junit.framework.TestCase.runTest(TestCase.java:164)
	at junit.framework.TestCase.runBare(TestCase.java)
	at junit.framework.TestResult$1.protect(TestResult.java)
	at junit.framework.TestResult.runProtected(TestResult.java)
	at junit.framework.TestResult.run(TestResult.java:109)
	at junit.framework.TestCase.run(TestCase.java:120)
	at junit.framework.TestSuite.runTest(TestSuite.java:230)
	at junit.framework.TestSuite.run(TestSuite.java)
	at org.apache.tools.ant.taskdefs.optional.junit.JUnitTestRunner.run(JUnitTestRunner.java)
	at org.apache.tools.ant.taskdefs.optional.junit.JUnitTestRunner.launch(JUnitTestRunner.java:672)
	at org.apache.tools.ant.taskdefs.optional.junit.JUnitTestRunner.main(JUnitTestRunner.java:546)
Caused by: java.lang.NullPointerException
	at java.lang.reflect.Proxy.newProxyInstance(Proxy.java:200)
	at org.apache.harmony.lang.annotation.AnnotationFactory.createAnnotation(AnnotationFactory.java:101)
	at org.apache.harmony.vm.VMGenericsAndAnnotations.getParameterAnnotations(VMGenericsAndAnnotations.java)
	at java.lang.reflect.Constructor$ConstructorData.getParameterAnnotations(Constructor.java:395)
	at java.lang.reflect.Constructor.getParameterAnnotations(Constructor.java:50)
	at java.lang.reflect.VMReflection.invokeMethod(VMReflection.java)
	... 16 more
Test: testGetParameterAnnotations3Class: java.lang.reflect.Ctor5Testjava.lang.reflect.InvocationTargetException
	at java.lang.reflect.VMReflection.invokeMethod(VMReflection.java)
	at java.lang.reflect.Method.invoke(Method.java:317)
	at java.lang.reflect.Method5Test.getParamAnnotations(Method5Test.java:81)
	at java.lang.reflect.Method5Test.testGetParameterAnnotations3(Method5Test.java:140)
	at java.lang.reflect.VMReflection.invokeMethod(VMReflection.java)
	at java.lang.reflect.Method.invoke(Method.java:317)
	at junit.framework.TestCase.runTest(TestCase.java:164)
	at junit.framework.TestCase.runBare(TestCase.java)
	at junit.framework.TestResult$1.protect(TestResult.java)
	at junit.framework.TestResult.runProtected(TestResult.java)
	at junit.framework.TestResult.run(TestResult.java:109)
	at junit.framework.TestCase.run(TestCase.java:120)
	at junit.framework.TestSuite.runTest(TestSuite.java:230)
	at junit.framework.TestSuite.run(TestSuite.java)
	at org.apache.tools.ant.taskdefs.optional.junit.JUnitTestRunner.run(JUnitTestRunner.java)
	at org.apache.tools.ant.taskdefs.optional.junit.JUnitTestRunner.launch(JUnitTestRunner.java:672)
	at org.apache.tools.ant.taskdefs.optional.junit.JUnitTestRunner.main(JUnitTestRunner.java:546)
Caused by: java.lang.NullPointerException
	at java.lang.reflect.Proxy.newProxyInstance(Proxy.java:200)
	at org.apache.harmony.lang.annotation.AnnotationFactory.createAnnotation(AnnotationFactory.java:101)
	at org.apache.harmony.vm.VMGenericsAndAnnotations.getParameterAnnotations(VMGenericsAndAnnotations.java)
	at java.lang.reflect.Constructor$ConstructorData.getParameterAnnotations(Constructor.java:395)
	at java.lang.reflect.Constructor.getParameterAnnotations(Constructor.java:50)
	at java.lang.reflect.VMReflection.invokeMethod(VMReflection.java)
	... 16 more
Test: testGetParameterAnnotationsImmutableClass: java.lang.reflect.Ctor5Testjava.lang.reflect.InvocationTargetException
	at java.lang.reflect.VMReflection.invokeMethod(VMReflection.java)
	at java.lang.reflect.Method.invoke(Method.java:317)
	at java.lang.reflect.Method5Test.getParamAnnotations(Method5Test.java:81)
	at java.lang.reflect.Method5Test.testGetParameterAnnotationsImmutable(Method5Test.java:157)
	at java.lang.reflect.VMReflection.invokeMethod(VMReflection.java)
	at java.lang.reflect.Method.invoke(Method.java:317)
	at junit.framework.TestCase.runTest(TestCase.java:164)
	at junit.framework.TestCase.runBare(TestCase.java)
	at junit.framework.TestResult$1.protect(TestResult.java)
	at junit.framework.TestResult.runProtected(TestResult.java)
	at junit.framework.TestResult.run(TestResult.java:109)
	at junit.framework.TestCase.run(TestCase.java:120)
	at junit.framework.TestSuite.runTest(TestSuite.java:230)
	at junit.framework.TestSuite.run(TestSuite.java)
	at org.apache.tools.ant.taskdefs.optional.junit.JUnitTestRunner.run(JUnitTestRunner.java)
	at org.apache.tools.ant.taskdefs.optional.junit.JUnitTestRunner.launch(JUnitTestRunner.java:672)
	at org.apache.tools.ant.taskdefs.optional.junit.JUnitTestRunner.main(JUnitTestRunner.java:546)
Caused by: java.lang.NullPointerException
	at java.lang.reflect.Proxy.newProxyInstance(Proxy.java:200)
	at org.apache.harmony.lang.annotation.AnnotationFactory.createAnnotation(AnnotationFactory.java:101)
	at org.apache.harmony.vm.VMGenericsAndAnnotations.getParameterAnnotations(VMGenericsAndAnnotations.java)
	at java.lang.reflect.Constructor$ConstructorData.getParameterAnnotations(Constructor.java:395)
	at java.lang.reflect.Constructor.getParameterAnnotations(Constructor.java:50)
	at java.lang.reflect.VMReflection.invokeMethod(VMReflection.java)
	... 16 more
Test: testGetAnnotationClass: java.lang.reflect.Ctor5Testjava.lang.NullPointerException
	at java.lang.reflect.Proxy.newProxyInstance(Proxy.java:200)
	at org.apache.harmony.lang.annotation.AnnotationFactory.createAnnotation(AnnotationFactory.java:101)
	at org.apache.harmony.vm.VMGenericsAndAnnotations.getDeclaredAnnotations(VMGenericsAndAnnotations.java)
	at java.lang.reflect.Constructor$ConstructorData.getDeclaredAnnotations(Constructor.java:377)
	at java.lang.reflect.Constructor.getAnnotation(Constructor.java:77)
	at org.apache.harmony.lang.AnnotatedElementTestFrame.testGetAnnotation(AnnotatedElementTestFrame.java)
	at java.lang.reflect.VMReflection.invokeMethod(VMReflection.java)
	at java.lang.reflect.Method.invoke(Method.java:317)
	at junit.framework.TestCase.runTest(TestCase.java:164)
	at junit.framework.TestCase.runBare(TestCase.java)
	at junit.framework.TestResult$1.protect(TestResult.java)
	at junit.framework.TestResult.runProtected(TestResult.java)
	at junit.framework.TestResult.run(TestResult.java:109)
	at junit.framework.TestCase.run(TestCase.java:120)
	at junit.framework.TestSuite.runTest(TestSuite.java:230)
	at junit.framework.TestSuite.run(TestSuite.java)
	at org.apache.tools.ant.taskdefs.optional.junit.JUnitTestRunner.run(JUnitTestRunner.java)
	at org.apache.tools.ant.taskdefs.optional.junit.JUnitTestRunner.launch(JUnitTestRunner.java:672)
	at org.apache.tools.ant.taskdefs.optional.junit.JUnitTestRunner.main(JUnitTestRunner.java:546)
Test: testGetAnnotation2Class: java.lang.reflect.Ctor5Testjava.lang.NullPointerException
	at java.lang.reflect.Proxy.newProxyInstance(Proxy.java:200)
	at org.apache.harmony.lang.annotation.AnnotationFactory.createAnnotation(AnnotationFactory.java:101)
	at org.apache.harmony.vm.VMGenericsAndAnnotations.getDeclaredAnnotations(VMGenericsAndAnnotations.java)
	at java.lang.reflect.Constructor$ConstructorData.getDeclaredAnnotations(Constructor.java:377)
	at java.lang.reflect.Constructor.getAnnotation(Constructor.java:77)
	at org.apache.harmony.lang.AnnotatedElementTestFrame.testGetAnnotation2(AnnotatedElementTestFrame.java)
	at java.lang.reflect.VMReflection.invokeMethod(VMReflection.java)
	at java.lang.reflect.Method.invoke(Method.java:317)
	at junit.framework.TestCase.runTest(TestCase.java:164)
	at junit.framework.TestCase.runBare(TestCase.java)
	at junit.framework.TestResult$1.protect(TestResult.java)
	at junit.framework.TestResult.runProtected(TestResult.java)
	at junit.framework.TestResult.run(TestResult.java:109)
	at junit.framework.TestCase.run(TestCase.java:120)
	at junit.framework.TestSuite.runTest(TestSuite.java:230)
	at junit.framework.TestSuite.run(TestSuite.java)
	at org.apache.tools.ant.taskdefs.optional.junit.JUnitTestRunner.run(JUnitTestRunner.java)
	at org.apache.tools.ant.taskdefs.optional.junit.JUnitTestRunner.launch(JUnitTestRunner.java:672)
	at org.apache.tools.ant.taskdefs.optional.junit.JUnitTestRunner.main(JUnitTestRunner.java:546)
Test: testGetAnnotation_NegativeClass: java.lang.reflect.Ctor5Testjava.lang.NullPointerException
	at java.lang.reflect.Proxy.newProxyInstance(Proxy.java:200)
	at org.apache.harmony.lang.annotation.AnnotationFactory.createAnnotation(AnnotationFactory.java:101)
	at org.apache.harmony.vm.VMGenericsAndAnnotations.getDeclaredAnnotations(VMGenericsAndAnnotations.java)
	at java.lang.reflect.Constructor$ConstructorData.getDeclaredAnnotations(Constructor.java:377)
	at java.lang.reflect.Constructor.getAnnotation(Constructor.java:77)
	at org.apache.harmony.lang.AnnotatedElementTestFrame.testGetAnnotation_Negative(AnnotatedElementTestFrame.java)
	at java.lang.reflect.VMReflection.invokeMethod(VMReflection.java)
	at java.lang.reflect.Method.invoke(Method.java:317)
	at junit.framework.TestCase.runTest(TestCase.java:164)
	at junit.framework.TestCase.runBare(TestCase.java)
	at junit.framework.TestResult$1.protect(TestResult.java)
	at junit.framework.TestResult.runProtected(TestResult.java)
	at junit.framework.TestResult.run(TestResult.java:109)
	at junit.framework.TestCase.run(TestCase.java:120)
	at junit.framework.TestSuite.runTest(TestSuite.java:230)
	at junit.framework.TestSuite.run(TestSuite.java)
	at org.apache.tools.ant.taskdefs.optional.junit.JUnitTestRunner.run(JUnitTestRunner.java)
	at org.apache.tools.ant.taskdefs.optional.junit.JUnitTestRunner.launch(JUnitTestRunner.java:672)
	at org.apache.tools.ant.taskdefs.optional.junit.JUnitTestRunner.main(JUnitTestRunner.java:546)
Test: testGetDeclaredAnnotationsClass: java.lang.reflect.Ctor5Testjava.lang.NullPointerException
	at java.lang.reflect.Proxy.newProxyInstance(Proxy.java:200)
	at org.apache.harmony.lang.annotation.AnnotationFactory.createAnnotation(AnnotationFactory.java:101)
	at org.apache.harmony.vm.VMGenericsAndAnnotations.getDeclaredAnnotations(VMGenericsAndAnnotations.java)
	at java.lang.reflect.Constructor$ConstructorData.getDeclaredAnnotations(Constructor.java:377)
	at java.lang.reflect.Constructor.getDeclaredAnnotations(Constructor.java:63)
	at org.apache.harmony.lang.AnnotatedElementTestFrame.testGetDeclaredAnnotations(AnnotatedElementTestFrame.java)
	at java.lang.reflect.VMReflection.invokeMethod(VMReflection.java)
	at java.lang.reflect.Method.invoke(Method.java:317)
	at junit.framework.TestCase.runTest(TestCase.java:164)
	at junit.framework.TestCase.runBare(TestCase.java)
	at junit.framework.TestResult$1.protect(TestResult.java)
	at junit.framework.TestResult.runProtected(TestResult.java)
	at junit.framework.TestResult.run(TestResult.java:109)
	at junit.framework.TestCase.run(TestCase.java:120)
	at junit.framework.TestSuite.runTest(TestSuite.java:230)
	at junit.framework.TestSuite.run(TestSuite.java)
	at org.apache.tools.ant.taskdefs.optional.junit.JUnitTestRunner.run(JUnitTestRunner.java)
	at org.apache.tools.ant.taskdefs.optional.junit.JUnitTestRunner.launch(JUnitTestRunner.java:672)
	at org.apache.tools.ant.taskdefs.optional.junit.JUnitTestRunner.main(JUnitTestRunner.java:546)
Test: testGetDeclaredAnnotations2Class: java.lang.reflect.Ctor5Testjava.lang.NullPointerException
	at java.lang.reflect.Proxy.newProxyInstance(Proxy.java:200)
	at org.apache.harmony.lang.annotation.AnnotationFactory.createAnnotation(AnnotationFactory.java:101)
	at org.apache.harmony.vm.VMGenericsAndAnnotations.getDeclaredAnnotations(VMGenericsAndAnnotations.java)
	at java.lang.reflect.Constructor$ConstructorData.getDeclaredAnnotations(Constructor.java:377)
	at java.lang.reflect.Constructor.getDeclaredAnnotations(Constructor.java:63)
	at org.apache.harmony.lang.AnnotatedElementTestFrame.testGetDeclaredAnnotations2(AnnotatedElementTestFrame.java)
	at java.lang.reflect.VMReflection.invokeMethod(VMReflection.java)
	at java.lang.reflect.Method.invoke(Method.java:317)
	at junit.framework.TestCase.runTest(TestCase.java:164)
	at junit.framework.TestCase.runBare(TestCase.java)
	at junit.framework.TestResult$1.protect(TestResult.java)
	at junit.framework.TestResult.runProtected(TestResult.java)
	at junit.framework.TestResult.run(TestResult.java:109)
	at junit.framework.TestCase.run(TestCase.java:120)
	at junit.framework.TestSuite.runTest(TestSuite.java:230)
	at junit.framework.TestSuite.run(TestSuite.java)
	at org.apache.tools.ant.taskdefs.optional.junit.JUnitTestRunner.run(JUnitTestRunner.java)
	at org.apache.tools.ant.taskdefs.optional.junit.JUnitTestRunner.launch(JUnitTestRunner.java:672)
	at org.apache.tools.ant.taskdefs.optional.junit.JUnitTestRunner.main(JUnitTestRunner.java:546)
Test: testGetDeclaredAnnotationsImmutableClass: java.lang.reflect.Ctor5Testjava.lang.NullPointerException
	at java.lang.reflect.Proxy.newProxyInstance(Proxy.java:200)
	at org.apache.harmony.lang.annotation.AnnotationFactory.createAnnotation(AnnotationFactory.java:101)
	at org.apache.harmony.vm.VMGenericsAndAnnotations.getDeclaredAnnotations(VMGenericsAndAnnotations.java)
	at java.lang.reflect.Constructor$ConstructorData.getDeclaredAnnotations(Constructor.java:377)
	at java.lang.reflect.Constructor.getDeclaredAnnotations(Constructor.java:63)
	at org.apache.harmony.lang.AnnotatedElementTestFrame.testGetDeclaredAnnotationsImmutable(AnnotatedElementTestFrame.java)
	at java.lang.reflect.VMReflection.invokeMethod(VMReflection.java)
	at java.lang.reflect.Method.invoke(Method.java:317)
	at junit.framework.TestCase.runTest(TestCase.java:164)
	at junit.framework.TestCase.runBare(TestCase.java)
	at junit.framework.TestResult$1.protect(TestResult.java)
	at junit.framework.TestResult.runProtected(TestResult.java)
	at junit.framework.TestResult.run(TestResult.java:109)
	at junit.framework.TestCase.run(TestCase.java:120)
	at junit.framework.TestSuite.runTest(TestSuite.java:230)
	at junit.framework.TestSuite.run(TestSuite.java)
	at org.apache.tools.ant.taskdefs.optional.junit.JUnitTestRunner.run(JUnitTestRunner.java)
	at org.apache.tools.ant.taskdefs.optional.junit.JUnitTestRunner.launch(JUnitTestRunner.java:672)
	at org.apache.tools.ant.taskdefs.optional.junit.JUnitTestRunner.main(JUnitTestRunner.java:546)
Test: testGetAnnotationsClass: java.lang.reflect.Ctor5Testjava.lang.NullPointerException
	at java.lang.reflect.Proxy.newProxyInstance(Proxy.java:200)
	at org.apache.harmony.lang.annotation.AnnotationFactory.createAnnotation(AnnotationFactory.java:101)
	at org.apache.harmony.vm.VMGenericsAndAnnotations.getDeclaredAnnotations(VMGenericsAndAnnotations.java)
	at java.lang.reflect.Constructor$ConstructorData.getDeclaredAnnotations(Constructor.java:377)
	at java.lang.reflect.Constructor.getDeclaredAnnotations(Constructor.java:63)
	at java.lang.reflect.AccessibleObject.getAnnotations(AccessibleObject.java)
	at org.apache.harmony.lang.AnnotatedElementTestFrame.testGetAnnotations(AnnotatedElementTestFrame.java)
	at java.lang.reflect.VMReflection.invokeMethod(VMReflection.java)
	at java.lang.reflect.Method.invoke(Method.java:317)
	at junit.framework.TestCase.runTest(TestCase.java:164)
	at junit.framework.TestCase.runBare(TestCase.java)
	at junit.framework.TestResult$1.protect(TestResult.java)
	at junit.framework.TestResult.runProtected(TestResult.java)
	at junit.framework.TestResult.run(TestResult.java:109)
	at junit.framework.TestCase.run(TestCase.java:120)
	at junit.framework.TestSuite.runTest(TestSuite.java:230)
	at junit.framework.TestSuite.run(TestSuite.java)
	at org.apache.tools.ant.taskdefs.optional.junit.JUnitTestRunner.run(JUnitTestRunner.java)
	at org.apache.tools.ant.taskdefs.optional.junit.JUnitTestRunner.launch(JUnitTestRunner.java:672)
	at org.apache.tools.ant.taskdefs.optional.junit.JUnitTestRunner.main(JUnitTestRunner.java:546)
Test: testGetAnnotations2Class: java.lang.reflect.Ctor5Testjava.lang.NullPointerException
	at java.lang.reflect.Proxy.newProxyInstance(Proxy.java:200)
	at org.apache.harmony.lang.annotation.AnnotationFactory.createAnnotation(AnnotationFactory.java:101)
	at org.apache.harmony.vm.VMGenericsAndAnnotations.getDeclaredAnnotations(VMGenericsAndAnnotations.java)
	at java.lang.reflect.Constructor$ConstructorData.getDeclaredAnnotations(Constructor.java:377)
	at java.lang.reflect.Constructor.getDeclaredAnnotations(Constructor.java:63)
	at java.lang.reflect.AccessibleObject.getAnnotations(AccessibleObject.java)
	at org.apache.harmony.lang.AnnotatedElementTestFrame.testGetAnnotations2(AnnotatedElementTestFrame.java)
	at java.lang.reflect.VMReflection.invokeMethod(VMReflection.java)
	at java.lang.reflect.Method.invoke(Method.java:317)
	at junit.framework.TestCase.runTest(TestCase.java:164)
	at junit.framework.TestCase.runBare(TestCase.java)
	at junit.framework.TestResult$1.protect(TestResult.java)
	at junit.framework.TestResult.runProtected(TestResult.java)
	at junit.framework.TestResult.run(TestResult.java:109)
	at junit.framework.TestCase.run(TestCase.java:120)
	at junit.framework.TestSuite.runTest(TestSuite.java:230)
	at junit.framework.TestSuite.run(TestSuite.java)
	at org.apache.tools.ant.taskdefs.optional.junit.JUnitTestRunner.run(JUnitTestRunner.java)
	at org.apache.tools.ant.taskdefs.optional.junit.JUnitTestRunner.launch(JUnitTestRunner.java:672)
	at org.apache.tools.ant.taskdefs.optional.junit.JUnitTestRunner.main(JUnitTestRunner.java:546)
Test: testGetAnnotations5Class: java.lang.reflect.Ctor5Testjava.lang.NullPointerException
	at java.lang.reflect.Proxy.newProxyInstance(Proxy.java:200)
	at org.apache.harmony.lang.annotation.AnnotationFactory.createAnnotation(AnnotationFactory.java:101)
	at org.apache.harmony.vm.VMGenericsAndAnnotations.getDeclaredAnnotations(VMGenericsAndAnnotations.java)
	at java.lang.reflect.Constructor$ConstructorData.getDeclaredAnnotations(Constructor.java:377)
	at java.lang.reflect.Constructor.getDeclaredAnnotations(Constructor.java:63)
	at java.lang.reflect.AccessibleObject.getAnnotations(AccessibleObject.java)
	at org.apache.harmony.lang.AnnotatedElementTestFrame.testGetAnnotations5(AnnotatedElementTestFrame.java)
	at java.lang.reflect.VMReflection.invokeMethod(VMReflection.java)
	at java.lang.reflect.Method.invoke(Method.java:317)
	at junit.framework.TestCase.runTest(TestCase.java:164)
	at junit.framework.TestCase.runBare(TestCase.java)
	at junit.framework.TestResult$1.protect(TestResult.java)
	at junit.framework.TestResult.runProtected(TestResult.java)
	at junit.framework.TestResult.run(TestResult.java:109)
	at junit.framework.TestCase.run(TestCase.java:120)
	at junit.framework.TestSuite.runTest(TestSuite.java:230)
	at junit.framework.TestSuite.run(TestSuite.java)
	at org.apache.tools.ant.taskdefs.optional.junit.JUnitTestRunner.run(JUnitTestRunner.java)
	at org.apache.tools.ant.taskdefs.optional.junit.JUnitTestRunner.launch(JUnitTestRunner.java:672)
	at org.apache.tools.ant.taskdefs.optional.junit.JUnitTestRunner.main(JUnitTestRunner.java:546)
Test: testGetAnnotationsImmutableClass: java.lang.reflect.Ctor5Testjava.lang.NullPointerException
	at java.lang.reflect.Proxy.newProxyInstance(Proxy.java:200)
	at org.apache.harmony.lang.annotation.AnnotationFactory.createAnnotation(AnnotationFactory.java:101)
	at org.apache.harmony.vm.VMGenericsAndAnnotations.getDeclaredAnnotations(VMGenericsAndAnnotations.java)
	at java.lang.reflect.Constructor$ConstructorData.getDeclaredAnnotations(Constructor.java:377)
	at java.lang.reflect.Constructor.getDeclaredAnnotations(Constructor.java:63)
	at java.lang.reflect.AccessibleObject.getAnnotations(AccessibleObject.java)
	at org.apache.harmony.lang.AnnotatedElementTestFrame.testGetAnnotationsImmutable(AnnotatedElementTestFrame.java)
	at java.lang.reflect.VMReflection.invokeMethod(VMReflection.java)
	at java.lang.reflect.Method.invoke(Method.java:317)
	at junit.framework.TestCase.runTest(TestCase.java:164)
	at junit.framework.TestCase.runBare(TestCase.java)
	at junit.framework.TestResult$1.protect(TestResult.java)
	at junit.framework.TestResult.runProtected(TestResult.java)
	at junit.framework.TestResult.run(TestResult.java:109)
	at junit.framework.TestCase.run(TestCase.java:120)
	at junit.framework.TestSuite.runTest(TestSuite.java:230)
	at junit.framework.TestSuite.run(TestSuite.java)
	at org.apache.tools.ant.taskdefs.optional.junit.JUnitTestRunner.run(JUnitTestRunner.java)
	at org.apache.tools.ant.taskdefs.optional.junit.JUnitTestRunner.launch(JUnitTestRunner.java:672)
	at org.apache.tools.ant.taskdefs.optional.junit.JUnitTestRunner.main(JUnitTestRunner.java:546)
Test: testIsAnnotationPresentClass: java.lang.reflect.Ctor5Testjava.lang.NullPointerException
	at java.lang.reflect.Proxy.newProxyInstance(Proxy.java:200)
	at org.apache.harmony.lang.annotation.AnnotationFactory.createAnnotation(AnnotationFactory.java:101)
	at org.apache.harmony.vm.VMGenericsAndAnnotations.getDeclaredAnnotations(VMGenericsAndAnnotations.java)
	at java.lang.reflect.Constructor$ConstructorData.getDeclaredAnnotations(Constructor.java:377)
	at java.lang.reflect.Constructor.getAnnotation(Constructor.java:77)
	at java.lang.reflect.AccessibleObject.isAnnotationPresent(AccessibleObject.java)
	at org.apache.harmony.lang.AnnotatedElementTestFrame.testIsAnnotationPresent(AnnotatedElementTestFrame.java)
	at java.lang.reflect.VMReflection.invokeMethod(VMReflection.java)
	at java.lang.reflect.Method.invoke(Method.java:317)
	at junit.framework.TestCase.runTest(TestCase.java:164)
	at junit.framework.TestCase.runBare(TestCase.java)
	at junit.framework.TestResult$1.protect(TestResult.java)
	at junit.framework.TestResult.runProtected(TestResult.java)
	at junit.framework.TestResult.run(TestResult.java:109)
	at junit.framework.TestCase.run(TestCase.java:120)
	at junit.framework.TestSuite.runTest(TestSuite.java:230)
	at junit.framework.TestSuite.run(TestSuite.java)
	at org.apache.tools.ant.taskdefs.optional.junit.JUnitTestRunner.run(JUnitTestRunner.java)
	at org.apache.tools.ant.taskdefs.optional.junit.JUnitTestRunner.launch(JUnitTestRunner.java:672)
	at org.apache.tools.ant.taskdefs.optional.junit.JUnitTestRunner.main(JUnitTestRunner.java:546)
Test: testIsAnnotationPresent_NegativeClass: java.lang.reflect.Ctor5Testjava.lang.NullPointerException
	at java.lang.reflect.Proxy.newProxyInstance(Proxy.java:200)
	at org.apache.harmony.lang.annotation.AnnotationFactory.createAnnotation(AnnotationFactory.java:101)
	at org.apache.harmony.vm.VMGenericsAndAnnotations.getDeclaredAnnotations(VMGenericsAndAnnotations.java)
	at java.lang.reflect.Constructor$ConstructorData.getDeclaredAnnotations(Constructor.java:377)
	at java.lang.reflect.Constructor.getAnnotation(Constructor.java:77)
	at java.lang.reflect.AccessibleObject.isAnnotationPresent(AccessibleObject.java)
	at org.apache.harmony.lang.AnnotatedElementTestFrame.testIsAnnotationPresent_Negative(AnnotatedElementTestFrame.java)
	at java.lang.reflect.VMReflection.invokeMethod(VMReflection.java)
	at java.lang.reflect.Method.invoke(Method.java:317)
	at junit.framework.TestCase.runTest(TestCase.java:164)
	at junit.framework.TestCase.runBare(TestCase.java)
	at junit.framework.TestResult$1.protect(TestResult.java)
	at junit.framework.TestResult.runProtected(TestResult.java)
	at junit.framework.TestResult.run(TestResult.java:109)
	at junit.framework.TestCase.run(TestCase.java:120)
	at junit.framework.TestSuite.runTest(TestSuite.java:230)
	at junit.framework.TestSuite.run(TestSuite.java)
	at org.apache.tools.ant.taskdefs.optional.junit.JUnitTestRunner.run(JUnitTestRunner.java)
	at org.apache.tools.ant.taskdefs.optional.junit.JUnitTestRunner.launch(JUnitTestRunner.java:672)
	at org.apache.tools.ant.taskdefs.optional.junit.JUnitTestRunner.main(JUnitTestRunner.java:546)
Test: testGetAnnotationClass: java.lang.reflect.Field5Testjava.lang.NullPointerException
	at java.lang.reflect.Proxy.newProxyInstance(Proxy.java:200)
	at org.apache.harmony.lang.annotation.AnnotationFactory.createAnnotation(AnnotationFactory.java:101)
	at org.apache.harmony.vm.VMGenericsAndAnnotations.getDeclaredAnnotations(VMGenericsAndAnnotations.java)
	at java.lang.reflect.Field$FieldData.getAnnotations(Field.java:458)
	at java.lang.reflect.Field.getAnnotation(Field.java:56)
	at org.apache.harmony.lang.AnnotatedElementTestFrame.testGetAnnotation(AnnotatedElementTestFrame.java)
	at java.lang.reflect.VMReflection.invokeMethod(VMReflection.java)
	at java.lang.reflect.Method.invoke(Method.java:317)
	at junit.framework.TestCase.runTest(TestCase.java:164)
	at junit.framework.TestCase.runBare(TestCase.java)
	at junit.framework.TestResult$1.protect(TestResult.java)
	at junit.framework.TestResult.runProtected(TestResult.java)
	at junit.framework.TestResult.run(TestResult.java:109)
	at junit.framework.TestCase.run(TestCase.java:120)
	at junit.framework.TestSuite.runTest(TestSuite.java:230)
	at junit.framework.TestSuite.run(TestSuite.java)
	at org.apache.tools.ant.taskdefs.optional.junit.JUnitTestRunner.run(JUnitTestRunner.java)
	at org.apache.tools.ant.taskdefs.optional.junit.JUnitTestRunner.launch(JUnitTestRunner.java:672)
	at org.apache.tools.ant.taskdefs.optional.junit.JUnitTestRunner.main(JUnitTestRunner.java:546)
Test: testGetAnnotation2Class: java.lang.reflect.Field5Testjava.lang.NullPointerException
	at java.lang.reflect.Proxy.newProxyInstance(Proxy.java:200)
	at org.apache.harmony.lang.annotation.AnnotationFactory.createAnnotation(AnnotationFactory.java:101)
	at org.apache.harmony.vm.VMGenericsAndAnnotations.getDeclaredAnnotations(VMGenericsAndAnnotations.java)
	at java.lang.reflect.Field$FieldData.getAnnotations(Field.java:458)
	at java.lang.reflect.Field.getAnnotation(Field.java:56)
	at org.apache.harmony.lang.AnnotatedElementTestFrame.testGetAnnotation2(AnnotatedElementTestFrame.java)
	at java.lang.reflect.VMReflection.invokeMethod(VMReflection.java)
	at java.lang.reflect.Method.invoke(Method.java:317)
	at junit.framework.TestCase.runTest(TestCase.java:164)
	at junit.framework.TestCase.runBare(TestCase.java)
	at junit.framework.TestResult$1.protect(TestResult.java)
	at junit.framework.TestResult.runProtected(TestResult.java)
	at junit.framework.TestResult.run(TestResult.java:109)
	at junit.framework.TestCase.run(TestCase.java:120)
	at junit.framework.TestSuite.runTest(TestSuite.java:230)
	at junit.framework.TestSuite.run(TestSuite.java)
	at org.apache.tools.ant.taskdefs.optional.junit.JUnitTestRunner.run(JUnitTestRunner.java)
	at org.apache.tools.ant.taskdefs.optional.junit.JUnitTestRunner.launch(JUnitTestRunner.java:672)
	at org.apache.tools.ant.taskdefs.optional.junit.JUnitTestRunner.main(JUnitTestRunner.java:546)
Test: testGetAnnotation_NegativeClass: java.lang.reflect.Field5Testjava.lang.NullPointerException
	at java.lang.reflect.Proxy.newProxyInstance(Proxy.java:200)
	at org.apache.harmony.lang.annotation.AnnotationFactory.createAnnotation(AnnotationFactory.java:101)
	at org.apache.harmony.vm.VMGenericsAndAnnotations.getDeclaredAnnotations(VMGenericsAndAnnotations.java)
	at java.lang.reflect.Field$FieldData.getAnnotations(Field.java:458)
	at java.lang.reflect.Field.getAnnotation(Field.java:56)
	at org.apache.harmony.lang.AnnotatedElementTestFrame.testGetAnnotation_Negative(AnnotatedElementTestFrame.java)
	at java.lang.reflect.VMReflection.invokeMethod(VMReflection.java)
	at java.lang.reflect.Method.invoke(Method.java:317)
	at junit.framework.TestCase.runTest(TestCase.java:164)
	at junit.framework.TestCase.runBare(TestCase.java)
	at junit.framework.TestResult$1.protect(TestResult.java)
	at junit.framework.TestResult.runProtected(TestResult.java)
	at junit.framework.TestResult.run(TestResult.java:109)
	at junit.framework.TestCase.run(TestCase.java:120)
	at junit.framework.TestSuite.runTest(TestSuite.java:230)
	at junit.framework.TestSuite.run(TestSuite.java)
	at org.apache.tools.ant.taskdefs.optional.junit.JUnitTestRunner.run(JUnitTestRunner.java)
	at org.apache.tools.ant.taskdefs.optional.junit.JUnitTestRunner.launch(JUnitTestRunner.java:672)
	at org.apache.tools.ant.taskdefs.optional.junit.JUnitTestRunner.main(JUnitTestRunner.java:546)
Test: testGetDeclaredAnnotationsClass: java.lang.reflect.Field5Testjava.lang.NullPointerException
	at java.lang.reflect.Proxy.newProxyInstance(Proxy.java:200)
	at org.apache.harmony.lang.annotation.AnnotationFactory.createAnnotation(AnnotationFactory.java:101)
	at org.apache.harmony.vm.VMGenericsAndAnnotations.getDeclaredAnnotations(VMGenericsAndAnnotations.java)
	at java.lang.reflect.Field$FieldData.getAnnotations(Field.java:458)
	at java.lang.reflect.Field.getDeclaredAnnotations(Field.java:42)
	at org.apache.harmony.lang.AnnotatedElementTestFrame.testGetDeclaredAnnotations(AnnotatedElementTestFrame.java)
	at java.lang.reflect.VMReflection.invokeMethod(VMReflection.java)
	at java.lang.reflect.Method.invoke(Method.java:317)
	at junit.framework.TestCase.runTest(TestCase.java:164)
	at junit.framework.TestCase.runBare(TestCase.java)
	at junit.framework.TestResult$1.protect(TestResult.java)
	at junit.framework.TestResult.runProtected(TestResult.java)
	at junit.framework.TestResult.run(TestResult.java:109)
	at junit.framework.TestCase.run(TestCase.java:120)
	at junit.framework.TestSuite.runTest(TestSuite.java:230)
	at junit.framework.TestSuite.run(TestSuite.java)
	at org.apache.tools.ant.taskdefs.optional.junit.JUnitTestRunner.run(JUnitTestRunner.java)
	at org.apache.tools.ant.taskdefs.optional.junit.JUnitTestRunner.launch(JUnitTestRunner.java:672)
	at org.apache.tools.ant.taskdefs.optional.junit.JUnitTestRunner.main(JUnitTestRunner.java:546)
Test: testGetDeclaredAnnotations2Class: java.lang.reflect.Field5Testjava.lang.NullPointerException
	at java.lang.reflect.Proxy.newProxyInstance(Proxy.java:200)
	at org.apache.harmony.lang.annotation.AnnotationFactory.createAnnotation(AnnotationFactory.java:101)
	at org.apache.harmony.vm.VMGenericsAndAnnotations.getDeclaredAnnotations(VMGenericsAndAnnotations.java)
	at java.lang.reflect.Field$FieldData.getAnnotations(Field.java:458)
	at java.lang.reflect.Field.getDeclaredAnnotations(Field.java:42)
	at org.apache.harmony.lang.AnnotatedElementTestFrame.testGetDeclaredAnnotations2(AnnotatedElementTestFrame.java)
	at java.lang.reflect.VMReflection.invokeMethod(VMReflection.java)
	at java.lang.reflect.Method.invoke(Method.java:317)
	at junit.framework.TestCase.runTest(TestCase.java:164)
	at junit.framework.TestCase.runBare(TestCase.java)
	at junit.framework.TestResult$1.protect(TestResult.java)
	at junit.framework.TestResult.runProtected(TestResult.java)
	at junit.framework.TestResult.run(TestResult.java:109)
	at junit.framework.TestCase.run(TestCase.java:120)
	at junit.framework.TestSuite.runTest(TestSuite.java:230)
	at junit.framework.TestSuite.run(TestSuite.java)
	at org.apache.tools.ant.taskdefs.optional.junit.JUnitTestRunner.run(JUnitTestRunner.java)
	at org.apache.tools.ant.taskdefs.optional.junit.JUnitTestRunner.launch(JUnitTestRunner.java:672)
	at org.apache.tools.ant.taskdefs.optional.junit.JUnitTestRunner.main(JUnitTestRunner.java:546)
Test: testGetDeclaredAnnotationsImmutableClass: java.lang.reflect.Field5Testjava.lang.NullPointerException
	at java.lang.reflect.Proxy.newProxyInstance(Proxy.java:200)
	at org.apache.harmony.lang.annotation.AnnotationFactory.createAnnotation(AnnotationFactory.java:101)
	at org.apache.harmony.vm.VMGenericsAndAnnotations.getDeclaredAnnotations(VMGenericsAndAnnotations.java)
	at java.lang.reflect.Field$FieldData.getAnnotations(Field.java:458)
	at java.lang.reflect.Field.getDeclaredAnnotations(Field.java:42)
	at org.apache.harmony.lang.AnnotatedElementTestFrame.testGetDeclaredAnnotationsImmutable(AnnotatedElementTestFrame.java)
	at java.lang.reflect.VMReflection.invokeMethod(VMReflection.java)
	at java.lang.reflect.Method.invoke(Method.java:317)
	at junit.framework.TestCase.runTest(TestCase.java:164)
	at junit.framework.TestCase.runBare(TestCase.java)
	at junit.framework.TestResult$1.protect(TestResult.java)
	at junit.framework.TestResult.runProtected(TestResult.java)
	at junit.framework.TestResult.run(TestResult.java:109)
	at junit.framework.TestCase.run(TestCase.java:120)
	at junit.framework.TestSuite.runTest(TestSuite.java:230)
	at junit.framework.TestSuite.run(TestSuite.java)
	at org.apache.tools.ant.taskdefs.optional.junit.JUnitTestRunner.run(JUnitTestRunner.java)
	at org.apache.tools.ant.taskdefs.optional.junit.JUnitTestRunner.launch(JUnitTestRunner.java:672)
	at org.apache.tools.ant.taskdefs.optional.junit.JUnitTestRunner.main(JUnitTestRunner.java:546)
Test: testGetAnnotationsClass: java.lang.reflect.Field5Testjava.lang.NullPointerException
	at java.lang.reflect.Proxy.newProxyInstance(Proxy.java:200)
	at org.apache.harmony.lang.annotation.AnnotationFactory.createAnnotation(AnnotationFactory.java:101)
	at org.apache.harmony.vm.VMGenericsAndAnnotations.getDeclaredAnnotations(VMGenericsAndAnnotations.java)
	at java.lang.reflect.Field$FieldData.getAnnotations(Field.java:458)
	at java.lang.reflect.Field.getDeclaredAnnotations(Field.java:42)
	at java.lang.reflect.AccessibleObject.getAnnotations(AccessibleObject.java)
	at org.apache.harmony.lang.AnnotatedElementTestFrame.testGetAnnotations(AnnotatedElementTestFrame.java)
	at java.lang.reflect.VMReflection.invokeMethod(VMReflection.java)
	at java.lang.reflect.Method.invoke(Method.java:317)
	at junit.framework.TestCase.runTest(TestCase.java:164)
	at junit.framework.TestCase.runBare(TestCase.java)
	at junit.framework.TestResult$1.protect(TestResult.java)
	at junit.framework.TestResult.runProtected(TestResult.java)
	at junit.framework.TestResult.run(TestResult.java:109)
	at junit.framework.TestCase.run(TestCase.java:120)
	at junit.framework.TestSuite.runTest(TestSuite.java:230)
	at junit.framework.TestSuite.run(TestSuite.java)
	at org.apache.tools.ant.taskdefs.optional.junit.JUnitTestRunner.run(JUnitTestRunner.java)
	at org.apache.tools.ant.taskdefs.optional.junit.JUnitTestRunner.launch(JUnitTestRunner.java:672)
	at org.apache.tools.ant.taskdefs.optional.junit.JUnitTestRunner.main(JUnitTestRunner.java:546)
Test: testGetAnnotations2Class: java.lang.reflect.Field5Testjava.lang.NullPointerException
	at java.lang.reflect.Proxy.newProxyInstance(Proxy.java:200)
	at org.apache.harmony.lang.annotation.AnnotationFactory.createAnnotation(AnnotationFactory.java:101)
	at org.apache.harmony.vm.VMGenericsAndAnnotations.getDeclaredAnnotations(VMGenericsAndAnnotations.java)
	at java.lang.reflect.Field$FieldData.getAnnotations(Field.java:458)
	at java.lang.reflect.Field.getDeclaredAnnotations(Field.java:42)
	at java.lang.reflect.AccessibleObject.getAnnotations(AccessibleObject.java)
	at org.apache.harmony.lang.AnnotatedElementTestFrame.testGetAnnotations2(AnnotatedElementTestFrame.java)
	at java.lang.reflect.VMReflection.invokeMethod(VMReflection.java)
	at java.lang.reflect.Method.invoke(Method.java:317)
	at junit.framework.TestCase.runTest(TestCase.java:164)
	at junit.framework.TestCase.runBare(TestCase.java)
	at junit.framework.TestResult$1.protect(TestResult.java)
	at junit.framework.TestResult.runProtected(TestResult.java)
	at junit.framework.TestResult.run(TestResult.java:109)
	at junit.framework.TestCase.run(TestCase.java:120)
	at junit.framework.TestSuite.runTest(TestSuite.java:230)
	at junit.framework.TestSuite.run(TestSuite.java)
	at org.apache.tools.ant.taskdefs.optional.junit.JUnitTestRunner.run(JUnitTestRunner.java)
	at org.apache.tools.ant.taskdefs.optional.junit.JUnitTestRunner.launch(JUnitTestRunner.java:672)
	at org.apache.tools.ant.taskdefs.optional.junit.JUnitTestRunner.main(JUnitTestRunner.java:546)
Test: testGetAnnotations5Class: java.lang.reflect.Field5Testjava.lang.NullPointerException
	at java.lang.reflect.Proxy.newProxyInstance(Proxy.java:200)
	at org.apache.harmony.lang.annotation.AnnotationFactory.createAnnotation(AnnotationFactory.java:101)
	at org.apache.harmony.vm.VMGenericsAndAnnotations.getDeclaredAnnotations(VMGenericsAndAnnotations.java)
	at java.lang.reflect.Field$FieldData.getAnnotations(Field.java:458)
	at java.lang.reflect.Field.getDeclaredAnnotations(Field.java:42)
	at java.lang.reflect.AccessibleObject.getAnnotations(AccessibleObject.java)
	at org.apache.harmony.lang.AnnotatedElementTestFrame.testGetAnnotations5(AnnotatedElementTestFrame.java)
	at java.lang.reflect.VMReflection.invokeMethod(VMReflection.java)
	at java.lang.reflect.Method.invoke(Method.java:317)
	at junit.framework.TestCase.runTest(TestCase.java:164)
	at junit.framework.TestCase.runBare(TestCase.java)
	at junit.framework.TestResult$1.protect(TestResult.java)
	at junit.framework.TestResult.runProtected(TestResult.java)
	at junit.framework.TestResult.run(TestResult.java:109)
	at junit.framework.TestCase.run(TestCase.java:120)
	at junit.framework.TestSuite.runTest(TestSuite.java:230)
	at junit.framework.TestSuite.run(TestSuite.java)
	at org.apache.tools.ant.taskdefs.optional.junit.JUnitTestRunner.run(JUnitTestRunner.java)
	at org.apache.tools.ant.taskdefs.optional.junit.JUnitTestRunner.launch(JUnitTestRunner.java:672)
	at org.apache.tools.ant.taskdefs.optional.junit.JUnitTestRunner.main(JUnitTestRunner.java:546)
Test: testGetAnnotationsImmutableClass: java.lang.reflect.Field5Testjava.lang.NullPointerException
	at java.lang.reflect.Proxy.newProxyInstance(Proxy.java:200)
	at org.apache.harmony.lang.annotation.AnnotationFactory.createAnnotation(AnnotationFactory.java:101)
	at org.apache.harmony.vm.VMGenericsAndAnnotations.getDeclaredAnnotations(VMGenericsAndAnnotations.java)
	at java.lang.reflect.Field$FieldData.getAnnotations(Field.java:458)
	at java.lang.reflect.Field.getDeclaredAnnotations(Field.java:42)
	at java.lang.reflect.AccessibleObject.getAnnotations(AccessibleObject.java)
	at org.apache.harmony.lang.AnnotatedElementTestFrame.testGetAnnotationsImmutable(AnnotatedElementTestFrame.java)
	at java.lang.reflect.VMReflection.invokeMethod(VMReflection.java)
	at java.lang.reflect.Method.invoke(Method.java:317)
	at junit.framework.TestCase.runTest(TestCase.java:164)
	at junit.framework.TestCase.runBare(TestCase.java)
	at junit.framework.TestResult$1.protect(TestResult.java)
	at junit.framework.TestResult.runProtected(TestResult.java)
	at junit.framework.TestResult.run(TestResult.java:109)
	at junit.framework.TestCase.run(TestCase.java:120)
	at junit.framework.TestSuite.runTest(TestSuite.java:230)
	at junit.framework.TestSuite.run(TestSuite.java)
	at org.apache.tools.ant.taskdefs.optional.junit.JUnitTestRunner.run(JUnitTestRunner.java)
	at org.apache.tools.ant.taskdefs.optional.junit.JUnitTestRunner.launch(JUnitTestRunner.java:672)
	at org.apache.tools.ant.taskdefs.optional.junit.JUnitTestRunner.main(JUnitTestRunner.java:546)
Test: testIsAnnotationPresentClass: java.lang.reflect.Field5Testjava.lang.NullPointerException
	at java.lang.reflect.Proxy.newProxyInstance(Proxy.java:200)
	at org.apache.harmony.lang.annotation.AnnotationFactory.createAnnotation(AnnotationFactory.java:101)
	at org.apache.harmony.vm.VMGenericsAndAnnotations.getDeclaredAnnotations(VMGenericsAndAnnotations.java)
	at java.lang.reflect.Field$FieldData.getAnnotations(Field.java:458)
	at java.lang.reflect.Field.getAnnotation(Field.java:56)
	at java.lang.reflect.AccessibleObject.isAnnotationPresent(AccessibleObject.java)
	at org.apache.harmony.lang.AnnotatedElementTestFrame.testIsAnnotationPresent(AnnotatedElementTestFrame.java)
	at java.lang.reflect.VMReflection.invokeMethod(VMReflection.java)
	at java.lang.reflect.Method.invoke(Method.java:317)
	at junit.framework.TestCase.runTest(TestCase.java:164)
	at junit.framework.TestCase.runBare(TestCase.java)
	at junit.framework.TestResult$1.protect(TestResult.java)
	at junit.framework.TestResult.runProtected(TestResult.java)
	at junit.framework.TestResult.run(TestResult.java:109)
	at junit.framework.TestCase.run(TestCase.java:120)
	at junit.framework.TestSuite.runTest(TestSuite.java:230)
	at junit.framework.TestSuite.run(TestSuite.java)
	at org.apache.tools.ant.taskdefs.optional.junit.JUnitTestRunner.run(JUnitTestRunner.java)
	at org.apache.tools.ant.taskdefs.optional.junit.JUnitTestRunner.launch(JUnitTestRunner.java:672)
	at org.apache.tools.ant.taskdefs.optional.junit.JUnitTestRunner.main(JUnitTestRunner.java:546)
Test: testIsAnnotationPresent_NegativeClass: java.lang.reflect.Field5Testjava.lang.NullPointerException
	at java.lang.reflect.Proxy.newProxyInstance(Proxy.java:200)
	at org.apache.harmony.lang.annotation.AnnotationFactory.createAnnotation(AnnotationFactory.java:101)
	at org.apache.harmony.vm.VMGenericsAndAnnotations.getDeclaredAnnotations(VMGenericsAndAnnotations.java)
	at java.lang.reflect.Field$FieldData.getAnnotations(Field.java:458)
	at java.lang.reflect.Field.getAnnotation(Field.java:56)
	at java.lang.reflect.AccessibleObject.isAnnotationPresent(AccessibleObject.java)
	at org.apache.harmony.lang.AnnotatedElementTestFrame.testIsAnnotationPresent_Negative(AnnotatedElementTestFrame.java)
	at java.lang.reflect.VMReflection.invokeMethod(VMReflection.java)
	at java.lang.reflect.Method.invoke(Method.java:317)
	at junit.framework.TestCase.runTest(TestCase.java:164)
	at junit.framework.TestCase.runBare(TestCase.java)
	at junit.framework.TestResult$1.protect(TestResult.java)
	at junit.framework.TestResult.runProtected(TestResult.java)
	at junit.framework.TestResult.run(TestResult.java:109)
	at junit.framework.TestCase.run(TestCase.java:120)
	at junit.framework.TestSuite.runTest(TestSuite.java:230)
	at junit.framework.TestSuite.run(TestSuite.java)
	at org.apache.tools.ant.taskdefs.optional.junit.JUnitTestRunner.run(JUnitTestRunner.java)
	at org.apache.tools.ant.taskdefs.optional.junit.JUnitTestRunner.launch(JUnitTestRunner.java:672)
	at org.apache.tools.ant.taskdefs.optional.junit.JUnitTestRunner.main(JUnitTestRunner.java:546)
Test: testGetParameterAnnotations2Class: java.lang.reflect.Method5Testjava.lang.reflect.InvocationTargetException
	at java.lang.reflect.VMReflection.invokeMethod(VMReflection.java)
	at java.lang.reflect.Method.invoke(Method.java:317)
	at java.lang.reflect.Method5Test.getParamAnnotations(Method5Test.java:81)
	at java.lang.reflect.Method5Test.testGetParameterAnnotations2(Method5Test.java:113)
	at java.lang.reflect.VMReflection.invokeMethod(VMReflection.java)
	at java.lang.reflect.Method.invoke(Method.java:317)
	at junit.framework.TestCase.runTest(TestCase.java:164)
	at junit.framework.TestCase.runBare(TestCase.java)
	at junit.framework.TestResult$1.protect(TestResult.java)
	at junit.framework.TestResult.runProtected(TestResult.java)
	at junit.framework.TestResult.run(TestResult.java:109)
	at junit.framework.TestCase.run(TestCase.java:120)
	at junit.framework.TestSuite.runTest(TestSuite.java:230)
	at junit.framework.TestSuite.run(TestSuite.java)
	at org.apache.tools.ant.taskdefs.optional.junit.JUnitTestRunner.run(JUnitTestRunner.java)
	at org.apache.tools.ant.taskdefs.optional.junit.JUnitTestRunner.launch(JUnitTestRunner.java:672)
	at org.apache.tools.ant.taskdefs.optional.junit.JUnitTestRunner.main(JUnitTestRunner.java:546)
Caused by: java.lang.NullPointerException
	at java.lang.reflect.Proxy.newProxyInstance(Proxy.java:200)
	at org.apache.harmony.lang.annotation.AnnotationFactory.createAnnotation(AnnotationFactory.java:101)
	at org.apache.harmony.vm.VMGenericsAndAnnotations.getParameterAnnotations(VMGenericsAndAnnotations.java)
	at java.lang.reflect.Method$MethodData.getParameterAnnotations(Method.java:444)
	at java.lang.reflect.Method.getParameterAnnotations(Method.java:58)
	at java.lang.reflect.VMReflection.invokeMethod(VMReflection.java)
	... 16 more
Test: testGetParameterAnnotations3Class: java.lang.reflect.Method5Testjava.lang.reflect.InvocationTargetException
	at java.lang.reflect.VMReflection.invokeMethod(VMReflection.java)
	at java.lang.reflect.Method.invoke(Method.java:317)
	at java.lang.reflect.Method5Test.getParamAnnotations(Method5Test.java:81)
	at java.lang.reflect.Method5Test.testGetParameterAnnotations3(Method5Test.java:140)
	at java.lang.reflect.VMReflection.invokeMethod(VMReflection.java)
	at java.lang.reflect.Method.invoke(Method.java:317)
	at junit.framework.TestCase.runTest(TestCase.java:164)
	at junit.framework.TestCase.runBare(TestCase.java)
	at junit.framework.TestResult$1.protect(TestResult.java)
	at junit.framework.TestResult.runProtected(TestResult.java)
	at junit.framework.TestResult.run(TestResult.java:109)
	at junit.framework.TestCase.run(TestCase.java:120)
	at junit.framework.TestSuite.runTest(TestSuite.java:230)
	at junit.framework.TestSuite.run(TestSuite.java)
	at org.apache.tools.ant.taskdefs.optional.junit.JUnitTestRunner.run(JUnitTestRunner.java)
	at org.apache.tools.ant.taskdefs.optional.junit.JUnitTestRunner.launch(JUnitTestRunner.java:672)
	at org.apache.tools.ant.taskdefs.optional.junit.JUnitTestRunner.main(JUnitTestRunner.java:546)
Caused by: java.lang.NullPointerException
	at java.lang.reflect.Proxy.newProxyInstance(Proxy.java:200)
	at org.apache.harmony.lang.annotation.AnnotationFactory.createAnnotation(AnnotationFactory.java:101)
	at org.apache.harmony.vm.VMGenericsAndAnnotations.getParameterAnnotations(VMGenericsAndAnnotations.java)
	at java.lang.reflect.Method$MethodData.getParameterAnnotations(Method.java:444)
	at java.lang.reflect.Method.getParameterAnnotations(Method.java:58)
	at java.lang.reflect.VMReflection.invokeMethod(VMReflection.java)
	... 16 more
Test: testGetParameterAnnotationsImmutableClass: java.lang.reflect.Method5Testjava.lang.reflect.InvocationTargetException
	at java.lang.reflect.VMReflection.invokeMethod(VMReflection.java)
	at java.lang.reflect.Method.invoke(Method.java:317)
	at java.lang.reflect.Method5Test.getParamAnnotations(Method5Test.java:81)
	at java.lang.reflect.Method5Test.testGetParameterAnnotationsImmutable(Method5Test.java:157)
	at java.lang.reflect.VMReflection.invokeMethod(VMReflection.java)
	at java.lang.reflect.Method.invoke(Method.java:317)
	at junit.framework.TestCase.runTest(TestCase.java:164)
	at junit.framework.TestCase.runBare(TestCase.java)
	at junit.framework.TestResult$1.protect(TestResult.java)
	at junit.framework.TestResult.runProtected(TestResult.java)
	at junit.framework.TestResult.run(TestResult.java:109)
	at junit.framework.TestCase.run(TestCase.java:120)
	at junit.framework.TestSuite.runTest(TestSuite.java:230)
	at junit.framework.TestSuite.run(TestSuite.java)
	at org.apache.tools.ant.taskdefs.optional.junit.JUnitTestRunner.run(JUnitTestRunner.java)
	at org.apache.tools.ant.taskdefs.optional.junit.JUnitTestRunner.launch(JUnitTestRunner.java:672)
	at org.apache.tools.ant.taskdefs.optional.junit.JUnitTestRunner.main(JUnitTestRunner.java:546)
Caused by: java.lang.NullPointerException
	at java.lang.reflect.Proxy.newProxyInstance(Proxy.java:200)
	at org.apache.harmony.lang.annotation.AnnotationFactory.createAnnotation(AnnotationFactory.java:101)
	at org.apache.harmony.vm.VMGenericsAndAnnotations.getParameterAnnotations(VMGenericsAndAnnotations.java)
	at java.lang.reflect.Method$MethodData.getParameterAnnotations(Method.java:444)
	at java.lang.reflect.Method.getParameterAnnotations(Method.java:58)
	at java.lang.reflect.VMReflection.invokeMethod(VMReflection.java)
	... 16 more
Test: testGetAnnotationClass: java.lang.reflect.Method5Testjava.lang.NullPointerException
	at java.lang.reflect.Proxy.newProxyInstance(Proxy.java:200)
	at org.apache.harmony.lang.annotation.AnnotationFactory.createAnnotation(AnnotationFactory.java:101)
	at org.apache.harmony.vm.VMGenericsAndAnnotations.getDeclaredAnnotations(VMGenericsAndAnnotations.java)
	at java.lang.reflect.Method$MethodData.getDeclaredAnnotations(Method.java:426)
	at java.lang.reflect.Method.getAnnotation(Method.java:85)
	at org.apache.harmony.lang.AnnotatedElementTestFrame.testGetAnnotation(AnnotatedElementTestFrame.java)
	at java.lang.reflect.VMReflection.invokeMethod(VMReflection.java)
	at java.lang.reflect.Method.invoke(Method.java:317)
	at junit.framework.TestCase.runTest(TestCase.java:164)
	at junit.framework.TestCase.runBare(TestCase.java)
	at junit.framework.TestResult$1.protect(TestResult.java)
	at junit.framework.TestResult.runProtected(TestResult.java)
	at junit.framework.TestResult.run(TestResult.java:109)
	at junit.framework.TestCase.run(TestCase.java:120)
	at junit.framework.TestSuite.runTest(TestSuite.java:230)
	at junit.framework.TestSuite.run(TestSuite.java)
	at org.apache.tools.ant.taskdefs.optional.junit.JUnitTestRunner.run(JUnitTestRunner.java)
	at org.apache.tools.ant.taskdefs.optional.junit.JUnitTestRunner.launch(JUnitTestRunner.java:672)
	at org.apache.tools.ant.taskdefs.optional.junit.JUnitTestRunner.main(JUnitTestRunner.java:546)
Test: testGetAnnotation2Class: java.lang.reflect.Method5Testjava.lang.NullPointerException
	at java.lang.reflect.Proxy.newProxyInstance(Proxy.java:200)
	at org.apache.harmony.lang.annotation.AnnotationFactory.createAnnotation(AnnotationFactory.java:101)
	at org.apache.harmony.vm.VMGenericsAndAnnotations.getDeclaredAnnotations(VMGenericsAndAnnotations.java)
	at java.lang.reflect.Method$MethodData.getDeclaredAnnotations(Method.java:426)
	at java.lang.reflect.Method.getAnnotation(Method.java:85)
	at org.apache.harmony.lang.AnnotatedElementTestFrame.testGetAnnotation2(AnnotatedElementTestFrame.java)
	at java.lang.reflect.VMReflection.invokeMethod(VMReflection.java)
	at java.lang.reflect.Method.invoke(Method.java:317)
	at junit.framework.TestCase.runTest(TestCase.java:164)
	at junit.framework.TestCase.runBare(TestCase.java)
	at junit.framework.TestResult$1.protect(TestResult.java)
	at junit.framework.TestResult.runProtected(TestResult.java)
	at junit.framework.TestResult.run(TestResult.java:109)
	at junit.framework.TestCase.run(TestCase.java:120)
	at junit.framework.TestSuite.runTest(TestSuite.java:230)
	at junit.framework.TestSuite.run(TestSuite.java)
	at org.apache.tools.ant.taskdefs.optional.junit.JUnitTestRunner.run(JUnitTestRunner.java)
	at org.apache.tools.ant.taskdefs.optional.junit.JUnitTestRunner.launch(JUnitTestRunner.java:672)
	at org.apache.tools.ant.taskdefs.optional.junit.JUnitTestRunner.main(JUnitTestRunner.java:546)
Test: testGetAnnotation_NegativeClass: java.lang.reflect.Method5Testjava.lang.NullPointerException
	at java.lang.reflect.Proxy.newProxyInstance(Proxy.java:200)
	at org.apache.harmony.lang.annotation.AnnotationFactory.createAnnotation(AnnotationFactory.java:101)
	at org.apache.harmony.vm.VMGenericsAndAnnotations.getDeclaredAnnotations(VMGenericsAndAnnotations.java)
	at java.lang.reflect.Method$MethodData.getDeclaredAnnotations(Method.java:426)
	at java.lang.reflect.Method.getAnnotation(Method.java:85)
	at org.apache.harmony.lang.AnnotatedElementTestFrame.testGetAnnotation_Negative(AnnotatedElementTestFrame.java)
	at java.lang.reflect.VMReflection.invokeMethod(VMReflection.java)
	at java.lang.reflect.Method.invoke(Method.java:317)
	at junit.framework.TestCase.runTest(TestCase.java:164)
	at junit.framework.TestCase.runBare(TestCase.java)
	at junit.framework.TestResult$1.protect(TestResult.java)
	at junit.framework.TestResult.runProtected(TestResult.java)
	at junit.framework.TestResult.run(TestResult.java:109)
	at junit.framework.TestCase.run(TestCase.java:120)
	at junit.framework.TestSuite.runTest(TestSuite.java:230)
	at junit.framework.TestSuite.run(TestSuite.java)
	at org.apache.tools.ant.taskdefs.optional.junit.JUnitTestRunner.run(JUnitTestRunner.java)
	at org.apache.tools.ant.taskdefs.optional.junit.JUnitTestRunner.launch(JUnitTestRunner.java:672)
	at org.apache.tools.ant.taskdefs.optional.junit.JUnitTestRunner.main(JUnitTestRunner.java:546)
Test: testGetDeclaredAnnotationsClass: java.lang.reflect.Method5Testjava.lang.NullPointerException
	at java.lang.reflect.Proxy.newProxyInstance(Proxy.java:200)
	at org.apache.harmony.lang.annotation.AnnotationFactory.createAnnotation(AnnotationFactory.java:101)
	at org.apache.harmony.vm.VMGenericsAndAnnotations.getDeclaredAnnotations(VMGenericsAndAnnotations.java)
	at java.lang.reflect.Method$MethodData.getDeclaredAnnotations(Method.java:426)
	at java.lang.reflect.Method.getDeclaredAnnotations(Method.java:71)
	at org.apache.harmony.lang.AnnotatedElementTestFrame.testGetDeclaredAnnotations(AnnotatedElementTestFrame.java)
	at java.lang.reflect.VMReflection.invokeMethod(VMReflection.java)
	at java.lang.reflect.Method.invoke(Method.java:317)
	at junit.framework.TestCase.runTest(TestCase.java:164)
	at junit.framework.TestCase.runBare(TestCase.java)
	at junit.framework.TestResult$1.protect(TestResult.java)
	at junit.framework.TestResult.runProtected(TestResult.java)
	at junit.framework.TestResult.run(TestResult.java:109)
	at junit.framework.TestCase.run(TestCase.java:120)
	at junit.framework.TestSuite.runTest(TestSuite.java:230)
	at junit.framework.TestSuite.run(TestSuite.java)
	at org.apache.tools.ant.taskdefs.optional.junit.JUnitTestRunner.run(JUnitTestRunner.java)
	at org.apache.tools.ant.taskdefs.optional.junit.JUnitTestRunner.launch(JUnitTestRunner.java:672)
	at org.apache.tools.ant.taskdefs.optional.junit.JUnitTestRunner.main(JUnitTestRunner.java:546)
Test: testGetDeclaredAnnotations2Class: java.lang.reflect.Method5Testjava.lang.NullPointerException
	at java.lang.reflect.Proxy.newProxyInstance(Proxy.java:200)
	at org.apache.harmony.lang.annotation.AnnotationFactory.createAnnotation(AnnotationFactory.java:101)
	at org.apache.harmony.vm.VMGenericsAndAnnotations.getDeclaredAnnotations(VMGenericsAndAnnotations.java)
	at java.lang.reflect.Method$MethodData.getDeclaredAnnotations(Method.java:426)
	at java.lang.reflect.Method.getDeclaredAnnotations(Method.java:71)
	at org.apache.harmony.lang.AnnotatedElementTestFrame.testGetDeclaredAnnotations2(AnnotatedElementTestFrame.java)
	at java.lang.reflect.VMReflection.invokeMethod(VMReflection.java)
	at java.lang.reflect.Method.invoke(Method.java:317)
	at junit.framework.TestCase.runTest(TestCase.java:164)
	at junit.framework.TestCase.runBare(TestCase.java)
	at junit.framework.TestResult$1.protect(TestResult.java)
	at junit.framework.TestResult.runProtected(TestResult.java)
	at junit.framework.TestResult.run(TestResult.java:109)
	at junit.framework.TestCase.run(TestCase.java:120)
	at junit.framework.TestSuite.runTest(TestSuite.java:230)
	at junit.framework.TestSuite.run(TestSuite.java)
	at org.apache.tools.ant.taskdefs.optional.junit.JUnitTestRunner.run(JUnitTestRunner.java)
	at org.apache.tools.ant.taskdefs.optional.junit.JUnitTestRunner.launch(JUnitTestRunner.java:672)
	at org.apache.tools.ant.taskdefs.optional.junit.JUnitTestRunner.main(JUnitTestRunner.java:546)
Test: testGetDeclaredAnnotationsImmutableClass: java.lang.reflect.Method5Testjava.lang.NullPointerException
	at java.lang.reflect.Proxy.newProxyInstance(Proxy.java:200)
	at org.apache.harmony.lang.annotation.AnnotationFactory.createAnnotation(AnnotationFactory.java:101)
	at org.apache.harmony.vm.VMGenericsAndAnnotations.getDeclaredAnnotations(VMGenericsAndAnnotations.java)
	at java.lang.reflect.Method$MethodData.getDeclaredAnnotations(Method.java:426)
	at java.lang.reflect.Method.getDeclaredAnnotations(Method.java:71)
	at org.apache.harmony.lang.AnnotatedElementTestFrame.testGetDeclaredAnnotationsImmutable(AnnotatedElementTestFrame.java)
	at java.lang.reflect.VMReflection.invokeMethod(VMReflection.java)
	at java.lang.reflect.Method.invoke(Method.java:317)
	at junit.framework.TestCase.runTest(TestCase.java:164)
	at junit.framework.TestCase.runBare(TestCase.java)
	at junit.framework.TestResult$1.protect(TestResult.java)
	at junit.framework.TestResult.runProtected(TestResult.java)
	at junit.framework.TestResult.run(TestResult.java:109)
	at junit.framework.TestCase.run(TestCase.java:120)
	at junit.framework.TestSuite.runTest(TestSuite.java:230)
	at junit.framework.TestSuite.run(TestSuite.java)
	at org.apache.tools.ant.taskdefs.optional.junit.JUnitTestRunner.run(JUnitTestRunner.java)
	at org.apache.tools.ant.taskdefs.optional.junit.JUnitTestRunner.launch(JUnitTestRunner.java:672)
	at org.apache.tools.ant.taskdefs.optional.junit.JUnitTestRunner.main(JUnitTestRunner.java:546)
Test: testGetAnnotationsClass: java.lang.reflect.Method5Testjava.lang.NullPointerException
	at java.lang.reflect.Proxy.newProxyInstance(Proxy.java:200)
	at org.apache.harmony.lang.annotation.AnnotationFactory.createAnnotation(AnnotationFactory.java:101)
	at org.apache.harmony.vm.VMGenericsAndAnnotations.getDeclaredAnnotations(VMGenericsAndAnnotations.java)
	at java.lang.reflect.Method$MethodData.getDeclaredAnnotations(Method.java:426)
	at java.lang.reflect.Method.getDeclaredAnnotations(Method.java:71)
	at java.lang.reflect.AccessibleObject.getAnnotations(AccessibleObject.java)
	at org.apache.harmony.lang.AnnotatedElementTestFrame.testGetAnnotations(AnnotatedElementTestFrame.java)
	at java.lang.reflect.VMReflection.invokeMethod(VMReflection.java)
	at java.lang.reflect.Method.invoke(Method.java:317)
	at junit.framework.TestCase.runTest(TestCase.java:164)
	at junit.framework.TestCase.runBare(TestCase.java)
	at junit.framework.TestResult$1.protect(TestResult.java)
	at junit.framework.TestResult.runProtected(TestResult.java)
	at junit.framework.TestResult.run(TestResult.java:109)
	at junit.framework.TestCase.run(TestCase.java:120)
	at junit.framework.TestSuite.runTest(TestSuite.java:230)
	at junit.framework.TestSuite.run(TestSuite.java)
	at org.apache.tools.ant.taskdefs.optional.junit.JUnitTestRunner.run(JUnitTestRunner.java)
	at org.apache.tools.ant.taskdefs.optional.junit.JUnitTestRunner.launch(JUnitTestRunner.java:672)
	at org.apache.tools.ant.taskdefs.optional.junit.JUnitTestRunner.main(JUnitTestRunner.java:546)
Test: testGetAnnotations2Class: java.lang.reflect.Method5Testjava.lang.NullPointerException
	at java.lang.reflect.Proxy.newProxyInstance(Proxy.java:200)
	at org.apache.harmony.lang.annotation.AnnotationFactory.createAnnotation(AnnotationFactory.java:101)
	at org.apache.harmony.vm.VMGenericsAndAnnotations.getDeclaredAnnotations(VMGenericsAndAnnotations.java)
	at java.lang.reflect.Method$MethodData.getDeclaredAnnotations(Method.java:426)
	at java.lang.reflect.Method.getDeclaredAnnotations(Method.java:71)
	at java.lang.reflect.AccessibleObject.getAnnotations(AccessibleObject.java)
	at org.apache.harmony.lang.AnnotatedElementTestFrame.testGetAnnotations2(AnnotatedElementTestFrame.java)
	at java.lang.reflect.VMReflection.invokeMethod(VMReflection.java)
	at java.lang.reflect.Method.invoke(Method.java:317)
	at junit.framework.TestCase.runTest(TestCase.java:164)
	at junit.framework.TestCase.runBare(TestCase.java)
	at junit.framework.TestResult$1.protect(TestResult.java)
	at junit.framework.TestResult.runProtected(TestResult.java)
	at junit.framework.TestResult.run(TestResult.java:109)
	at junit.framework.TestCase.run(TestCase.java:120)
	at junit.framework.TestSuite.runTest(TestSuite.java:230)
	at junit.framework.TestSuite.run(TestSuite.java)
	at org.apache.tools.ant.taskdefs.optional.junit.JUnitTestRunner.run(JUnitTestRunner.java)
	at org.apache.tools.ant.taskdefs.optional.junit.JUnitTestRunner.launch(JUnitTestRunner.java:672)
	at org.apache.tools.ant.taskdefs.optional.junit.JUnitTestRunner.main(JUnitTestRunner.java:546)
Test: testGetAnnotations5Class: java.lang.reflect.Method5Testjava.lang.NullPointerException
	at java.lang.reflect.Proxy.newProxyInstance(Proxy.java:200)
	at org.apache.harmony.lang.annotation.AnnotationFactory.createAnnotation(AnnotationFactory.java:101)
	at org.apache.harmony.vm.VMGenericsAndAnnotations.getDeclaredAnnotations(VMGenericsAndAnnotations.java)
	at java.lang.reflect.Method$MethodData.getDeclaredAnnotations(Method.java:426)
	at java.lang.reflect.Method.getDeclaredAnnotations(Method.java:71)
	at java.lang.reflect.AccessibleObject.getAnnotations(AccessibleObject.java)
	at org.apache.harmony.lang.AnnotatedElementTestFrame.testGetAnnotations5(AnnotatedElementTestFrame.java)
	at java.lang.reflect.VMReflection.invokeMethod(VMReflection.java)
	at java.lang.reflect.Method.invoke(Method.java:317)
	at junit.framework.TestCase.runTest(TestCase.java:164)
	at junit.framework.TestCase.runBare(TestCase.java)
	at junit.framework.TestResult$1.protect(TestResult.java)
	at junit.framework.TestResult.runProtected(TestResult.java)
	at junit.framework.TestResult.run(TestResult.java:109)
	at junit.framework.TestCase.run(TestCase.java:120)
	at junit.framework.TestSuite.runTest(TestSuite.java:230)
	at junit.framework.TestSuite.run(TestSuite.java)
	at org.apache.tools.ant.taskdefs.optional.junit.JUnitTestRunner.run(JUnitTestRunner.java)
	at org.apache.tools.ant.taskdefs.optional.junit.JUnitTestRunner.launch(JUnitTestRunner.java:672)
	at org.apache.tools.ant.taskdefs.optional.junit.JUnitTestRunner.main(JUnitTestRunner.java:546)
Test: testGetAnnotationsImmutableClass: java.lang.reflect.Method5Testjava.lang.NullPointerException
	at java.lang.reflect.Proxy.newProxyInstance(Proxy.java:200)
	at org.apache.harmony.lang.annotation.AnnotationFactory.createAnnotation(AnnotationFactory.java:101)
	at org.apache.harmony.vm.VMGenericsAndAnnotations.getDeclaredAnnotations(VMGenericsAndAnnotations.java)
	at java.lang.reflect.Method$MethodData.getDeclaredAnnotations(Method.java:426)
	at java.lang.reflect.Method.getDeclaredAnnotations(Method.java:71)
	at java.lang.reflect.AccessibleObject.getAnnotations(AccessibleObject.java)
	at org.apache.harmony.lang.AnnotatedElementTestFrame.testGetAnnotationsImmutable(AnnotatedElementTestFrame.java)
	at java.lang.reflect.VMReflection.invokeMethod(VMReflection.java)
	at java.lang.reflect.Method.invoke(Method.java:317)
	at junit.framework.TestCase.runTest(TestCase.java:164)
	at junit.framework.TestCase.runBare(TestCase.java)
	at junit.framework.TestResult$1.protect(TestResult.java)
	at junit.framework.TestResult.runProtected(TestResult.java)
	at junit.framework.TestResult.run(TestResult.java:109)
	at junit.framework.TestCase.run(TestCase.java:120)
	at junit.framework.TestSuite.runTest(TestSuite.java:230)
	at junit.framework.TestSuite.run(TestSuite.java)
	at org.apache.tools.ant.taskdefs.optional.junit.JUnitTestRunner.run(JUnitTestRunner.java)
	at org.apache.tools.ant.taskdefs.optional.junit.JUnitTestRunner.launch(JUnitTestRunner.java:672)
	at org.apache.tools.ant.taskdefs.optional.junit.JUnitTestRunner.main(JUnitTestRunner.java:546)
Test: testIsAnnotationPresentClass: java.lang.reflect.Method5Testjava.lang.NullPointerException
	at java.lang.reflect.Proxy.newProxyInstance(Proxy.java:200)
	at org.apache.harmony.lang.annotation.AnnotationFactory.createAnnotation(AnnotationFactory.java:101)
	at org.apache.harmony.vm.VMGenericsAndAnnotations.getDeclaredAnnotations(VMGenericsAndAnnotations.java)
	at java.lang.reflect.Method$MethodData.getDeclaredAnnotations(Method.java:426)
	at java.lang.reflect.Method.getAnnotation(Method.java:85)
	at java.lang.reflect.AccessibleObject.isAnnotationPresent(AccessibleObject.java)
	at org.apache.harmony.lang.AnnotatedElementTestFrame.testIsAnnotationPresent(AnnotatedElementTestFrame.java)
	at java.lang.reflect.VMReflection.invokeMethod(VMReflection.java)
	at java.lang.reflect.Method.invoke(Method.java:317)
	at junit.framework.TestCase.runTest(TestCase.java:164)
	at junit.framework.TestCase.runBare(TestCase.java)
	at junit.framework.TestResult$1.protect(TestResult.java)
	at junit.framework.TestResult.runProtected(TestResult.java)
	at junit.framework.TestResult.run(TestResult.java:109)
	at junit.framework.TestCase.run(TestCase.java:120)
	at junit.framework.TestSuite.runTest(TestSuite.java:230)
	at junit.framework.TestSuite.run(TestSuite.java)
	at org.apache.tools.ant.taskdefs.optional.junit.JUnitTestRunner.run(JUnitTestRunner.java)
	at org.apache.tools.ant.taskdefs.optional.junit.JUnitTestRunner.launch(JUnitTestRunner.java:672)
	at org.apache.tools.ant.taskdefs.optional.junit.JUnitTestRunner.main(JUnitTestRunner.java:546)
Test: testIsAnnotationPresent_NegativeClass: java.lang.reflect.Method5Testjava.lang.NullPointerException
	at java.lang.reflect.Proxy.newProxyInstance(Proxy.java:200)
	at org.apache.harmony.lang.annotation.AnnotationFactory.createAnnotation(AnnotationFactory.java:101)
	at org.apache.harmony.vm.VMGenericsAndAnnotations.getDeclaredAnnotations(VMGenericsAndAnnotations.java)
	at java.lang.reflect.Method$MethodData.getDeclaredAnnotations(Method.java:426)
	at java.lang.reflect.Method.getAnnotation(Method.java:85)
	at java.lang.reflect.AccessibleObject.isAnnotationPresent(AccessibleObject.java)
	at org.apache.harmony.lang.AnnotatedElementTestFrame.testIsAnnotationPresent_Negative(AnnotatedElementTestFrame.java)
	at java.lang.reflect.VMReflection.invokeMethod(VMReflection.java)
	at java.lang.reflect.Method.invoke(Method.java:317)
	at junit.framework.TestCase.runTest(TestCase.java:164)
	at junit.framework.TestCase.runBare(TestCase.java)
	at junit.framework.TestResult$1.protect(TestResult.java)
	at junit.framework.TestResult.runProtected(TestResult.java)
	at junit.framework.TestResult.run(TestResult.java:109)
	at junit.framework.TestCase.run(TestCase.java:120)
	at junit.framework.TestSuite.runTest(TestSuite.java:230)
	at junit.framework.TestSuite.run(TestSuite.java)
	at org.apache.tools.ant.taskdefs.optional.junit.JUnitTestRunner.run(JUnitTestRunner.java)
	at org.apache.tools.ant.taskdefs.optional.junit.JUnitTestRunner.launch(JUnitTestRunner.java:672)
	at org.apache.tools.ant.taskdefs.optional.junit.JUnitTestRunner.main(JUnitTestRunner.java:546)
Test: testGetAnnotation_ByDefaultClass: org.apache.harmony.lang.annotation.AllTypesTestjava.lang.NullPointerException
	at java.lang.reflect.Proxy.newProxyInstance(Proxy.java:200)
	at org.apache.harmony.lang.annotation.AnnotationFactory.createAnnotation(AnnotationFactory.java:101)
	at org.apache.harmony.vm.VMGenericsAndAnnotations.getDeclaredAnnotations(VMGenericsAndAnnotations.java)
	at java.lang.Class$GACache.getAllAnnotations(Class.java:1338)
	at java.lang.Class.getAnnotation(Class.java:890)
	at org.apache.harmony.lang.annotation.AllTypesTest.testGetAnnotation_ByDefault(AllTypesTest.java:51)
	at java.lang.reflect.VMReflection.invokeMethod(VMReflection.java)
	at java.lang.reflect.Method.invoke(Method.java:317)
	at junit.framework.TestCase.runTest(TestCase.java:164)
	at junit.framework.TestCase.runBare(TestCase.java)
	at junit.framework.TestResult$1.protect(TestResult.java)
	at junit.framework.TestResult.runProtected(TestResult.java)
	at junit.framework.TestResult.run(TestResult.java:109)
	at junit.framework.TestCase.run(TestCase.java:120)
	at junit.framework.TestSuite.runTest(TestSuite.java:230)
	at junit.framework.TestSuite.run(TestSuite.java)
	at org.apache.tools.ant.taskdefs.optional.junit.JUnitTestRunner.run(JUnitTestRunner.java)
	at org.apache.tools.ant.taskdefs.optional.junit.JUnitTestRunner.launch(JUnitTestRunner.java:672)
	at org.apache.tools.ant.taskdefs.optional.junit.JUnitTestRunner.main(JUnitTestRunner.java:546)
Test: testGetAnnotation_NoDefaultClass: org.apache.harmony.lang.annotation.AllTypesTestjava.lang.NullPointerException
	at java.lang.reflect.Proxy.newProxyInstance(Proxy.java:200)
	at org.apache.harmony.lang.annotation.AnnotationFactory.createAnnotation(AnnotationFactory.java:101)
	at org.apache.harmony.vm.VMGenericsAndAnnotations.getDeclaredAnnotations(VMGenericsAndAnnotations.java)
	at java.lang.Class$GACache.getAllAnnotations(Class.java:1338)
	at java.lang.Class.getAnnotation(Class.java:890)
	at org.apache.harmony.lang.annotation.AllTypesTest.testGetAnnotation_NoDefault(AllTypesTest.java:87)
	at java.lang.reflect.VMReflection.invokeMethod(VMReflection.java)
	at java.lang.reflect.Method.invoke(Method.java:317)
	at junit.framework.TestCase.runTest(TestCase.java:164)
	at junit.framework.TestCase.runBare(TestCase.java)
	at junit.framework.TestResult$1.protect(TestResult.java)
	at junit.framework.TestResult.runProtected(TestResult.java)
	at junit.framework.TestResult.run(TestResult.java:109)
	at junit.framework.TestCase.run(TestCase.java:120)
	at junit.framework.TestSuite.runTest(TestSuite.java:230)
	at junit.framework.TestSuite.run(TestSuite.java)
	at org.apache.tools.ant.taskdefs.optional.junit.JUnitTestRunner.run(JUnitTestRunner.java)
	at org.apache.tools.ant.taskdefs.optional.junit.JUnitTestRunner.launch(JUnitTestRunner.java:672)
	at org.apache.tools.ant.taskdefs.optional.junit.JUnitTestRunner.main(JUnitTestRunner.java:546)
Test: testEqualsClass: org.apache.harmony.lang.annotation.AllTypesTestjava.lang.NullPointerException
	at java.lang.reflect.Proxy.newProxyInstance(Proxy.java:200)
	at org.apache.harmony.lang.annotation.AnnotationFactory.createAnnotation(AnnotationFactory.java:101)
	at org.apache.harmony.vm.VMGenericsAndAnnotations.getDeclaredAnnotations(VMGenericsAndAnnotations.java)
	at java.lang.Class$GACache.getAllAnnotations(Class.java:1338)
	at java.lang.Class.getAnnotation(Class.java:890)
	at org.apache.harmony.lang.annotation.AllTypesTest.testEquals(AllTypesTest.java:114)
	at java.lang.reflect.VMReflection.invokeMethod(VMReflection.java)
	at java.lang.reflect.Method.invoke(Method.java:317)
	at junit.framework.TestCase.runTest(TestCase.java:164)
	at junit.framework.TestCase.runBare(TestCase.java)
	at junit.framework.TestResult$1.protect(TestResult.java)
	at junit.framework.TestResult.runProtected(TestResult.java)
	at junit.framework.TestResult.run(TestResult.java:109)
	at junit.framework.TestCase.run(TestCase.java:120)
	at junit.framework.TestSuite.runTest(TestSuite.java:230)
	at junit.framework.TestSuite.run(TestSuite.java)
	at org.apache.tools.ant.taskdefs.optional.junit.JUnitTestRunner.run(JUnitTestRunner.java)
	at org.apache.tools.ant.taskdefs.optional.junit.JUnitTestRunner.launch(JUnitTestRunner.java:672)
	at org.apache.tools.ant.taskdefs.optional.junit.JUnitTestRunner.main(JUnitTestRunner.java:546)
Test: testEquals_ForeignImplClass: org.apache.harmony.lang.annotation.AllTypesTestjava.lang.NullPointerException
	at java.lang.reflect.Proxy.newProxyInstance(Proxy.java:200)
	at org.apache.harmony.lang.annotation.AnnotationFactory.createAnnotation(AnnotationFactory.java:101)
	at org.apache.harmony.vm.VMGenericsAndAnnotations.getDeclaredAnnotations(VMGenericsAndAnnotations.java)
	at java.lang.Class$GACache.getAllAnnotations(Class.java:1338)
	at java.lang.Class.getAnnotation(Class.java:890)
	at org.apache.harmony.lang.annotation.AllTypesTest.testEquals_ForeignImpl(AllTypesTest.java:131)
	at java.lang.reflect.VMReflection.invokeMethod(VMReflection.java)
	at java.lang.reflect.Method.invoke(Method.java:317)
	at junit.framework.TestCase.runTest(TestCase.java:164)
	at junit.framework.TestCase.runBare(TestCase.java)
	at junit.framework.TestResult$1.protect(TestResult.java)
	at junit.framework.TestResult.runProtected(TestResult.java)
	at junit.framework.TestResult.run(TestResult.java:109)
	at junit.framework.TestCase.run(TestCase.java:120)
	at junit.framework.TestSuite.runTest(TestSuite.java:230)
	at junit.framework.TestSuite.run(TestSuite.java)
	at org.apache.tools.ant.taskdefs.optional.junit.JUnitTestRunner.run(JUnitTestRunner.java)
	at org.apache.tools.ant.taskdefs.optional.junit.JUnitTestRunner.launch(JUnitTestRunner.java:672)
	at org.apache.tools.ant.taskdefs.optional.junit.JUnitTestRunner.main(JUnitTestRunner.java:546)
Test: testToStringClass: org.apache.harmony.lang.annotation.AllTypesTestjava.lang.NullPointerException
	at java.lang.reflect.Proxy.newProxyInstance(Proxy.java:200)
	at org.apache.harmony.lang.annotation.AnnotationFactory.createAnnotation(AnnotationFactory.java:101)
	at org.apache.harmony.vm.VMGenericsAndAnnotations.getDeclaredAnnotations(VMGenericsAndAnnotations.java)
	at java.lang.Class$GACache.getAllAnnotations(Class.java:1338)
	at java.lang.Class.getAnnotation(Class.java:890)
	at org.apache.harmony.lang.annotation.AllTypesTest.testToString(AllTypesTest.java:140)
	at java.lang.reflect.VMReflection.invokeMethod(VMReflection.java)
	at java.lang.reflect.Method.invoke(Method.java:317)
	at junit.framework.TestCase.runTest(TestCase.java:164)
	at junit.framework.TestCase.runBare(TestCase.java)
	at junit.framework.TestResult$1.protect(TestResult.java)
	at junit.framework.TestResult.runProtected(TestResult.java)
	at junit.framework.TestResult.run(TestResult.java:109)
	at junit.framework.TestCase.run(TestCase.java:120)
	at junit.framework.TestSuite.runTest(TestSuite.java:230)
	at junit.framework.TestSuite.run(TestSuite.java)
	at org.apache.tools.ant.taskdefs.optional.junit.JUnitTestRunner.run(JUnitTestRunner.java)
	at org.apache.tools.ant.taskdefs.optional.junit.JUnitTestRunner.launch(JUnitTestRunner.java:672)
	at org.apache.tools.ant.taskdefs.optional.junit.JUnitTestRunner.main(JUnitTestRunner.java:546)
Test: testAnnotationTypeClass: org.apache.harmony.lang.annotation.AllTypesTestjava.lang.NullPointerException
	at java.lang.reflect.Proxy.newProxyInstance(Proxy.java:200)
	at org.apache.harmony.lang.annotation.AnnotationFactory.createAnnotation(AnnotationFactory.java:101)
	at org.apache.harmony.vm.VMGenericsAndAnnotations.getDeclaredAnnotations(VMGenericsAndAnnotations.java)
	at java.lang.Class$GACache.getAllAnnotations(Class.java:1338)
	at java.lang.Class.getAnnotation(Class.java:890)
	at org.apache.harmony.lang.annotation.AllTypesTest.testAnnotationType(AllTypesTest.java:152)
	at java.lang.reflect.VMReflection.invokeMethod(VMReflection.java)
	at java.lang.reflect.Method.invoke(Method.java:317)
	at junit.framework.TestCase.runTest(TestCase.java:164)
	at junit.framework.TestCase.runBare(TestCase.java)
	at junit.framework.TestResult$1.protect(TestResult.java)
	at junit.framework.TestResult.runProtected(TestResult.java)
	at junit.framework.TestResult.run(TestResult.java:109)
	at junit.framework.TestCase.run(TestCase.java:120)
	at junit.framework.TestSuite.runTest(TestSuite.java:230)
	at junit.framework.TestSuite.run(TestSuite.java)
	at org.apache.tools.ant.taskdefs.optional.junit.JUnitTestRunner.run(JUnitTestRunner.java)
	at org.apache.tools.ant.taskdefs.optional.junit.JUnitTestRunner.launch(JUnitTestRunner.java:672)
	at org.apache.tools.ant.taskdefs.optional.junit.JUnitTestRunner.main(JUnitTestRunner.java:546)
Test: testAnnotation_ElementErrorClass: org.apache.harmony.lang.annotation.AllTypesTestjava.lang.NullPointerException
	at java.lang.reflect.Proxy.newProxyInstance(Proxy.java:200)
	at org.apache.harmony.lang.annotation.AnnotationFactory.createAnnotation(AnnotationFactory.java:101)
	at org.apache.harmony.vm.VMGenericsAndAnnotations.getDeclaredAnnotations(VMGenericsAndAnnotations.java)
	at java.lang.reflect.Method$MethodData.getDeclaredAnnotations(Method.java:426)
	at java.lang.reflect.Method.getAnnotation(Method.java:85)
	at org.apache.harmony.lang.annotation.AllTypesTest.testAnnotation_ElementError(AllTypesTest.java:162)
	at java.lang.reflect.VMReflection.invokeMethod(VMReflection.java)
	at java.lang.reflect.Method.invoke(Method.java:317)
	at junit.framework.TestCase.runTest(TestCase.java:164)
	at junit.framework.TestCase.runBare(TestCase.java)
	at junit.framework.TestResult$1.protect(TestResult.java)
	at junit.framework.TestResult.runProtected(TestResult.java)
	at junit.framework.TestResult.run(TestResult.java:109)
	at junit.framework.TestCase.run(TestCase.java:120)
	at junit.framework.TestSuite.runTest(TestSuite.java:230)
	at junit.framework.TestSuite.run(TestSuite.java)
	at org.apache.tools.ant.taskdefs.optional.junit.JUnitTestRunner.run(JUnitTestRunner.java)
	at org.apache.tools.ant.taskdefs.optional.junit.JUnitTestRunner.launch(JUnitTestRunner.java:672)
	at org.apache.tools.ant.taskdefs.optional.junit.JUnitTestRunner.main(JUnitTestRunner.java:546)
Test: testSerializationClass: org.apache.harmony.lang.annotation.AllTypesTestjava.lang.NullPointerException
	at java.lang.reflect.Proxy.newProxyInstance(Proxy.java:200)
	at org.apache.harmony.lang.annotation.AnnotationFactory.createAnnotation(AnnotationFactory.java:101)
	at org.apache.harmony.vm.VMGenericsAndAnnotations.getDeclaredAnnotations(VMGenericsAndAnnotations.java)
	at java.lang.Class$GACache.getAllAnnotations(Class.java:1338)
	at java.lang.Class.getAnnotation(Class.java:890)
	at org.apache.harmony.lang.annotation.AllTypesTest.testSerialization(AllTypesTest.java:189)
	at java.lang.reflect.VMReflection.invokeMethod(VMReflection.java)
	at java.lang.reflect.Method.invoke(Method.java:317)
	at junit.framework.TestCase.runTest(TestCase.java:164)
	at junit.framework.TestCase.runBare(TestCase.java)
	at junit.framework.TestResult$1.protect(TestResult.java)
	at junit.framework.TestResult.runProtected(TestResult.java)
	at junit.framework.TestResult.run(TestResult.java:109)
	at junit.framework.TestCase.run(TestCase.java:120)
	at junit.framework.TestSuite.runTest(TestSuite.java:230)
	at junit.framework.TestSuite.run(TestSuite.java)
	at org.apache.tools.ant.taskdefs.optional.junit.JUnitTestRunner.run(JUnitTestRunner.java)
	at org.apache.tools.ant.taskdefs.optional.junit.JUnitTestRunner.launch(JUnitTestRunner.java:672)
	at org.apache.tools.ant.taskdefs.optional.junit.JUnitTestRunner.main(JUnitTestRunner.java:546)

***********************************************************
Modifications since last successful build:	(2)
            
add cc-hdk log20071030014215Lbuild.304 10/30/2007 01:42:15hdk
add cc-hdk log20071030014215Lbuild.304 10/30/2007 01:42:15hdk

begin 644 execution_log.zip
M4$L#! H    (  (F7C?.G>P33AL  (:I 0 2    97AE8W5T:6]N7VQO9RYH
M=&UL[5U[<]NVLO\_GP)W>N^<]$Q-B=3;)^V,DSBM?>W:-W)SYDXGHZ%)R*+-
MARX?CMU/?Q>D9.M!@KNV8,D-/!U5C+#8Q6*Q6  _+-]-TL#_Y=UEY-[_\FX:
M\U_>V2Q)[WW^\S_&49CN)=Y??)_UF__UKW_\\B:;NG;*]Y+;</_-F[WB";[%
M&3PSQOYTN<]3_I5]%/_WPBO6'738V/-YPL9Q%+ &OYM&<=K($AXG#<>!__:<
M* BBL'&9>;[;B'F2^6G2<&/_-MA+>9**>J'F:_O6_LK>BT*BOGT6V#>\(#+N
M G^IU-(#R+KG@E!.NB\O-(VCJ:0(OTMY'(Y<OE*H^,Z=203?_TA$HS^<' R'
M)T?OV<_U#78FW+F),FCRQ+UI?(OB&ZAAY/AVDOC>9;4X19.,*#'LV)D8SMV=
MX8RO)/)[H9<:6>C=U97YYH5U1: %8"E)PETCB%PN4RQ/C80'7F*X7IS4%"Q4
M;/NR<E,_N_)"PPY3!ZPS]B[KRSK3:6HG-[):1:NJN_5#%(Z]JRRV4R\*);TO
M_GZ+DMSPC^%GZ'_3Z!C-47/ W@ZSD)UZ3APE]TG*@X0=A8[QH[2RN16P.(K2
M#1O3FN"/?U$"O$Z\,+O#40@#! H>=-LID@>8*U!<.0ZV_/@*RKO\,KN24\! 
M9C&_]1+H*:#H] =]RZIC(LPY"GF8)CF3J1_=U\HUN3?"R$@\(=<83)9+*:"T
M'SFV;_PENK.,8NGA^C9(/4-X/XG-"JG!$^[EA7-7F>R)7]8-],_@!D8?V'',
MP5^[#![VGVI,M\'L9S^\&^5=/H)N'.5=T\B%:#Q*#_4*V^/)LDA_@CK$5T<,
M+=$(,6#:+(FRV.&SZ2*-MBAAK9Y#< 6W?*<T78A4:84__+"@Z^,OIQ='K*!(
MV#Y[#^+>3",O3,W=:U)#)IUX<L".+#"8U/8?C>>2SSO.-2JIAJD=Y]X:M')3
M-QQY<"GF.SOTQFL#$ZWI\VCZ*;8#OHMZKI;MM6EY"/_H\V'*I[NH9YETKTW3
M7TZ/('3:12U723;7E;E=#2\'JO'B]+)3TTK,!1/)](B*56"!N#A_[F(+&S"_
M5(Z!VG#PY]J_VBH^PP*A&%ZY7"S+UY(@%8_!/N#S)82H+ #2A4(>::AP#>O+
M%%;_A^__^'6?_<K3]-%G\/#6BZ, HFS#,-;YK-"Z$(__1UVAX8R!8T_M2_!/
MJ<>3C5?.;\7"8&/5GO)T$KF'L'2]![E]_])V;IB7Y-_![L=1O*AB8_&[,(NW
MZRO&%08?O<2^S'WU(JN\%=A&8#L6N' 69N#E8I8"4PX,-E'_7/67#XU'Z7^=
MC,$B,!>RTU0FVB./CMKF8T@_<C C6&A6=L]&^O_]0N,=)YMZ8+A>R,99Z(@=
MDF<:L&KK^B FC77]4AK]8%6UO'QNQX)7.A$+VSA)%[ANJ#VZSU^TSSMX![Q 
MOE'_.W<02>8X/$E@WF=IG&VLJQ49U&HD(5D*;RZ.>&J(0)_]+\#084RD$^AT
M5\SHB5@J<+<V(LA#7L'KX IX7>3T"-N<:T44,'P[O#(*4O8<VGQ//7/2*";4
M$D(G0FN%GT-0/337%LV=Z8M"=^5'E[!NB_F8QSP4&X80,PDW@Z]K+OF#"1H/
MW_[3I"BPM (CG7BQ.P)SF+[]D05Y%$:H\RD^<#EDP,TM8KU![(.\^/-,KZ8*
MX][CODM1VZS"!P^_8 G@(),I#UTQ%%.,&O-5;.U45]+I2UV.X_(0&I "@H)V
MWMV/.TD/$PRR@D(Q*_K":_MB0<G"U175(9S=C'Y/_#'S097Y\J?X5V0-(.ML
M^L/R_,R3##@MM'>KIK6X^$.M'#=5PX+1E)GW/DLX3 -S8_[R4W$,N<].'JR]
ML>#L_O6:#,[2!O<<<U%E<'$6_LT,K?4,0WN@++ P0HH\\AT=?OY\]GGT^]GH
M].SSX>C3YX/3PR'>%H/H]HE3QGRVR?4Y&P-XA3YY%#QVPK;<8WT-JVL:Z<&3
MWAW=Q.[H@HJ-Q>\[LSMZ&"I>_K^^[==V2_WV:[NGMU^+]<GS1LCKV8IKM]!#
ML636V^6MLE6++)^2"J>X,_VY(&6ADBC$!!?K5*)M^#[67:"Z"]KX2?5UCS/M
M6.=3J3[CV,P91QD(:>G!$74BD+Y!%(YN UD94='>#,"T=7S-8[.21G1YO4OB
M7'IA9;<]XMP*"(X=PII#K,4%K[*Q))YRN%Z+AB:;\3OQPIO9LE-\CD2)D9VF
M<5+)J;EAV%JM.)=VXI7 ]+<ECN>"D_'&)0#]K4DD$%IQ-BU!CVU+)!@R7AKM
MDA5-[;B$8FO2I/'(B<+;W9%HML^X$P(5 -H=&O@S@<9V.K?L71)K![LNG7CA
M3JDJ]<!-)A# !;LB3GX=:Y2 @NRKDCAN.T+-N@QT-8YV1:8IQ/?@++,R=/1V
M)(KM;[LUPX%,^:G<K@B3>@&0O9@T)>N0^87P70GZRVXQ+"IQOE[+2Y<&^LL%
M$?'Z'%A_?C <'GYD>(H2%A53L82%G**$175<+>%22U3&J#I<EG&JI2IA5>TD
M))QJB4H8E4>W$B92@C(&E0&KC$D=40FCRF!&PJ>.9IF-/+HL9X.B*64CC1FE
MS#"4I2R)*D12E;*2QWE2?BC29::R(*Z<%X)BC45-8%;)"$>WQDX><E5R0Y&M
M,9/%4I6L$$1KC.0A4B4K%-D:LXK8IY*+O/Q:]5713&7])01E(4H>$BQ'*<46
M;_'+5W81VV$RCN* 08U\GYF6U0NJ]7+N<SL1MSQ"=V'[<);0AMGIRX0ZS]QJ
M3H+HAM?N1T-+93EB9L&D\5B9L2,)$QXEFM\37N_/[8O42"99ZD;?,!O5VQ&L
M(6!R'VT.;,["?]M>]=I0Z37K0D3L1?:=4-HG&[1Q&,>2C1FMLF65'=5NL&]9
M8S7.;Z>\'CXA3[_Y@AEYZD1<>LA7'?ELGY/ME'[K=AJJXYC9WP8N\8M! ZT^
M_G*JIM5%BJS&-92_CKDX46T(85ZB:6BC&'WSTLGHVDM'>93^D$2AVM>]A/A#
M(=HL.HQ"]L'WQ/TKD4./'1]=L+<N']L0+LK3PJE0)5H1189#?N?XF5MXAJ<G
MIGLPLCR7XZS.9/[%R'- %KUI^"(=G7'7[XZZ;0-ZE=6DX:MK8P$N;PP#V_=A
M'G!NBNMG8N084EN&1D3C  *?^+[Q3WG1') C+W+.XS&B6.4//[#?#CZ?GOW^
MOWNM5JM?6>S*:9R<#>4\H,PIF)Y7*"*1%YZ"W$O%AUXPA4GOJ:T8VYZ?CX@_
M+F&=FW59T=-28>WX^5JS>CUKQCSW$8&7IC B_?MJXB05F2\;I][=L[FWK>[Z
M;?)Y,1@%?"I@9XU/7FC[WE^\L--:"\482]-L+DFQ\#"H3I<X:WHNQ_-E: \Z
M;&*'5ZNJEW7Z[^>'SV<\,-?Q;0L\SD&H- H^S^\7UVL<B/[-[1L"!4;,;FM0
MY[Y.[?!^-@ WP],:#)9ZH]84[D/GB5S+_E#G,VR?_>8AMH,DA5:J>QA8B%KK
MRZY47F1?C6R7Q\8'\5T0_\K3CQQ^$1> \W]$<'YF11*Q#N>NYB@4<$4O]S8Q
M4B'/K$@BUDET=9)_(TI13R=A^GN4?HHRU/8]B4S"<IB/I2<U%46ZPOIA8GGL
M+LH >!)YI0C@T$D\9>57F%PY!LR<!P+FBV"!*5W*H+!Q-(>:XB4L(EB"(ZN7
M%BVI.K:O IF77ZZ]KG09 XX5759RO>(3#V6K=277*UZ=_/\GXQE'CHPGD:^+
M ,3Y;5VDYNJ+E[#(P@=33,["PSLOQ;>12KS.OO!:(#B.87WQ$A80F$SB* 0A
MW4=I\8U\ OVZ$$5H5MQ(%PG)<:S15"L,\\S\^<[RTNQ;0EY\/X;/_':VG^ZS
MDCRI:[+A&53+=Y9.4,X247BU^L@XB&/['ND:4,7768B]Z"N..E3%E%YA<!UZ
MAIC,3[S+V(XQ6!PLQ0HCL7XWBMU1L89XF,DQ[:+38IF+EVNDD^>(4%-#F2!#
M?LMCVY\MH[#,D52E#'-W]B&*0QX/80"A66+I,$Q'DMU:.5L)91ECT%#T3702
MEE\]@90-W90II$C6-$.F5R 5XXG,:2QC/O;%^V=@_5DD4D#PP].L,)N?!AKU
MI\YK3.FT,N:RT]NG3JMX!O7R28Y*2\5KK6<PK1%0QJ%>OI/(P0 E\32KS')G
M9;SWKH9Y/L+WV7B,BC>(A.5L*:M!-$DYJ[P;, $EKGPY$_R<B"0H9_.%.SC\
M(JY\.1.Q0?N;G4P">XI<!1 )5]C.\DZ)U=%P9LV_11$*)4RD+&=\%(Y%#,TI
M-DDFK6(]<Q%(%TTB*V<Y]#F?XEG)BY>S*&R[WOVM,<,2RMB>G9U2&<I(5EAE
MJ><;'W$@SOJRI95'Y[%WRWU8#6$B!3Q-&;/S.,+80GW9LLJ+Z0'M?O$TJ_!1
M-H/!O!R*M [&LO0@/E\;W +$@XZ(C./#BY?@_K2F[P3 @C\;8*%Q$J*PQDEL
M B>Q E?0" 6-4- (A<I:-4)!(I9&*#R%Y?>,4%A#WY$DP%-KB(2&2-14KB$2
M&B)1SE!#)% ,-41"0R2PC#1$0D,DGLA60R0T1$)#)#1$XDGR:8B$ADAHB(2<
MKX9(["1$HNPV-8$CA5IC-"0\-$9#8S3$@_A\K1B-LW.-T9!B-**I3H)1_*#!
M'1L =U26T_DN-H0F>4'D@L:PH,5\,0Q+V1\VJM%H$HTFJ99"HTFDK'<*3:+!
M'+4L-)A#@SDD+#680X,Y-)A#@SDTF$.#.?!,-9A#@SDTF(/,7(,Y-)BCFJT&
M<V@PAP9S_$W!'!I+H;$4&DOQ\" ^7QN68D&NE^#^M*;O I8"%/5<+,4/?QLP
M1>)'WRI_WACF8-"K/A[VHL9\)^FU9Z[H]$WFQ!!.@6/[OPR"#!:-@7\=[\V<
M_>LC^%6>%Q,OF>FXF'3@\9;'][G18UWFK(^*^4VC :25:S2 1@/(67[/: "=
M6T+#$5XE'.%LB*M75O %40Z+(%T< Q3%.B/<>*HIJ%$:&J51P5.C--9D^^Y1
M&AI$\?(@BO5;'U@!")0:O:'1&]4,-7I#HS=JF&OTAD9O5+-]0?1&OD.!9R,O
MKK$;E=PT=D-C-W0B#@T>(3#3X!$-'BG^5L C0Q[#HI$%D<O9\9%.QB$%D"3Q
MK4[&D?^@DW'H9!PU=J&3<>AD'.5BZF0<\EHU_$8BEH;?/(7E]PR_T>B76A8:
M_:*3<4A8:IB'AGEHF(=.QJ%Q)#H9!YZIAG-H.(>&<Y"9:SB'AG-4L]7).#2@
M0P,Z_J: #HVGT'@*C:=X>,@K&Q7%EH_=_[S.P'L4OWQE%[$=)N,H#ECJ!1Q"
M#M/L]8+J*>)B4@ @6%&!N!WNA;O2Z,?"^]6%;J"7N5]7"J2?>C[?*TKOK9?.
MOP8WKA=_9<52UV7PL*]0%PN2"V4D418[?*6K_IS<YP=^#DB5-T$,D!8KRN;0
MCX2ET9:%W++J9B,7H3BSV]F6ZDJ%A&\N>-R4?V4?Q?^%C*"Y/."Z?V')&F&4
MCM?.U)8>XBS<Y0&T[DT6/5WU[#'[VP"<2T2LT.SC+Z=JFNWRJ1_=-ZZA_'7,
M&Y=>V!#"O$33JJUB;\4L]B[MU)GLI'$TKKW4$/B^K5H)Q#FS66N&/<QR/-\'
MW^-A^@ _9&]=/K8A#/GQ181ZFD9>'(DXZ]4E*")TZK-S68E$.3R9@T'M&+Y%
MD3PQE/B7AF^'5PWH4!%M';BN)[83;5_X@1I@HE2494FR,$GM2U"M"$T%F*HF
MHU*-8*8IEZR&O-5^'OG@6>3MYO/(G]?VMO5DQ-=A8<8NN^2.#2,#^O 1!=@9
M5.-&UT2J!X$]D@SO84(*#N_2XFQ3-7ZL6(L\KN2B^,JPIS:,=V-BQ^  [@TA
MEG'%0QY[3E( JPH\3>ENS[S"BWPPP$2SSRSS)_;)]OP,@M%]UOR)Y=NWQ=<+
M4 _COCU-N MK'Z/5[K.$KR-,RJKM8JMM&F:SAZW6[."K':"%[6,KM8R>V<76
MVL*+VNH.L+42%-#M6@ID[371LJ)-JVF@)34'!+6:+;0"VH1AT$-;%D$#3;.C
MI-8VME:"8IL66K%J9+64Z)54*]H&T)9%DA7MLT1OF=A:"5Y;E0;0M9)D1<\P
M:FKM*:F5X+4)8XND ;2]DF1%SP9JQA9)5K0G)/G7[9HKR6FCG0M% 28ZR"!I
M !V\J1D$I%K53(9H<R75JL2YM-&R4FIMJ0G>U$RQ: V0)AAT;YE-)8.+Y C0
MPE*\=E-)[(*O54UW4615$\&W\&L8= !K&I:%-BV+8K$JI(6E; ?O8="ZM0QQ
MX73S/6;V\'9 ,00+'<&@-S1,PVRA(Y@V84^GU52QIV.VT/TUP._!M8Q.#UTO
M*8[%&RUE!E.A64)PB-_=A&KQXY8R@2D)C? K>HO@N<PV?JN$TE]M_#XD(>HT
M\29+BF7Q6Y&4T !OLFH& F6_B+"_29EJ.DI6M2WT!$900;>C9D6C9 5>X@Q>
M+Z* [RZBX-H32,C(.#Z\T!B"&@P!UQ@"@F :0Z Q!-\)AL"TT'/@+F (!IN/
M+GJP-,2?2Q,TVT5'[V@-6(:%KY4@ZZ"CXK"[0]C4HL (\"MY/(S ,EKX11PI
M&L3O[BJIE;(V;BE9:^&M@++6PFN 5"M^1XM2*WK;A;(LQ/<6:2L#/;@H&E!S
M=*3DD$?)&<_F)QB2L9(, +W;0)(5/01( TN-K.C)4(US56*M)(^M1@%*G #>
M7ZD9!*1:\;&VDJ%%JE6)!O![^J13#37[>&J."M"]19E?\+U%PA"H 5,I.3 C
MG$4J\82D:  =N*B),DFG<$H0!'@L$0E!0' $% 1!'W_43T 0M-HJEH9F#Z\#
M$I1D\U<B3,/LX%<;!/,:X(<"!4'0P2.J\#MPEM'OH=T!Z907[PXH\U=?"1R:
M<-)-,=J^DD 6[V74'$92#H\MO'&1, 0#O,U2, 1*-G740$Q;2L)N_)Q 0I+T
M\#M[E+FFKP3 C5\D$%2@9,RJN7E6<JWSU0((HNGN PC.SC6 H 9  -VH 01X
MP32 0 ,(O@\ @6GT\+!]"H) O%KIN0@":VW1W34&=8OYP^%%WKN%&G/M'81A
ME-IY+F7!EGTZ.#HY_+C1 ,7L&2T%=VM@B8W'IQ-@"'T%FW@]Z!L5.R(MO ;P
M,(26T<-#7"@PA$%/3=Z!+<.H*>MKP@X610/;1:>3%H%*+ERK02&HV0SI*-G-
MQP\MDJQJL.E*+B_B]:KF0@E) TK.B? WX2B6U5&RA8L_TZ*XU[X2V S^1$?-
MM$6:8)1L6[64^ $U)^9X+,;V,7GX+5'*\@*_*4RHM85/<D9"(FP7/4>:8/"Q
M=E-)2$@ZR%%S=?<5(1$Z:#] 0GNJF LLPAD&X:RXC;_'7PE%,-<V&L1]<\HV
MP[GMW-A7O$/<7J T%#_MXX^ 6H:)WP@@W$KI]M6<5^&G: *(H47 MA)NI715
M8(8M?%!-P#!TC";^7CW%E>+!!A0,0PL_Y"GP$#Q4BH)AZ!+R5A!4@%^PD&Y]
MX5, 5(T$L9F[%JS5G3,O.]/YJ^$^I%%,]:B5((@R'V_5;0&6R_7)X[Y+%0P/
MHS -$S]N2#@*-3!;%:+B$7LD0[3J[HB5=WCQ@D+RY$ZY:H=W/H3Q;.''<Y46
M^V7[\8C17'6L93\<Q1@'OG]Q/^74(QF*/\//P214&L8X2QKT:D$@7KB[(!!/
MO$AK&G/XU" 0.0@$5*5!('C!- CDY4$@C_7F!_>_SD 0%#S'&F%-/VA RDX!
M4HPV?F.3@D?IX;&N^(P6;:.O( VVU3$Z>/0_7MB!,2"DIT3W6).2@ ./T#"-
M?E_!^R; KW:4G'6UE;QPHHW?F"%L'[05[/H)656<2K4)^S*4WE*P<=[&)Y@F
M0#3:2J[R*L&HM)5DA&_C,Y"0:D5K@' BT\:?H1+V)O'62E$ /MTE150\IHQD
M6-M5*\6W*L$1$.R*Y+%57+ C1'"D$W\56V1*H$]M_!$R9<I2L=/:QJ-@"0K 
MORF-5*F:(:#$ E1D(2+,6!1P!B$8)(68*J"*BL(V-9& "AP)(<0DK5WP0XL 
M6>C@;QE3TD1T"%=+T-)V#;.+WR$@("PHV2<(SA!_ $PYAVKC!Q@!8=$C)$PA
M=%B7<(-#R5@@0"S:%*0-0=H!'E>&AUB8%!P@15A"VG["CB$A-1MA AO@,R\0
M H,!(>T >BBTC2[^CA0^380).E#PJ@F!;U!QF:>OY-Y1'P]EH\A*J!5M!BVC
MHP)W9QH6?MQ2A@)^E41004]!5DWQCF(58=>@!,3^:D$"27R[LR"!(8]O><R$
M>.SX2&>+J $*0%=JH !>, T4T-DBOH_#>5AW$NYA4_;+")=#T O/5L_ [Q3@
M7W H4@>H>.%$<[#YESQ:1E_!.P/[1DO)J[=:A&-I0J:'+CYX(^ (P&;5O/I8
MQ781X5(;Z0*>FEP7*@[\"1K8@50/FW=;RJXBX],GD"[D;SDIP]\VU8.:=VZH
M2?6 '@6DRZU*;KJI>>6"HN0!:N8M)3,,/F?S]E,]X.]7*7E#B)KW)%%JQ;^%
MC'+;4PF8H*7F:I"B=TZ@>XOT%@,E: +";$AZ[;>2-S#AX8IJTB>0NDO-B[U4
MO#3/(KS6B)+J@1#"$RS6Q$.L\=):I+<G$N $S<'F45"FT>FK>4<YOL<(< (+
M[[LI"1LZ2N $%B$NHL )%+W( 3_94C(V$$!VI/02FT<3@*QXZR),8!9^@)$2
MV.-W8PD[!1W")B\EPP9A$B>$G0,U(;*2)$B$B(,B*SZ))^FM$_C=/<KX4K),
MPLN*5D!'$3A:1<HEX0S77>S20W%.OX@F6#[B+=@7I4"(V Z3<10'3)R0B5.7
M9J<?)!2*=M=JTR@Z38O*HV.VB!2#3F>%8NDA/TJOUE+Q?7Z"]\_J/SD5^^]%
MD$*2VFF6L%HJ%*^: \</OL?#]!$*\=;E8SOSTQ_9^<%P6)*"8YE\_LZ-X\,+
M&H%X24=%DH]E@L6$#B@.J^".$J+*&LY];B<"9Q&ZS.4IC#7NPDA)0"$)RT(7
MZGU9&(V [G GC>)[H[H%:90YD[WQS#/L"91(F94ZT?3^*_L G^+HV"S0)&FD
MKD75$B\T=5_2+OG/[_\X.OE89D0;P<?D7XV[P-]O]WK[;!@%<\C(.#>+:KDN
MHM3V9_X%9N+ "S,@9.VF<,A1Z"[KY1@^V>?<Q, =O2GKJNZ@E7=6@NJMF;DV
M<CQ/[K+>S S@+V\*6A.%1*WPA "%K=<VLIH09S9;S5&SU6X:4,V;-Q<3F'SN
MN),)*,>L2]@W+YVP%'X91[X??9L!F?A4E-G/219^$#,9BQPGBV,8<M\FPC9G
M-<+/Z<1+F.^%8-<2B6W7GL)0611V_F]Y1_:Z^P*%%'/V37P\EF+SL?/F7</^
MY5T#W U\7D;N/?QOD@;^+_\/4$L! A0#"@    @  B9>-\Z=[!-.&P  AJD!
M !(              *2!     &5X96-U=&EO;E]L;V<N:'1M;%!+!08     
. 0 ! $    !^&P     ! 
end

Mime
View raw message