harmony-alerts mailing list archives

Site index · List index
Message view « Date » · « Thread »
Top « Date » · « Thread »
From nom...@intel.com
Subject [build-test alert] FAILED Linux x86: jdktools-test debug
Date Sun, 28 Oct 2007 16:10:02 GMT

BUILD FAILED:
	Ant Error Message:
/export/users/cc/cc-common/scripts/cc-exec-adaptor.xml:104: The following error occurred while
executing this line: /export/users/cc/cc-common/adaptors/jdktools-test/adaptor.xml:28: The
following error occurred while executing this line: /export/users/cc/cc-common/build/checkouts/hdk/working_jdktools/build.xml:242:
The following error occurred while executing this line: /export/users/cc/cc-common/build/checkouts/hdk/working_jdktools/make/build-test.xml:97:
There were test errors.

Date of build:	2007-10-28 22:50:18 +0600
Time to build:	19 minutes 35 seconds
Last changed:	10/28/2007 19:54:18
Last log entry:	hdk

***********************************************************
Errors/Warnings:	(226)
            
Result: 1
========================================
Testing jdktools binaries...
========================================
Compiling JPDA tests
Since fork is false, ignoring memoryMaximumSize setting
----------
1. WARNING in /export/users/cc/cc-common/build/checkouts/hdk/working_jdktools/modules/jpda/test/common/unit/org/apache/harmony/jpda/tests/framework/DebuggeeRegister.java
(at line 58)
registered.add(debuggee);
^^^^^^^^^^^^^^^^^^^^^^^^
Type safety: The method add(Object) belongs to the raw type LinkedList. References to generic
type LinkedList<E> should be parameterized
----------
----------
2. WARNING in /export/users/cc/cc-common/build/checkouts/hdk/working_jdktools/modules/jpda/test/common/unit/org/apache/harmony/jpda/tests/framework/TestOptions.java
(at line 505)
internalProperties.put(name, value);
^^^^^^^^^^^^^^^^^^^^^^^^^^^^^^^^^^^
Type safety: The method put(Object, Object) belongs to the raw type HashMap. References to
generic type HashMap<K,V> should be parameterized
----------
----------
3. WARNING in /export/users/cc/cc-common/build/checkouts/hdk/working_jdktools/modules/jpda/test/common/unit/org/apache/harmony/jpda/tests/framework/jdwp/PacketDispatcher.java
(at line 114)
eventQueue.add(eventPacket);
^^^^^^^^^^^^^^^^^^^^^^^^^^^
Type safety: The method add(Object) belongs to the raw type List. References to generic type
List<E> should be parameterized
----------
4. WARNING in /export/users/cc/cc-common/build/checkouts/hdk/working_jdktools/modules/jpda/test/common/unit/org/apache/harmony/jpda/tests/framework/jdwp/PacketDispatcher.java
(at line 249)
replies.put(new Integer(replyPacket.getId()),
replyPacket);
^^^^^^^^^^^^^^^^^^^^^^^^^^^^^^^^^^^^^^^^^^^^^^^^^^^^^^^^^^^^^^^^^^^^^^^^^^^^^^^^^^^^^^^^^^
Type safety: The method put(Object, Object) belongs to the raw type Hashtable. References
to generic type Hashtable<K,V> should be parameterized
----------
5. WARNING in /export/users/cc/cc-common/build/checkouts/hdk/working_jdktools/modules/jpda/test/common/unit/org/apache/harmony/jpda/tests/framework/jdwp/PacketDispatcher.java
(at line 284)
commands.put(Id, command);
^^^^^^^^^^^^^^^^^^^^^^^^^
Type safety: The method put(Object, Object) belongs to the raw type Hashtable. References
to generic type Hashtable<K,V> should be parameterized
----------
6. WARNING in /export/users/cc/cc-common/build/checkouts/hdk/working_jdktools/modules/jpda/test/common/unit/org/apache/harmony/jpda/tests/framework/jdwp/PacketDispatcher.java
(at line 355)
commands.put(Id, command);
^^^^^^^^^^^^^^^^^^^^^^^^^
Type safety: The method put(Object, Object) belongs to the raw type Hashtable. References
to generic type Hashtable<K,V> should be parameterized
----------
----------
7. WARNING in /export/users/cc/cc-common/build/checkouts/hdk/working_jdktools/modules/jpda/test/common/unit/org/apache/harmony/jpda/tests/framework/jdwp/VmMirror.java
(at line 1834)
frames.add(frame);
^^^^^^^^^^^^^^^^^
Type safety: The method add(Object) belongs to the raw type ArrayList. References to generic
type ArrayList<E> should be parameterized
----------
8. WARNING in /export/users/cc/cc-common/build/checkouts/hdk/working_jdktools/modules/jpda/test/common/unit/org/apache/harmony/jpda/tests/framework/jdwp/VmMirror.java
(at line 1902)
vars.add(var);
^^^^^^^^^^^^^
Type safety: The method add(Object) belongs to the raw type ArrayList. References to generic
type ArrayList<E> should be parameterized
----------
9. WARNING in /export/users/cc/cc-common/build/checkouts/hdk/working_jdktools/modules/jpda/test/common/unit/org/apache/harmony/jpda/tests/framework/jdwp/VmMirror.java
(at line 2122)
fields.add(superClassFields.toArray()[i]);
^^^^^^^^^^^^^^^^^^^^^^^^^^^^^^^^^^^^^^^^^
Type safety: The method add(Object) belongs to the raw type ArrayList. References to generic
type ArrayList<E> should be parameterized
----------
10. WARNING in /export/users/cc/cc-common/build/checkouts/hdk/working_jdktools/modules/jpda/test/common/unit/org/apache/harmony/jpda/tests/framework/jdwp/VmMirror.java
(at line 2132)
fields.add(field);
^^^^^^^^^^^^^^^^^
Type safety: The method add(Object) belongs to the raw type ArrayList. References to generic
type ArrayList<E> should be parameterized
----------
----------
11. WARNING in /export/users/cc/cc-common/build/checkouts/hdk/working_jdktools/modules/jpda/test/common/unit/org/apache/harmony/jpda/tests/jdwp/DebuggerOnDemand/OnthowDebuggerLaunchDebuggee.java
(at line 94)
class ExceptionForDebugger extends Exception {
^^^^^^^^^^^^^^^^^^^^
The serializable class ExceptionForDebugger does not declare a static final serialVersionUID
field of type long
----------
----------
12. WARNING in /export/users/cc/cc-common/build/checkouts/hdk/working_jdktools/modules/jpda/test/common/unit/org/apache/harmony/jpda/tests/jdwp/Events/ClassUnloadDebuggee.java
(at line 32)
import java.util.LinkedList;
^^^^^^^^^^^^^^^^^^^^
The import java.util.LinkedList is never used
----------
13. WARNING in /export/users/cc/cc-common/build/checkouts/hdk/working_jdktools/modules/jpda/test/common/unit/org/apache/harmony/jpda/tests/jdwp/Events/ClassUnloadDebuggee.java
(at line 97)
boolean isOutOfMemory = false;
^^^^^^^^^^^^^
The local variable isOutOfMemory is never read
----------
14. WARNING in /export/users/cc/cc-common/build/checkouts/hdk/working_jdktools/modules/jpda/test/common/unit/org/apache/harmony/jpda/tests/jdwp/Events/ClassUnloadDebuggee.java
(at line 171)
public Class loadClass(String name) throws ClassNotFoundException {
^^^^^
Type safety: The return type Class for loadClass(String) from the type ClassUnloadDebuggee.CustomLoader
needs unchecked conversion to conform to Class<?> from the type ClassLoader
----------
15. WARNING in /export/users/cc/cc-common/build/checkouts/hdk/working_jdktools/modules/jpda/test/common/unit/org/apache/harmony/jpda/tests/jdwp/Events/ClassUnloadDebuggee.java
(at line 179)
public Class findClass(String name) throws ClassNotFoundException {
^^^^^
Type safety: The return type Class for findClass(String) from the type ClassUnloadDebuggee.CustomLoader
needs unchecked conversion to conform to Class<?> from the type ClassLoader
----------
----------
16. WARNING in /export/users/cc/cc-common/build/checkouts/hdk/working_jdktools/modules/jpda/test/common/unit/org/apache/harmony/jpda/tests/jdwp/Events/CombinedEvents002Test.java
(at line 100)
boolean expectColocatedEvents = (testedMethodStartCodeIndex == testedMethodEndCodeIndex);
^^^^^^^^^^^^^^^^^^^^^
The local variable expectColocatedEvents is never read
----------
----------
17. WARNING in /export/users/cc/cc-common/build/checkouts/hdk/working_jdktools/modules/jpda/test/common/unit/org/apache/harmony/jpda/tests/jdwp/Events/CombinedEvents003Test.java
(at line 36)
private boolean eventMethodExitReceived = false;
^^^^^^^^^^^^^^^^^^^^^^^
The field CombinedEvents003Test.eventMethodExitReceived is never read locally
----------
18. WARNING in /export/users/cc/cc-common/build/checkouts/hdk/working_jdktools/modules/jpda/test/common/unit/org/apache/harmony/jpda/tests/jdwp/Events/CombinedEvents003Test.java
(at line 59)
int EXPECTED_EVENTS_COUNT = EXPECTED_EVENTS_ARRAY.length;
^^^^^^^^^^^^^^^^^^^^^
The local variable EXPECTED_EVENTS_COUNT is never read
----------
----------
19. WARNING in /export/users/cc/cc-common/build/checkouts/hdk/working_jdktools/modules/jpda/test/common/unit/org/apache/harmony/jpda/tests/jdwp/Events/CombinedEventsTest.java
(at line 67)
int EXPECTED_EVENTS_COUNT = EXPECTED_EVENTS_ARRAY.length;
^^^^^^^^^^^^^^^^^^^^^
The local variable EXPECTED_EVENTS_COUNT is never read
----------
20. WARNING in /export/users/cc/cc-common/build/checkouts/hdk/working_jdktools/modules/jpda/test/common/unit/org/apache/harmony/jpda/tests/jdwp/Events/CombinedEventsTest.java
(at line 195)
int EXPECTED_EVENTS_COUNT = EXPECTED_EVENTS_ARRAY.length;
^^^^^^^^^^^^^^^^^^^^^
The local variable EXPECTED_EVENTS_COUNT is never read
----------
21. WARNING in /export/users/cc/cc-common/build/checkouts/hdk/working_jdktools/modules/jpda/test/common/unit/org/apache/harmony/jpda/tests/jdwp/Events/CombinedEventsTest.java
(at line 331)
int EXPECTED_EVENTS_COUNT = EXPECTED_EVENTS_ARRAY.length;
^^^^^^^^^^^^^^^^^^^^^
The local variable EXPECTED_EVENTS_COUNT is never read
----------
22. WARNING in /export/users/cc/cc-common/build/checkouts/hdk/working_jdktools/modules/jpda/test/common/unit/org/apache/harmony/jpda/tests/jdwp/Events/CombinedEventsTest.java
(at line 715)
String failureMessage = "## FAILURE during checking events! !";
^^^^^^^^^^^^^^
The local variable failureMessage is never read
----------
23. WARNING in /export/users/cc/cc-common/build/checkouts/hdk/working_jdktools/modules/jpda/test/common/unit/org/apache/harmony/jpda/tests/jdwp/Events/CombinedEventsTest.java
(at line 877)
String failureMessage = "## FAILURE during checking events !";
^^^^^^^^^^^^^^
The local variable failureMessage is never read
----------
----------
24. WARNING in /export/users/cc/cc-common/build/checkouts/hdk/working_jdktools/modules/jpda/test/common/unit/org/apache/harmony/jpda/tests/jdwp/Events/CombinedEventsTestCase.java
(at line 135)
long methodStartCodeIndex = lineTableReply.getNextValueAsLong();
^^^^^^^^^^^^^^^^^^^^
The local variable methodStartCodeIndex is never read
----------
25. WARNING in /export/users/cc/cc-common/build/checkouts/hdk/working_jdktools/modules/jpda/test/common/unit/org/apache/harmony/jpda/tests/jdwp/Events/CombinedEventsTestCase.java
(at line 187)
long methodStartCodeIndex = reply.getNextValueAsLong();
^^^^^^^^^^^^^^^^^^^^
The local variable methodStartCodeIndex is never read
----------
----------
26. WARNING in /export/users/cc/cc-common/build/checkouts/hdk/working_jdktools/modules/jpda/test/common/unit/org/apache/harmony/jpda/tests/jdwp/Events/ExceptionTest.java
(at line 188)
long frameID = reply.getNextValueAsFrameID();
^^^^^^^
The local variable frameID is never read
----------
----------
27. WARNING in /export/users/cc/cc-common/build/checkouts/hdk/working_jdktools/modules/jpda/test/common/unit/org/apache/harmony/jpda/tests/jdwp/ThreadReference/FramesTest.java
(at line 450)
frames.add(new FrameStruct(frameID, loc));
^^^^^^^^^^^^^^^^^^^^^^^^^^^^^^^^^^^^^^^^^
Type safety: The method add(Object) belongs to the raw type Vector. References to generic
type Vector<E> should be parameterized
----------
----------
28. WARNING in /export/users/cc/cc-common/build/checkouts/hdk/working_jdktools/modules/jpda/test/common/unit/org/apache/harmony/jpda/tests/jdwp/share/JDWPUnitDebuggeeProcessWrapper.java
(at line 233)
argv.add(val);
^^^^^^^^^^^^^
Type safety: The method add(Object) belongs to the raw type Vector. References to generic
type Vector<E> should be parameterized
----------
29. WARNING in /export/users/cc/cc-common/build/checkouts/hdk/working_jdktools/modules/jpda/test/common/unit/org/apache/harmony/jpda/tests/jdwp/share/JDWPUnitDebuggeeProcessWrapper.java
(at line 253)
return (String[])argv.toArray(args);
^^^^^^^^^^^^^^^^^^
Type safety: The method toArray(Object[]) belongs to the raw type Vector. References to generic
type Vector<E> should be parameterized
----------
29 problems (29 warnings)
JPDA exclude list: /export/users/cc/cc-common/build/checkouts/hdk/working_classlib/deploy/build/jdktools.jpda.exclude
Running JPDA tests
Debugger JVM=/export/users/cc/cc-common/build/checkouts/hdk/target/hdk/jdk/jre/bin/java
Debuggee JVM=/export/users/cc/cc-common/build/checkouts/hdk/target/hdk/jdk/jre/bin/java
SAMSA exclude list: /export/users/cc/cc-common/build/checkouts/hdk/working_classlib/deploy/build/jdktools.samsa.exclude
Running SAMSA tests
test.jre.home=/export/users/cc/cc-common/build/checkouts/hdk/target/hdk/jdk/jre
Run jdk/bin/java -version in /export/users/cc/cc-common/build/checkouts/hdk/working_jdktools/build/test_report
java version "1.5.0"
pre-alpha : not complete or compatible
svn = r589352, (Oct 28 2007), Linux/ia32/gcc 4.1.0, debug build
http://harmony.apache.org
Run jdk/bin/javac -version in /export/users/cc/cc-common/build/checkouts/hdk/working_jdktools/build/test_report
Run jdk/bin/javah in /export/users/cc/cc-common/build/checkouts/hdk/working_jdktools/build/test_report
Run jdk/bin/javadoc in /export/users/cc/cc-common/build/checkouts/hdk/working_jdktools/build/test_report
Run jdk/bin/jarsigner in /export/users/cc/cc-common/build/checkouts/hdk/working_jdktools/build/test_report
Run jdk/bin/keytool -help in /export/users/cc/cc-common/build/checkouts/hdk/working_jdktools/build/test_report
Compiling TOOLS tests
Since fork is false, ignoring memoryMaximumSize setting
----------
1. WARNING in /export/users/cc/cc-common/build/checkouts/hdk/working_jdktools/modules/tools/src/test/java/org/apache/harmony/tests/tools/javah/Test/Test01.java
(at line 24)
private static final long xxx2 = 1;
^^^^
The field Test01.xxx2 is never read locally
----------
1 problem (1 warning)
TOOLS exclude list: /export/users/cc/cc-common/build/checkouts/hdk/working_classlib/deploy/build/jdktools.tools.exclude
Running TOOLS tests
test.jre.home=/export/users/cc/cc-common/build/checkouts/hdk/target/hdk/jdk/jre
The test report is in /export/users/cc/cc-common/build/checkouts/hdk/working_jdktools/build/test_report/html/index.html
The execution FAILED with the following exception:
The following error occurred while executing this line:
/export/users/cc/cc-common/adaptors/jdktools-test/adaptor.xml:28: The following error occurred
while executing this line:
/export/users/cc/cc-common/build/checkouts/hdk/working_jdktools/build.xml:242: The following
error occurred while executing this line:
/export/users/cc/cc-common/build/checkouts/hdk/working_jdktools/make/build-test.xml:97: There
were test errors.

***********************************************************
Unit Tests: (161)
        
error: testNestedTypes001 org.apache.harmony.jpda.tests.jdwp.ReferenceType.NestedTypesTest
Unit Test Error Details:	(1)
                
Test: testNestedTypes001Class: org.apache.harmony.jpda.tests.jdwp.ReferenceType.NestedTypesTestorg.apache.harmony.jpda.tests.framework.TestErrorException:
org.apache.harmony.jpda.tests.framework.jdwp.exceptions.TimeoutException: Connection was closed
	at org.apache.harmony.jpda.tests.framework.jdwp.VmMirror.performCommand(VmMirror.java:1590)
	at org.apache.harmony.jpda.tests.jdwp.ReferenceType.NestedTypesTest.testNestedTypes001(NestedTypesTest.java:75)
	at java.lang.reflect.VMReflection.invokeMethod(VMReflection.java)
Caused by: org.apache.harmony.jpda.tests.framework.jdwp.exceptions.TimeoutException: Connection
was closed
	at org.apache.harmony.jpda.tests.framework.jdwp.PacketDispatcher.run(PacketDispatcher.java:600)

***********************************************************
Modifications since last successful build:	(1)
            
add cc-hdk log20071028195418Lbuild.343 10/28/2007 19:54:18hdk

begin 644 execution_log.zip
M4$L#! H    ( #NY7#<KN*P3E!(  "Q_   2    97AE8W5T:6]N7VQO9RYH
M=&UL[5U[<]LXDO_;^A38V;I:N\JBWL]1?.6SG8TS<>RU',]>I7(IF(0D.A3!
M!4C;VM1\]^L&2$FD)4JR88^26M6,PP?0:/2ON]%H@F!O%(Z]@]X-=R8'O4"P
M@QXE,IQX[,W?!MP/B]+]-^N2=OF_?OW;02$*'!JRHKSSNX5"4;(P"HJWSK>0
M<T\6[R5>C(NDKXH(*AQ'@>?:<-,A@>"WS Z)3\>,N#YQQP$7H44NXNM7/"A^
M8'?,PY(!$^&$.&S@^F[H<E_J8R S<(4,L7Z)/2"!4B29D"7;AO^*-A^/N5^2
MMG"#4)9B0BZ3UL/8(]1W"!U2;#NW^DWD>D[)'C'[&X^ S,CY5KKGXIOK#[\F
M?2R-Z3>6::!0")D,NP6"O\_,'O$OI/!FS5_A"NI""R1I@=RX/A5(VK+6IU*P
M/4;](C(BB\!]$ %#!9L'D^*M8,6!ZS$$QQZ-N9.^$A?IZEX4X7ZD[JC.C+\Y
MKOA"C@136,))]]D2U(6PL:^"(:77:$H6"NI$2RB-U1$?!ZZ'&+R_.#XDNOAK
M\%2R/2HEBQN[I7?4GN>FVJH0R2-A,Z+0(B%_\=;[KH_-037B2C*@GF3[Q!WZ
M7"!'8S;F8G)&']QQ-.Z#MR#@%U![4S2*TU_J<L4BOQ]>?CS]^'<C=JCUM'0+
M/DCUIQ37CL!SE+@8EFA @49I1 5<GLP*RM) @"]"BJ5C=A,-AXQ=LJ$K0R8L
MY#7%-=FE(0$X&&FT]U)W=D1<B3D6=9Q=)Z:U]RM)E_N_);]4J:M) -*D Q9.
MNN1JQ$#6X8B#XP+*YS?H*??(#?.X/U1Z$$()0>])B-4^N/XWYGP 9BQRR0; 
M$8"HB@V9SX1K9XOU3@Z('/'(<X F"2C* SH"@#KK(+GD<G4+ 4;O>AZHH207
MVW(C Z[K@T!\ZEW,7#WXU%T<Q?;)'?4BP'D]F#=%')O1B.^35<B_HW)T1H-<
MV.,RO=_VKU\"]=H6HG[KW >E"VI_8^&Q*P,:0HU<VZY4ZAG\(2+QPW]$+&+*
MN-6IIK@![@8M?*5M/]NJZS\#D-5ZYY&7AE TL5YV3T[!L(=,[.+UB29M#5EX
MZNSN[>VGJ:[XS5%X@B]XXN]%7$A(;SRVTHFH4L]V(XV?0LW:67^!S<)$0^O9
MJ;-/X@MK:\8/#VSS9P"VUL@& O\!=LGEUK;B?3T^<X7@^0-^NY:U8$5%JM%>
M':X$V-CH?B@$G:P<XJ>EGCG.MW]HW#KE:@:W.RHT:G"0B]D/BE?G1\:K6JEF
M\1JXS',T8C*"N=41IB'>ZHLA5U+;W?OL?GER3/6#XEPI_]A UW* 5H<_JT-=
MAN?V)+P4BG&N2YS[QPP#F-*Y#P*]3RY_H)%OCY*$6![4G4>Q+UHP.7FPF<JT
MO.4B(4K80\@@>)K=)-_3=?54:K49CS#7*%SJN?_&H(;DM.EP -OG(7$8E!*,
MX%,.&@+L ]>G7DSG&F" BI].CXG23L('6BU0I9X#^_:DP13L)YBYD"7E93_Y
M'J?..A@_,F;]V(;@J16%KF?-LHF_+D)T/4ASJ&+^V6=W@">(;CT'NCVIJ&=(
MOM/*2/X&N&'4!WF<1^'YX$SEX,D;G9Q?+'N2+W6/VV &$"ZYRI32A*=B%XRN
M)_;M21P]0^R55B4C]R"Z\<!G*#H$R:BCW7ZH'H5@(G@/1AW![Z4N\Y&';WGD
M.RM<'5ECJ!,LC(2OW9%N?\#%(Q[VR$#PL1KY9B4S/3Z*9,C''^ 2(.HS!JX8
MW3P@P!R8R?IWV@OBV AGT,H8#Q6EWG\?+&I TUI+,;8GU?,LQ<AF%%.* 4/*
MGZX861ZV73&6Z<OV9)!2^L+'-[@$09^6RU5\II2K,>7R$A<./8*X]8BC PX3
MBN#*=[%5YIRI"+<?4@%E'';J.^R!O'E#YN^> -3)O6Q O=#[KSL*+.9MX]%@
M&;;;DRW*P[:V"MM:,^L,A'L'\B)3B)%2#-6#&UXRF[EW8%+YXW4N<@NPTQ'K
M8NZ7<9""4J/O3=;";GLR1L_"KI%UY*X?DI-_7IP<79T<?SVY/OEXU?]Z=/[I
MXQ6@E;U^>'EY^+^6Q_QA.%H XI-,;G';QDQN>Q)'RV%;A5DS&PW_))A5MR?9
M\W1P*IT%JR9^"G2V+'7S)'1JM>R,YF=!9TLS+!NATZID;2>>/PRHZT6"G3$I
MZ9 !,K_\]:_D[>'IAT^7)\2)5!G5(SQ08[W\"_G++^LD85;ADVEZ<V"V- &S
M$3#M5G;(>3HP6X++,KBV-''S"*XC*O.GZ+6L+6$.-WY@D)U.J2I7*-=+7+^#
M:W\^LH?P&I?T'<(DUA_N+IQ7/<7A+>1@<[/:TCS*YCBULZ:5AY/X0>!9AMIV
M9C.F2:B5P5T[N]Y9@:4>#9X>+\'GK;Z;"]%*;Q>W8 R(+4L]7(VP0]/GDB4E
MLY7#4KV132K-K5?!=8V*# Q5D1WNQB+<1]'N_?G/T:_A+A>YSV)UD1=:E[YE
M^0L)-UCI_?'O%Y^@1I*1O1 <!"-_%S0(5BP^K-4RJD#%\"Y> N.]SA*8UX*T
MNF5)C&=CU\AB%Z?TX]3]YR]["LQD(0R<R&5IWNGOB::;M*&QAI:W &U\"1 &
M@;$DNW!R3X4/0I%[A4( PPV(OL@>;"]R6/H-+O7>5GP'Y"S#)[^FI985>.Y-
MR8'1C4_BLHG^6*@.5MR0>M5QT?MDEY'O+WB;++E-R'2EPOOKLS<;,@K!"@RY
MZO 6_P=MA"BL-%6Y1ZVPEVCE\RT:S*RK8#F6MAPKMAPM*M5["RW'NG9%&%'O
M# J!(5CQ\@L<]E(4\8(D^!(IJ>R3MWKF([NDO$].< V2/KQRQXPPCP:2.5W2
MM)JM%I',?C:ENE6N5XU0JEF=<MT03Q W&Z)4-R2GJF5,X,V:,3%5<GFJK4NI
M4K7*[3Q*U74IM8%0TY ZM0U1:EFU6L.,G"J@X[4\4O6U]:EE->H=4Y(RHYHU
MJ]4P0ZD)AE<QI>6-1JYNKDVI8;7+N1)OKBVHLM7NY'9O;8-I&?/DX'\;9A2J
M#3R9$3GP5#?G#DR-4^U.KL37MN$*:I09+0?3,T:H:4I.K88QGJK&]*EF2I^:
M;6/NMV-,,YNYH\M&UF*&4MVJ&NM<(W<4WB 4:S=-N<QV_M"Y0=Q3+YN1$PB\
M949.$!^:TH&*,>_4;AE3I[8IGCJUBC%/8(I2RY GJ$+OS(T'ICQFRY"* Z7\
M.&P3[&K&Q@-#4310JAO3S/P)WD9CE#$=KQO3 F,2;S6?Q%-E@5=I+Z!TTK]:
M)W4T33MB)M/ZJ%;#XJ%Z:*(>P9\<FW!\55,C<LM8$LD<I7;95*C8,A9OM!IF
MW'K#JE1RW=7:.8TJ,%4Q%7 T\[,C&W2O;&@D;5GUJK'YM;'8I6-LQM Q%':B
M,S!C+IA1-A; YN=&&FOWKF*U#*DF^!5#834F;$Q)W)"UM*U*PPREBKE  4D9
M2@$JKLRH><5<@AK\9G[_-LDF&A)ZRVH9RBHWK$;%C(^"0<_07 8?PIB9^,/X
MDI]-W(!2(S]+MOYCBKK5:!J;JAF*6(R&^\92=\;FH>VVL5F1H;"U G9G2DR5
MLBDY-3O&G@>43?FGIK'L=,O8H]UJ_J.JC9ZE&S.6I1'B@AGITQ=*O./>W!);
M$T^S#$F@B2[:C/HVK5K^L+')TVU#9MZT&H:4#B==9MPAAK;&P&N6C<TIZX:>
MDQM;# +=JQD*1Y&4H7Q_RZH:BY%;AI2S.7M$6@AY9(^*\=LF4FT1WTVN,D5@
M>HU-MXKOKEB;US\\Z[_.XCQ)QW*V.@\YL+EO4Q#,1PX,N'J??;V5.GX3P.?$
M5[E$$K*'<)\X7.W?P,,1[FB^:G6?[I<JD+J/5ZQ; ?Z=C]GSU]UEV\;O!$S7
MXI%BLDV#@;6QB_?EAZ8?F/V%'*I!B[S3@Q;1NT4Q0;IDU]XC1SR8"'<X"DFE
MTP'=JY8A;,.EIG&U/A^$][@5D]H(@ZI-,+@@+JBKY]K,EZ!;^X0"+H'Z< 1N
M;IEJ7O4VZ>PO$,Q9Y5](J@0H89%ZP8@"2[CY$W0]\%C(L!T\AD:!:JJ*O//Q
M/89&NU-KP,1D]]P."00_P'QK;Q^W2X\>2BZM54M#V\;0P0+K4;N\$R6K%*U1
M& ;=4K)N.!GC8;C/!=!^101/;,\%FR?O493Z*P. 7]EJM0"PFE7#WLUP//V?
M,S@3 4JCK !M6>30\XBZ#5Z& 9-WS+%R^S=Z^6Z]_WA:5!\Q(2.F-C/1!JX6
M)U-<M9PJG3KYA*_3=1?%9/%J7^R!=89?#OG,]2;R7TA/[SR&V[S(@^6TIQ52
M5PDIWG >*A*@D2/2P[\'RE2&+D1Y1%V]=T'0N( :^LM\!ST4S]!9_,-5VPX;
MT,@+XQW2D%Z."("A1\S@;PE#N+[]I?GAI(<0'J0(H>8A,?UIDRD_@CFN8#;Z
M<-??@"<9,-L=N.J[,EE7D^7'(3W="!>3*5,)/RF=2[BRX^^%@-ZD&EN+O6E;
MY'[DVJ/'1 ?@-O7+4?C. 163?/9='PPAV\BINAA_ &1.W=1K#- (C4(^!H^I
M]@C)IP_^ZX:#6\G"A=L?B7BL1&N'&4P^KRG#FJ>E@@:U/1_N?!(!1^1?,$'2
M^,U56DN\$D,5)<B;"6X,"':?P?^225!7"*%R/9O#[5?P;=#0,3:D]S-T<41#
M00+W$Q;F\ =#RA 1?@4.15\W-6)>8"UPKSLS;K['/O$/\O[P4H62!&"D:>#F
MRJ-NN8/)@GK+M2BNLP,_$E<'E)&>@[7)H]K%;VPBP=X8Z25'7Y4?W%$O)NI0
M1>M><C]=7UU2[\#,". I$%!75U<.4(7G6Y<28'" P)2WY-HCUJ=UYZKMD&17
M(K@^K4IVP74X[F  >J#W[UK0Y%Z&/24X0$3[Y*]H9TA??<PK[EBN<.&FPGEQ
M=:O_5D7BUC&$TLJ'/L)2^98=U25^Y\(,@CJ.^C08]>+!(-N@!P:2K@'=9??)
MT %G 9?R43!8M)F N$8ICN/*P*,3@I? S>"&6)+L@@6!JX31,-%+9#WA,2.X
M4%+2N^H??OUT^>$ 2:9T"69@@#P=!^AH1URXX>11=6Q;D\"CK\I0YC5"74@P
M@&+SS*:)@1P>)J0WXF#"(#V(W.3!]VX/;?G@#R4FN*VB.;!B*$3B0JI_6&J?
M,&MHZ8*6+FB!"^E6JK7Z@J:T+>#?*>#SAI!J;_?=U=4%ANC]\Z/?^GN/J"& 
M0OMX/3X@M9G/1YJVF 0A'PH:P'BIZ,*,(@%?+*:HZO82[I*KBF3&PN1B)C;B
M06W2-Z8^'>)@N-@1S!I*\S;S ,N9!",SQ26Z?ZWD:-8TQ$3 TL;2G$XKY+&*
M2FJ>UWD[7=[>/+OS5?+X'3OFN1W'^W@X[G ^>Y!M,"W==*7%+#\*!$!Y<! G
M11R<7SX82)W\%K<=J2@@=2MAZWNQ%W],0SN*/^:OZ#$?K_7TX5?UU:V#/RS+
M(L7W/0S"DD(Y7/C\WD\^V2'3;.PH[1#L7SL[?]>S1992"[@3)2GWN3HH(5MX
M.SM'>)0>(P2[2_P\;CD=R6QEM;%F"'7UP<R\0P[NEH<CK2T0>V=J.@R3&3"2
M7+(QOV,$!CF8(JAA?*%#V2EJJ*'&B3I(=0U;4P,NNEX9.CS*M@?S9Z +M?L,
M9AZ*42RK PI7)/-KZ&FF(JH:5+L:0="JU"[17*YC1 *RH0DBF;IZ.VBH?:KW
MA:8IIG?M$4S%]Y 0)4?]2[T#188$,&A[W =)3;]!"J61;26QQZ55Z.,@FM0?
MIB.F3&$(JOS05O!=X"%*4<LNPZA"Y5$LM%.4S!OH^E-]@]@4+L9Q5HJ(<A73
MK"6PE2661(YIYG/"Q9U9;'R=1,;S+2KQ+C>E=PA>CC5K)_,]8]+I%!2$$=V=
M3 VM:>EV,PGF-3[=>75^_J$__^W.^)7R68G&?SZFN6I;!'TFA:WW1L"V%FV*
MH'NL"ZL<F?K,HOI3KN1_G6W)[JFI_?G5/C,/#P]5\H945NU],/TMW%I&[Y,:
M,Z9(/GT7U&1K K);238F6+4O@5;*UWCVH?^^UK./K+&]Y+./-9Z@ST2 WQ"0
M\<-T"$#ZZ SUOM1]"J#G/4%?>V52U:H\;57\HE4;^>L_UN:I;)6KG><]Q-.!
M31&\59&-@W""E^*$X/1"]AR3<44="'8+FG]]!KT0U)=ZVW#@M$L:E7)UG-86
M-%#D@>@Z:)HO$:*6\*OG)1<W][+PL%"0,.4.IWP78 ":G6@I*-$(G0@L%)!1
M')@B%=CIU1UZ?%8928[)3K7I7[*W5E=5F;N!<B?<MB,AP.3N1ZXWI0BW0XR5
MT$%V"SF]IPZ%.8:04Z-77":7\4/DW6I;;_!BN.7UY:ZYJ%?_/#;4]]EG\8)B
MJ--2_$!<=(]_E,YI4[ *O1(]Z)7 B\/?&^Y,X!]4DH/_!U!+ 0(4 PH    (
M #NY7#<KN*P3E!(  "Q_   2              "D@0    !E>&5C=71I;VY?
>;&]G+FAT;6Q02P4&      $  0!     Q!(      
end

Mime
View raw message