harmony-alerts mailing list archives

Site index · List index
Message view « Date » · « Thread »
Top « Date » · « Thread »
From nom...@intel.com
Subject [build-test alert] FAILED Linux x86_64: dacapo
Date Sun, 28 Oct 2007 11:36:42 GMT
svn.revision=589199
BUILD FAILED:
	Ant Error Message:
/export/users/cc/cc-suites/scripts/cc-exec-adaptor.xml:104: The following error occurred while
executing this line: /export/users/cc/cc-suites/adaptors/dacapo/adaptor.xml:112: Not all workloads
completed successfully

Date of build:	2007-10-28 18:36:31 +0600
Time to build:	5 seconds
Last changed:	10/28/2007 16:50:37
Last log entry:	snapshot

***********************************************************
Errors/Warnings:	(36)
            
java version "1.5.0"
pre-alpha : not complete or compatible
svn = r589199, (Oct 28 2007), Linux/em64t/gcc 4.1.0, release build
http://harmony.apache.org
===== DaCapo antlr starting =====
ANTLR Parser Generator   Version 2.7.2   1989-2003 jGuru.com
===== DaCapo antlr PASSED in 1052 msec =====
===== DaCapo bloat starting =====
** Exception while optimizing simplify(LEDU/purdue/cs/bloat/tree/Node;)LEDU/purdue/cs/bloat/tree/Node;
of class EDU/purdue/cs/bloat/trans/ValueNumbering
Assert.isTrue: Lr0_746.folder is undefined
java.lang.IllegalArgumentException: Assert.isTrue: Lr0_746.folder is undefined
at EDU.purdue.cs.bloat.util.Assert.isTrue(Assert.java:33)
at EDU.purdue.cs.bloat.trans.SSAPRE.finalizeVisit(SSAPRE.java:2015)
at EDU.purdue.cs.bloat.trans.SSAPRE.finalizeVisit(SSAPRE.java:2079)
at EDU.purdue.cs.bloat.trans.SSAPRE.finalizeVisit(SSAPRE.java:2079)
at EDU.purdue.cs.bloat.trans.SSAPRE.finalizeVisit(SSAPRE.java:2079)
at EDU.purdue.cs.bloat.trans.SSAPRE.finalizeVisit(SSAPRE.java:2079)
at EDU.purdue.cs.bloat.trans.SSAPRE.finalizeVisit(SSAPRE.java:2079)
at EDU.purdue.cs.bloat.trans.SSAPRE.finalize(SSAPRE.java:1969)
at EDU.purdue.cs.bloat.trans.SSAPRE.transform(SSAPRE.java:331)
at EDU.purdue.cs.bloat.trans.SSAPRE.transform(SSAPRE.java:249)
at EDU.purdue.cs.bloat.optimize.Main.bloatMethod(Main.java:896)
at EDU.purdue.cs.bloat.optimize.Main.editClass(Main.java:688)
at EDU.purdue.cs.bloat.optimize.Main.main(Main.java:446)
at dacapo.bloat.BloatHarness.iterate(BloatHarness.java:25)
at dacapo.Benchmark.run(Benchmark.java:126)
at dacapo.TestHarness.runBenchmark(TestHarness.java:302)
at dacapo.TestHarness.main(TestHarness.java:242)
at Harness.main(Harness.java:5)
at java.lang.reflect.VMReflection.invokeMethod(VMReflection.java)
at java.lang.reflect.Method.invoke(Method.java:317)
at org.apache.harmony.vm.JarRunner.main(JarRunner.java:80)
Number of tests: (...........)
N of runned tests(.)
The execution FAILED with the following exception:
The following error occurred while executing this line:
/export/users/cc/cc-suites/adaptors/dacapo/adaptor.xml:112: Not all workloads completed successfully

***********************************************************
Unit Tests: (0)
        
No Tests Run: This project doesn't have any tests

***********************************************************
Modifications since last successful build:	(1)
            
add cc-snapshot log20071028165037Lbuild.27 10/28/2007 16:50:37snapshot

begin 644 execution_log.zip
M4$L#! H    ( ).47#=WJZ5BYP,  &$+   2    97AE8W5T:6]N7VQO9RYH
M=&UL[59M3QLY$/Y\^16C2J>&"KS9)80D#4@IT%Y/P"&@?#FAD_%.$A>OO?(+
MD/[Z&^\N+RO2%J%*]^56T2ICSSSS8N_,,UGX0NU.KDR^W)V4%G<G')Q?*MQY
M.S/:;SCY#<<P[/W^_NUN)Y0Y][CA;O2XT[&!WA"?O_$.Q25,2RX6"']P6QB]
MA$,>-,D6QM 5:[!GRJ65\X6'=#1*UR'K]09P3OJ-V9F9^5MN$3Z:H,F--!J,
M!>D=*"E0.V/=.G 'O"QI@5\I9"WW7_D-AQNT+EJ^2=D6Z[V!E@:EM\%5N> 4
MDC8>A"E*A1ZCG_B?G!)JRX12A1VP6\,11;T.W;^$AVP8@]]>6X=#J<-=@L6@
M[Y.Y$-!G*>NM@T6%W"%<!:GR%MS"^W*<)(NZ1(Q7J3-CYRVMG?C /M_CI0&N
MO;)T)-QZJ>?U7DO[-&@==VI%RGUN>5%P6R\DL2RLC3\]/C\\A1-N'9W.)]1H
MN:<2 %PTU<O8-LM(3D?#T0;EN@E?/P4;&!7I9X&>3,_.#O9!:DA[6QD4#L6*
MF%N&5\IP_Z,,W[V#@SN!974G;A=2T8F14,AO4=]).D4Y6W8/#_:_)&6P><!$
MN*2"3;Q%3(Y-CN_7?K(/9@9"<>=@M1[7+KG@*N!Q**[0DNMV41U5TS/ISFV@
M+^;0]O[9[@_8S*B<JBP=T*W&F=28/[NU3'$]9Y^5PCE74SL/!6K_D/'XM="_
M454I%5:GPH1C52HL>*E8"[/;2#&8\>;FVHM@JHJPL[/IR>D!(^]<4:NXD$[Z
M;K-8P66]=.L7 VZ/_@?\3P%;6.EH\!JL2I@96[3 -C?37X:5]5\85]-,D!UQ
MJ>NU(_0+DW>KA0IL.!J\!@QSZ?=B4WD"-1@.7P-5T.L)2K^_(J"<"^JHC?F'
M^*9IK-$Y)GWL\MAM+=9E6O%Y-C@?D"8XC9)K1L.^^RC5YYY]/X!S= ].R/3!
MLOMTHS[P7O8BE"K[9]99?X5URZ2EOB+3Q_YK<:90>'9Q=%K_H][+I+XQU]C<
MAM9.-'P)7&W; '4;J4X]W7X.0%S@GA;<LX2;@OW);1SS:.ND'L7Z;O;:.*?H
M@O)C2)M50=3KLB)@<5ZF,(L3U!M(\*XTUB>!FK]+A*#?A@MT4VCH1>J2V K(
M)?5YW/L0"W,)]1",,Y/4O2..QQZ?M;9JU+(QWKQ6[I)")U*_&&ZHIOK'Z6<:
MSW K_0(\[=!L4^8VAHL/<[ R>;)A+9$6(T2PEI!K7M @TK9?R,@<-8X[/\B3
MY[PD[G.?XKW,[@HU3M-L#,?$$[E2<&OL-7TZN7M@C3FX( 3=K5E0:MF9)'QW
MDE0,.JG9=%)1ZW\!4$L! A0#"@    @ DY1<-W>KI6+G P  80L  !(     
M         *2!     &5X96-U=&EO;E]L;V<N:'1M;%!+!08      0 ! $  
(   7!      ! 
end

Mime
View raw message