harmony-alerts mailing list archives

Site index · List index
Message view « Date » · « Thread »
Top « Date » · « Thread »
From nom...@intel.com
Subject [build-test alert] FAILED Windows 2003 x86: classlib-gui-test debug
Date Sun, 28 Oct 2007 11:23:11 GMT

BUILD FAILED:
	Ant Error Message:
D:\cc\cc-common\scripts\cc-exec-adaptor.xml:104: The following error occurred while executing
this line: D:\cc\cc-common\adaptors\classlib-gui-test\adaptor.xml:80: There were CLASSLIB
Unit Test failures.

Date of build:	2007-10-28 18:22:46 +0600
Time to build:	18 seconds
Last changed:	10/28/2007 13:20:34
Last log entry:	hdk

***********************************************************
Errors/Warnings:	(10)
            
[cc-ant]: Test Suite 'classlib-gui-test' execution. Repository updated: ${repository.updated}
[cc-ant]: Check for 'run' failure of hdk = ${hdk.parameters.run.failed}
[cc-ant]: Result: failed.superiors = '${failed.superiors}'
BUILD FAILED
D:\cc\cc-common\build\checkouts\hdk\working_classlib\build.xml:169: The following error occurred
while executing this line:
D:\cc\cc-common\build\checkouts\hdk\working_classlib\make\build-test.xml:52: Unable to delete
directory D:\cc\cc-common\build\checkouts\hdk\working_classlib\build\test_report
Total time: 12 seconds
Warning: skipping zip archive D:\cc\cc-common\build\results\classlib-gui-test_20071028_1822.zip
because no files were included.
The execution FAILED with the following exception:
The following error occurred while executing this line:
D:\cc\cc-common\adaptors\classlib-gui-test\adaptor.xml:80: There were CLASSLIB Unit Test failures.

***********************************************************
Unit Tests: (0)
        
No Tests Run: This project doesn't have any tests

***********************************************************
Modifications since last successful build:	(1)
            
add cc-hdk log20071028132034Lbuild.300 10/28/2007 13:20:34hdk

begin 644 execution_log.zip
M4$L#! H    ( ..27#?9E$ 6$0(  *8%   2    97AE8W5T:6]N7VQO9RYH
M=&ULO51;:]LP%'X/Y#^<E]$G.XYA7>JZ@6;9("-/:\H>ZA 4^:36(DM&EUSZ
MZRLI*<SIA:V4&6/9/I_.Y?N.3EZ9F@_SI2SWP[Q1.,P):+/G>'6VDL)$FCU@
M!H/DT^79L-NQ34D,1GHCLFZGVU'6KP!P5R)'@W,8^Y6)>SA/+F#%.&I8*5G#
M."LH=7=$95U+42PMXV6A4%MN=$$YT9JS971O6610F^#4N?U--F0.(P_VSC((
M^^)=S=N(]E?$!#-15:ZSMU ^S@G@\(ZTDJ?@/RU7?WF][F'F0GN20MW@"E=$
M,=1Q'']TU/87Y4A$(#B2UC3VA?J?*UDRA=1(M7]%1%HA73MWNG",%UNIUF[7
MXDG2(\C'7"ALI#)O)3BZG4S'\/UZ,OTV;EO>']MW2]8_O\A@5B&L).=RZ^M"
MI:0"2:E5"DO85J[! '=(;2C;5,Q+(S#[@$1JLL8#,K ?4OJ<9G KR-)%-1(.
MM/]7LF?2$ Z&U>Y<]5/02*4H=1OSPSWA9SBF#G2TP=T#:^;PBRCAHF>@UZQI
M/&?N-Q!%*[;!?SWQBS1)OO23=+#H#](T]IZ62(G5"$(>)\D6%0(3E-L22W=4
M.E[0HV)2'-L&MLQ43KV6U#N*C<=DG7?WP&D]I"2-$^J%4IY,0>5!$OK.)1ZR
M_SJ]OKF93D9.>6;"'( 58=PZ7F(W4/,>&>:],(9[AY'<"_/Y$5!+ 0(4 PH 
M   ( ..27#?9E$ 6$0(  *8%   2              "D@0    !E>&5C=71I
A;VY?;&]G+FAT;6Q02P4&      $  0!     00(      
end

Mime
View raw message