harmony-alerts mailing list archives

Site index · List index
Message view « Date » · « Thread »
Top « Date » · « Thread »
From nom...@intel.com
Subject [build-test alert] FAILED Linux x86_64: drlvm-test debug
Date Sun, 28 Oct 2007 11:14:40 GMT

BUILD FAILED:
	Ant Error Message:
/export/users/cc/cc-common/scripts/cc-exec-adaptor.xml:104: The following error occurred while executing this line: /export/users/cc/cc-common/adaptors/drlvm-test/adaptor.xml:76: There were drlvm-test failures

Date of build:	2007-10-28 17:07:17 +0600
Time to build:	67 minutes 13 seconds
Last changed:	10/28/2007 16:33:57
Last log entry:	hdk

***********************************************************
Errors/Warnings:	(21)
            
[java] Java Result: 1
[java] Java Result: 1
[java] Java Result: 130
[java] Java Result: 1
[java] Java Result: 1
[java] Java Result: 130
[java] Java Result: 1
[java] Java Result: 1
[java] Java Result: 130
[java] Java Result: 1
[java] Java Result: 1
[java] Java Result: 130
[java] Java Result: 1
[java] Java Result: 1
[java] Java Result: 130
[junit] Tests FAILED
BUILD FAILED
/export/users/cc/cc-common/build/checkouts/hdk/working_vm/build/make/build.xml:474: Some tests failed
Total time: 67 minutes 6 seconds
The execution FAILED with the following exception:
The following error occurred while executing this line:
/export/users/cc/cc-common/adaptors/drlvm-test/adaptor.xml:76: There were drlvm-test failures

***********************************************************
Unit Tests: (4072)
        
error: test_10 java.lang.ClassAnnotationsTest
error: test_11 java.lang.ClassAnnotationsTest
error: testGetAnnotation java.lang.Package5Test
error: testGetAnnotation2 java.lang.Package5Test
error: testGetAnnotation_Negative java.lang.Package5Test
error: testGetDeclaredAnnotations java.lang.Package5Test
error: testGetDeclaredAnnotations2 java.lang.Package5Test
error: testGetDeclaredAnnotationsImmutable java.lang.Package5Test
error: testGetAnnotations java.lang.Package5Test
error: testGetAnnotations2 java.lang.Package5Test
error: testGetAnnotations5 java.lang.Package5Test
error: testGetAnnotationsImmutable java.lang.Package5Test
error: testIsAnnotationPresent java.lang.Package5Test
error: testIsAnnotationPresent_Negative java.lang.Package5Test
error: testGetParameterAnnotations2 java.lang.reflect.Ctor5Test
error: testGetParameterAnnotations3 java.lang.reflect.Ctor5Test
error: testGetParameterAnnotationsImmutable java.lang.reflect.Ctor5Test
error: testGetAnnotation java.lang.reflect.Ctor5Test
error: testGetAnnotation2 java.lang.reflect.Ctor5Test
error: testGetAnnotation_Negative java.lang.reflect.Ctor5Test
error: testGetDeclaredAnnotations java.lang.reflect.Ctor5Test
error: testGetDeclaredAnnotations2 java.lang.reflect.Ctor5Test
error: testGetDeclaredAnnotationsImmutable java.lang.reflect.Ctor5Test
error: testGetAnnotations java.lang.reflect.Ctor5Test
error: testGetAnnotations2 java.lang.reflect.Ctor5Test
error: testGetAnnotations5 java.lang.reflect.Ctor5Test
error: testGetAnnotationsImmutable java.lang.reflect.Ctor5Test
error: testIsAnnotationPresent java.lang.reflect.Ctor5Test
error: testIsAnnotationPresent_Negative java.lang.reflect.Ctor5Test
error: testGetAnnotation java.lang.reflect.Field5Test
error: testGetAnnotation2 java.lang.reflect.Field5Test
error: testGetAnnotation_Negative java.lang.reflect.Field5Test
error: testGetDeclaredAnnotations java.lang.reflect.Field5Test
error: testGetDeclaredAnnotations2 java.lang.reflect.Field5Test
error: testGetDeclaredAnnotationsImmutable java.lang.reflect.Field5Test
error: testGetAnnotations java.lang.reflect.Field5Test
error: testGetAnnotations2 java.lang.reflect.Field5Test
error: testGetAnnotations5 java.lang.reflect.Field5Test
error: testGetAnnotationsImmutable java.lang.reflect.Field5Test
error: testIsAnnotationPresent java.lang.reflect.Field5Test
error: testIsAnnotationPresent_Negative java.lang.reflect.Field5Test
error: testGetParameterAnnotations2 java.lang.reflect.Method5Test
error: testGetParameterAnnotations3 java.lang.reflect.Method5Test
error: testGetParameterAnnotationsImmutable java.lang.reflect.Method5Test
error: testGetAnnotation java.lang.reflect.Method5Test
error: testGetAnnotation2 java.lang.reflect.Method5Test
error: testGetAnnotation_Negative java.lang.reflect.Method5Test
error: testGetDeclaredAnnotations java.lang.reflect.Method5Test
error: testGetDeclaredAnnotations2 java.lang.reflect.Method5Test
error: testGetDeclaredAnnotationsImmutable java.lang.reflect.Method5Test
error: testGetAnnotations java.lang.reflect.Method5Test
error: testGetAnnotations2 java.lang.reflect.Method5Test
error: testGetAnnotations5 java.lang.reflect.Method5Test
error: testGetAnnotationsImmutable java.lang.reflect.Method5Test
error: testIsAnnotationPresent java.lang.reflect.Method5Test
error: testIsAnnotationPresent_Negative java.lang.reflect.Method5Test
error: testGetAnnotation_ByDefault org.apache.harmony.lang.annotation.AllTypesTest
error: testGetAnnotation_NoDefault org.apache.harmony.lang.annotation.AllTypesTest
error: testEquals org.apache.harmony.lang.annotation.AllTypesTest
error: testEquals_ForeignImpl org.apache.harmony.lang.annotation.AllTypesTest
error: testToString org.apache.harmony.lang.annotation.AllTypesTest
error: testAnnotationType org.apache.harmony.lang.annotation.AllTypesTest
error: testAnnotation_ElementError org.apache.harmony.lang.annotation.AllTypesTest
error: testSerialization org.apache.harmony.lang.annotation.AllTypesTest
Unit Test Error Details:	(64)
                
Test: test_10Class: java.lang.ClassAnnotationsTestjava.lang.NullPointerException
	at java.lang.reflect.Proxy.newProxyInstance(Proxy.java:200)
	at org.apache.harmony.lang.annotation.AnnotationFactory.createAnnotation(AnnotationFactory.java:101)
	at org.apache.harmony.vm.VMGenericsAndAnnotations.getDeclaredAnnotations(VMGenericsAndAnnotations.java)
	at java.lang.reflect.Method$MethodData.getDeclaredAnnotations(Method.java:426)
	at java.lang.reflect.Method.getDeclaredAnnotations(Method.java:71)
	at java.lang.reflect.AccessibleObject.getAnnotations(AccessibleObject.java)
	at java.lang.ClassAnnotationsTest.test_10(ClassAnnotationsTest.java:2027)
	at java.lang.reflect.VMReflection.invokeMethod(VMReflection.java)
	at java.lang.reflect.Method.invoke(Method.java:317)
	at junit.framework.TestCase.runTest(TestCase.java:164)
	at junit.framework.TestCase.runBare(TestCase.java)
	at junit.framework.TestResult$1.protect(TestResult.java)
	at junit.framework.TestResult.runProtected(TestResult.java)
	at junit.framework.TestResult.run(TestResult.java:109)
	at junit.framework.TestCase.run(TestCase.java:120)
	at junit.framework.TestSuite.runTest(TestSuite.java:230)
	at junit.framework.TestSuite.run(TestSuite.java:225)
	at org.apache.tools.ant.taskdefs.optional.junit.JUnitTestRunner.run(JUnitTestRunner.java:297)
	at org.apache.tools.ant.taskdefs.optional.junit.JUnitTestRunner.launch(JUnitTestRunner.java:672)
	at org.apache.tools.ant.taskdefs.optional.junit.JUnitTestRunner.main(JUnitTestRunner.java:546)
Test: test_11Class: java.lang.ClassAnnotationsTestjava.lang.NullPointerException
	at java.lang.reflect.Proxy.newProxyInstance(Proxy.java:200)
	at org.apache.harmony.lang.annotation.AnnotationFactory.createAnnotation(AnnotationFactory.java:101)
	at org.apache.harmony.vm.VMGenericsAndAnnotations.getDeclaredAnnotations(VMGenericsAndAnnotations.java)
	at java.lang.reflect.Method$MethodData.getDeclaredAnnotations(Method.java:426)
	at java.lang.reflect.Method.getDeclaredAnnotations(Method.java:71)
	at java.lang.reflect.AccessibleObject.getAnnotations(AccessibleObject.java)
	at java.lang.ClassAnnotationsTest.test_11(ClassAnnotationsTest.java:2300)
	at java.lang.reflect.VMReflection.invokeMethod(VMReflection.java)
	at java.lang.reflect.Method.invoke(Method.java:317)
	at junit.framework.TestCase.runTest(TestCase.java:164)
	at junit.framework.TestCase.runBare(TestCase.java)
	at junit.framework.TestResult$1.protect(TestResult.java)
	at junit.framework.TestResult.runProtected(TestResult.java)
	at junit.framework.TestResult.run(TestResult.java:109)
	at junit.framework.TestCase.run(TestCase.java:120)
	at junit.framework.TestSuite.runTest(TestSuite.java:230)
	at junit.framework.TestSuite.run(TestSuite.java:225)
	at org.apache.tools.ant.taskdefs.optional.junit.JUnitTestRunner.run(JUnitTestRunner.java:297)
	at org.apache.tools.ant.taskdefs.optional.junit.JUnitTestRunner.launch(JUnitTestRunner.java:672)
	at org.apache.tools.ant.taskdefs.optional.junit.JUnitTestRunner.main(JUnitTestRunner.java:546)
Test: testGetAnnotationClass: java.lang.Package5Testjava.lang.NullPointerException
	at java.lang.reflect.Proxy.newProxyInstance(Proxy.java:200)
	at org.apache.harmony.lang.annotation.AnnotationFactory.createAnnotation(AnnotationFactory.java:101)
	at org.apache.harmony.vm.VMGenericsAndAnnotations.getDeclaredAnnotations(VMGenericsAndAnnotations.java)
	at java.lang.Package.getDeclaredAnnotations(Package.java:56)
	at java.lang.Package.getAnnotations(Package.java:65)
	at java.lang.Package.getAnnotation(Package.java:78)
	at org.apache.harmony.lang.AnnotatedElementTestFrame.testGetAnnotation(AnnotatedElementTestFrame.java)
	at java.lang.reflect.VMReflection.invokeMethod(VMReflection.java)
	at java.lang.reflect.Method.invoke(Method.java:317)
	at junit.framework.TestCase.runTest(TestCase.java:164)
	at junit.framework.TestCase.runBare(TestCase.java)
	at junit.framework.TestResult$1.protect(TestResult.java)
	at junit.framework.TestResult.runProtected(TestResult.java)
	at junit.framework.TestResult.run(TestResult.java:109)
	at junit.framework.TestCase.run(TestCase.java:120)
	at junit.framework.TestSuite.runTest(TestSuite.java:230)
	at junit.framework.TestSuite.run(TestSuite.java:225)
	at org.apache.tools.ant.taskdefs.optional.junit.JUnitTestRunner.run(JUnitTestRunner.java:297)
	at org.apache.tools.ant.taskdefs.optional.junit.JUnitTestRunner.launch(JUnitTestRunner.java:672)
	at org.apache.tools.ant.taskdefs.optional.junit.JUnitTestRunner.main(JUnitTestRunner.java:546)
Test: testGetAnnotation2Class: java.lang.Package5Testjava.lang.NullPointerException
	at java.lang.reflect.Proxy.newProxyInstance(Proxy.java:200)
	at org.apache.harmony.lang.annotation.AnnotationFactory.createAnnotation(AnnotationFactory.java:101)
	at org.apache.harmony.vm.VMGenericsAndAnnotations.getDeclaredAnnotations(VMGenericsAndAnnotations.java)
	at java.lang.Package.getDeclaredAnnotations(Package.java:56)
	at java.lang.Package.getAnnotations(Package.java:65)
	at java.lang.Package.getAnnotation(Package.java:78)
	at org.apache.harmony.lang.AnnotatedElementTestFrame.testGetAnnotation2(AnnotatedElementTestFrame.java)
	at java.lang.reflect.VMReflection.invokeMethod(VMReflection.java)
	at java.lang.reflect.Method.invoke(Method.java:317)
	at junit.framework.TestCase.runTest(TestCase.java:164)
	at junit.framework.TestCase.runBare(TestCase.java)
	at junit.framework.TestResult$1.protect(TestResult.java)
	at junit.framework.TestResult.runProtected(TestResult.java)
	at junit.framework.TestResult.run(TestResult.java:109)
	at junit.framework.TestCase.run(TestCase.java:120)
	at junit.framework.TestSuite.runTest(TestSuite.java:230)
	at junit.framework.TestSuite.run(TestSuite.java:225)
	at org.apache.tools.ant.taskdefs.optional.junit.JUnitTestRunner.run(JUnitTestRunner.java:297)
	at org.apache.tools.ant.taskdefs.optional.junit.JUnitTestRunner.launch(JUnitTestRunner.java:672)
	at org.apache.tools.ant.taskdefs.optional.junit.JUnitTestRunner.main(JUnitTestRunner.java:546)
Test: testGetAnnotation_NegativeClass: java.lang.Package5Testjava.lang.NullPointerException
	at java.lang.reflect.Proxy.newProxyInstance(Proxy.java:200)
	at org.apache.harmony.lang.annotation.AnnotationFactory.createAnnotation(AnnotationFactory.java:101)
	at org.apache.harmony.vm.VMGenericsAndAnnotations.getDeclaredAnnotations(VMGenericsAndAnnotations.java)
	at java.lang.Package.getDeclaredAnnotations(Package.java:56)
	at java.lang.Package.getAnnotations(Package.java:65)
	at java.lang.Package.getAnnotation(Package.java:78)
	at org.apache.harmony.lang.AnnotatedElementTestFrame.testGetAnnotation_Negative(AnnotatedElementTestFrame.java)
	at java.lang.reflect.VMReflection.invokeMethod(VMReflection.java)
	at java.lang.reflect.Method.invoke(Method.java:317)
	at junit.framework.TestCase.runTest(TestCase.java:164)
	at junit.framework.TestCase.runBare(TestCase.java)
	at junit.framework.TestResult$1.protect(TestResult.java)
	at junit.framework.TestResult.runProtected(TestResult.java)
	at junit.framework.TestResult.run(TestResult.java:109)
	at junit.framework.TestCase.run(TestCase.java:120)
	at junit.framework.TestSuite.runTest(TestSuite.java:230)
	at junit.framework.TestSuite.run(TestSuite.java:225)
	at org.apache.tools.ant.taskdefs.optional.junit.JUnitTestRunner.run(JUnitTestRunner.java:297)
	at org.apache.tools.ant.taskdefs.optional.junit.JUnitTestRunner.launch(JUnitTestRunner.java:672)
	at org.apache.tools.ant.taskdefs.optional.junit.JUnitTestRunner.main(JUnitTestRunner.java:546)
Test: testGetDeclaredAnnotationsClass: java.lang.Package5Testjava.lang.NullPointerException
	at java.lang.reflect.Proxy.newProxyInstance(Proxy.java:200)
	at org.apache.harmony.lang.annotation.AnnotationFactory.createAnnotation(AnnotationFactory.java:101)
	at org.apache.harmony.vm.VMGenericsAndAnnotations.getDeclaredAnnotations(VMGenericsAndAnnotations.java)
	at java.lang.Package.getDeclaredAnnotations(Package.java:56)
	at org.apache.harmony.lang.AnnotatedElementTestFrame.testGetDeclaredAnnotations(AnnotatedElementTestFrame.java:162)
	at java.lang.reflect.VMReflection.invokeMethod(VMReflection.java)
	at java.lang.reflect.Method.invoke(Method.java:317)
	at junit.framework.TestCase.runTest(TestCase.java:164)
	at junit.framework.TestCase.runBare(TestCase.java)
	at junit.framework.TestResult$1.protect(TestResult.java)
	at junit.framework.TestResult.runProtected(TestResult.java)
	at junit.framework.TestResult.run(TestResult.java:109)
	at junit.framework.TestCase.run(TestCase.java:120)
	at junit.framework.TestSuite.runTest(TestSuite.java:230)
	at junit.framework.TestSuite.run(TestSuite.java:225)
	at org.apache.tools.ant.taskdefs.optional.junit.JUnitTestRunner.run(JUnitTestRunner.java:297)
	at org.apache.tools.ant.taskdefs.optional.junit.JUnitTestRunner.launch(JUnitTestRunner.java:672)
	at org.apache.tools.ant.taskdefs.optional.junit.JUnitTestRunner.main(JUnitTestRunner.java:546)
Test: testGetDeclaredAnnotations2Class: java.lang.Package5Testjava.lang.NullPointerException
	at java.lang.reflect.Proxy.newProxyInstance(Proxy.java:200)
	at org.apache.harmony.lang.annotation.AnnotationFactory.createAnnotation(AnnotationFactory.java:101)
	at org.apache.harmony.vm.VMGenericsAndAnnotations.getDeclaredAnnotations(VMGenericsAndAnnotations.java)
	at java.lang.Package.getDeclaredAnnotations(Package.java:56)
	at org.apache.harmony.lang.AnnotatedElementTestFrame.testGetDeclaredAnnotations2(AnnotatedElementTestFrame.java:173)
	at java.lang.reflect.VMReflection.invokeMethod(VMReflection.java)
	at java.lang.reflect.Method.invoke(Method.java:317)
	at junit.framework.TestCase.runTest(TestCase.java:164)
	at junit.framework.TestCase.runBare(TestCase.java)
	at junit.framework.TestResult$1.protect(TestResult.java)
	at junit.framework.TestResult.runProtected(TestResult.java)
	at junit.framework.TestResult.run(TestResult.java:109)
	at junit.framework.TestCase.run(TestCase.java:120)
	at junit.framework.TestSuite.runTest(TestSuite.java:230)
	at junit.framework.TestSuite.run(TestSuite.java:225)
	at org.apache.tools.ant.taskdefs.optional.junit.JUnitTestRunner.run(JUnitTestRunner.java:297)
	at org.apache.tools.ant.taskdefs.optional.junit.JUnitTestRunner.launch(JUnitTestRunner.java:672)
	at org.apache.tools.ant.taskdefs.optional.junit.JUnitTestRunner.main(JUnitTestRunner.java:546)
Test: testGetDeclaredAnnotationsImmutableClass: java.lang.Package5Testjava.lang.NullPointerException
	at java.lang.reflect.Proxy.newProxyInstance(Proxy.java:200)
	at org.apache.harmony.lang.annotation.AnnotationFactory.createAnnotation(AnnotationFactory.java:101)
	at org.apache.harmony.vm.VMGenericsAndAnnotations.getDeclaredAnnotations(VMGenericsAndAnnotations.java)
	at java.lang.Package.getDeclaredAnnotations(Package.java:56)
	at org.apache.harmony.lang.AnnotatedElementTestFrame.testGetDeclaredAnnotationsImmutable(AnnotatedElementTestFrame.java:198)
	at java.lang.reflect.VMReflection.invokeMethod(VMReflection.java)
	at java.lang.reflect.Method.invoke(Method.java:317)
	at junit.framework.TestCase.runTest(TestCase.java:164)
	at junit.framework.TestCase.runBare(TestCase.java)
	at junit.framework.TestResult$1.protect(TestResult.java)
	at junit.framework.TestResult.runProtected(TestResult.java)
	at junit.framework.TestResult.run(TestResult.java:109)
	at junit.framework.TestCase.run(TestCase.java:120)
	at junit.framework.TestSuite.runTest(TestSuite.java:230)
	at junit.framework.TestSuite.run(TestSuite.java:225)
	at org.apache.tools.ant.taskdefs.optional.junit.JUnitTestRunner.run(JUnitTestRunner.java:297)
	at org.apache.tools.ant.taskdefs.optional.junit.JUnitTestRunner.launch(JUnitTestRunner.java:672)
	at org.apache.tools.ant.taskdefs.optional.junit.JUnitTestRunner.main(JUnitTestRunner.java:546)
Test: testGetAnnotationsClass: java.lang.Package5Testjava.lang.NullPointerException
	at java.lang.reflect.Proxy.newProxyInstance(Proxy.java:200)
	at org.apache.harmony.lang.annotation.AnnotationFactory.createAnnotation(AnnotationFactory.java:101)
	at org.apache.harmony.vm.VMGenericsAndAnnotations.getDeclaredAnnotations(VMGenericsAndAnnotations.java)
	at java.lang.Package.getDeclaredAnnotations(Package.java:56)
	at java.lang.Package.getAnnotations(Package.java:65)
	at org.apache.harmony.lang.AnnotatedElementTestFrame.testGetAnnotations(AnnotatedElementTestFrame.java:215)
	at java.lang.reflect.VMReflection.invokeMethod(VMReflection.java)
	at java.lang.reflect.Method.invoke(Method.java:317)
	at junit.framework.TestCase.runTest(TestCase.java:164)
	at junit.framework.TestCase.runBare(TestCase.java)
	at junit.framework.TestResult$1.protect(TestResult.java)
	at junit.framework.TestResult.runProtected(TestResult.java)
	at junit.framework.TestResult.run(TestResult.java:109)
	at junit.framework.TestCase.run(TestCase.java:120)
	at junit.framework.TestSuite.runTest(TestSuite.java:230)
	at junit.framework.TestSuite.run(TestSuite.java:225)
	at org.apache.tools.ant.taskdefs.optional.junit.JUnitTestRunner.run(JUnitTestRunner.java:297)
	at org.apache.tools.ant.taskdefs.optional.junit.JUnitTestRunner.launch(JUnitTestRunner.java:672)
	at org.apache.tools.ant.taskdefs.optional.junit.JUnitTestRunner.main(JUnitTestRunner.java:546)
Test: testGetAnnotations2Class: java.lang.Package5Testjava.lang.NullPointerException
	at java.lang.reflect.Proxy.newProxyInstance(Proxy.java:200)
	at org.apache.harmony.lang.annotation.AnnotationFactory.createAnnotation(AnnotationFactory.java:101)
	at org.apache.harmony.vm.VMGenericsAndAnnotations.getDeclaredAnnotations(VMGenericsAndAnnotations.java)
	at java.lang.Package.getDeclaredAnnotations(Package.java:56)
	at java.lang.Package.getAnnotations(Package.java:65)
	at org.apache.harmony.lang.AnnotatedElementTestFrame.testGetAnnotations2(AnnotatedElementTestFrame.java:226)
	at java.lang.reflect.VMReflection.invokeMethod(VMReflection.java)
	at java.lang.reflect.Method.invoke(Method.java:317)
	at junit.framework.TestCase.runTest(TestCase.java:164)
	at junit.framework.TestCase.runBare(TestCase.java)
	at junit.framework.TestResult$1.protect(TestResult.java)
	at junit.framework.TestResult.runProtected(TestResult.java)
	at junit.framework.TestResult.run(TestResult.java:109)
	at junit.framework.TestCase.run(TestCase.java:120)
	at junit.framework.TestSuite.runTest(TestSuite.java:230)
	at junit.framework.TestSuite.run(TestSuite.java:225)
	at org.apache.tools.ant.taskdefs.optional.junit.JUnitTestRunner.run(JUnitTestRunner.java:297)
	at org.apache.tools.ant.taskdefs.optional.junit.JUnitTestRunner.launch(JUnitTestRunner.java:672)
	at org.apache.tools.ant.taskdefs.optional.junit.JUnitTestRunner.main(JUnitTestRunner.java:546)
Test: testGetAnnotations5Class: java.lang.Package5Testjava.lang.NullPointerException
	at java.lang.reflect.Proxy.newProxyInstance(Proxy.java:200)
	at org.apache.harmony.lang.annotation.AnnotationFactory.createAnnotation(AnnotationFactory.java:101)
	at org.apache.harmony.vm.VMGenericsAndAnnotations.getDeclaredAnnotations(VMGenericsAndAnnotations.java)
	at java.lang.Package.getDeclaredAnnotations(Package.java:56)
	at java.lang.Package.getAnnotations(Package.java:65)
	at org.apache.harmony.lang.AnnotatedElementTestFrame.testGetAnnotations5(AnnotatedElementTestFrame.java:264)
	at java.lang.reflect.VMReflection.invokeMethod(VMReflection.java)
	at java.lang.reflect.Method.invoke(Method.java:317)
	at junit.framework.TestCase.runTest(TestCase.java:164)
	at junit.framework.TestCase.runBare(TestCase.java)
	at junit.framework.TestResult$1.protect(TestResult.java)
	at junit.framework.TestResult.runProtected(TestResult.java)
	at junit.framework.TestResult.run(TestResult.java:109)
	at junit.framework.TestCase.run(TestCase.java:120)
	at junit.framework.TestSuite.runTest(TestSuite.java:230)
	at junit.framework.TestSuite.run(TestSuite.java:225)
	at org.apache.tools.ant.taskdefs.optional.junit.JUnitTestRunner.run(JUnitTestRunner.java:297)
	at org.apache.tools.ant.taskdefs.optional.junit.JUnitTestRunner.launch(JUnitTestRunner.java:672)
	at org.apache.tools.ant.taskdefs.optional.junit.JUnitTestRunner.main(JUnitTestRunner.java:546)
Test: testGetAnnotationsImmutableClass: java.lang.Package5Testjava.lang.NullPointerException
	at java.lang.reflect.Proxy.newProxyInstance(Proxy.java:200)
	at org.apache.harmony.lang.annotation.AnnotationFactory.createAnnotation(AnnotationFactory.java:101)
	at org.apache.harmony.vm.VMGenericsAndAnnotations.getDeclaredAnnotations(VMGenericsAndAnnotations.java)
	at java.lang.Package.getDeclaredAnnotations(Package.java:56)
	at java.lang.Package.getAnnotations(Package.java:65)
	at org.apache.harmony.lang.AnnotatedElementTestFrame.testGetAnnotationsImmutable(AnnotatedElementTestFrame.java:293)
	at java.lang.reflect.VMReflection.invokeMethod(VMReflection.java)
	at java.lang.reflect.Method.invoke(Method.java:317)
	at junit.framework.TestCase.runTest(TestCase.java:164)
	at junit.framework.TestCase.runBare(TestCase.java)
	at junit.framework.TestResult$1.protect(TestResult.java)
	at junit.framework.TestResult.runProtected(TestResult.java)
	at junit.framework.TestResult.run(TestResult.java:109)
	at junit.framework.TestCase.run(TestCase.java:120)
	at junit.framework.TestSuite.runTest(TestSuite.java:230)
	at junit.framework.TestSuite.run(TestSuite.java:225)
	at org.apache.tools.ant.taskdefs.optional.junit.JUnitTestRunner.run(JUnitTestRunner.java:297)
	at org.apache.tools.ant.taskdefs.optional.junit.JUnitTestRunner.launch(JUnitTestRunner.java:672)
	at org.apache.tools.ant.taskdefs.optional.junit.JUnitTestRunner.main(JUnitTestRunner.java:546)
Test: testIsAnnotationPresentClass: java.lang.Package5Testjava.lang.NullPointerException
	at java.lang.reflect.Proxy.newProxyInstance(Proxy.java:200)
	at org.apache.harmony.lang.annotation.AnnotationFactory.createAnnotation(AnnotationFactory.java:101)
	at org.apache.harmony.vm.VMGenericsAndAnnotations.getDeclaredAnnotations(VMGenericsAndAnnotations.java)
	at java.lang.Package.getDeclaredAnnotations(Package.java:56)
	at java.lang.Package.getAnnotations(Package.java:65)
	at java.lang.Package.getAnnotation(Package.java:78)
	at java.lang.Package.isAnnotationPresent(Package.java:93)
	at org.apache.harmony.lang.AnnotatedElementTestFrame.testIsAnnotationPresent(AnnotatedElementTestFrame.java:310)
	at java.lang.reflect.VMReflection.invokeMethod(VMReflection.java)
	at java.lang.reflect.Method.invoke(Method.java:317)
	at junit.framework.TestCase.runTest(TestCase.java:164)
	at junit.framework.TestCase.runBare(TestCase.java)
	at junit.framework.TestResult$1.protect(TestResult.java)
	at junit.framework.TestResult.runProtected(TestResult.java)
	at junit.framework.TestResult.run(TestResult.java:109)
	at junit.framework.TestCase.run(TestCase.java:120)
	at junit.framework.TestSuite.runTest(TestSuite.java:230)
	at junit.framework.TestSuite.run(TestSuite.java:225)
	at org.apache.tools.ant.taskdefs.optional.junit.JUnitTestRunner.run(JUnitTestRunner.java:297)
	at org.apache.tools.ant.taskdefs.optional.junit.JUnitTestRunner.launch(JUnitTestRunner.java:672)
	at org.apache.tools.ant.taskdefs.optional.junit.JUnitTestRunner.main(JUnitTestRunner.java:546)
Test: testIsAnnotationPresent_NegativeClass: java.lang.Package5Testjava.lang.NullPointerException
	at java.lang.reflect.Proxy.newProxyInstance(Proxy.java:200)
	at org.apache.harmony.lang.annotation.AnnotationFactory.createAnnotation(AnnotationFactory.java:101)
	at org.apache.harmony.vm.VMGenericsAndAnnotations.getDeclaredAnnotations(VMGenericsAndAnnotations.java)
	at java.lang.Package.getDeclaredAnnotations(Package.java:56)
	at java.lang.Package.getAnnotations(Package.java:65)
	at java.lang.Package.getAnnotation(Package.java:78)
	at java.lang.Package.isAnnotationPresent(Package.java:93)
	at org.apache.harmony.lang.AnnotatedElementTestFrame.testIsAnnotationPresent_Negative(AnnotatedElementTestFrame.java:320)
	at java.lang.reflect.VMReflection.invokeMethod(VMReflection.java)
	at java.lang.reflect.Method.invoke(Method.java:317)
	at junit.framework.TestCase.runTest(TestCase.java:164)
	at junit.framework.TestCase.runBare(TestCase.java)
	at junit.framework.TestResult$1.protect(TestResult.java)
	at junit.framework.TestResult.runProtected(TestResult.java)
	at junit.framework.TestResult.run(TestResult.java:109)
	at junit.framework.TestCase.run(TestCase.java:120)
	at junit.framework.TestSuite.runTest(TestSuite.java:230)
	at junit.framework.TestSuite.run(TestSuite.java:225)
	at org.apache.tools.ant.taskdefs.optional.junit.JUnitTestRunner.run(JUnitTestRunner.java:297)
	at org.apache.tools.ant.taskdefs.optional.junit.JUnitTestRunner.launch(JUnitTestRunner.java:672)
	at org.apache.tools.ant.taskdefs.optional.junit.JUnitTestRunner.main(JUnitTestRunner.java:546)
Test: testGetParameterAnnotations2Class: java.lang.reflect.Ctor5Testjava.lang.reflect.InvocationTargetException
	at java.lang.reflect.VMReflection.invokeMethod(VMReflection.java)
	at java.lang.reflect.Method.invoke(Method.java:317)
	at java.lang.reflect.Method5Test.getParamAnnotations(Method5Test.java:81)
	at java.lang.reflect.Method5Test.testGetParameterAnnotations2(Method5Test.java:113)
	at java.lang.reflect.VMReflection.invokeMethod(VMReflection.java)
	at java.lang.reflect.Method.invoke(Method.java:317)
	at junit.framework.TestCase.runTest(TestCase.java:164)
	at junit.framework.TestCase.runBare(TestCase.java)
	at junit.framework.TestResult$1.protect(TestResult.java)
	at junit.framework.TestResult.runProtected(TestResult.java)
	at junit.framework.TestResult.run(TestResult.java:109)
	at junit.framework.TestCase.run(TestCase.java:120)
	at junit.framework.TestSuite.runTest(TestSuite.java:230)
	at junit.framework.TestSuite.run(TestSuite.java:225)
	at org.apache.tools.ant.taskdefs.optional.junit.JUnitTestRunner.run(JUnitTestRunner.java:297)
	at org.apache.tools.ant.taskdefs.optional.junit.JUnitTestRunner.launch(JUnitTestRunner.java:672)
	at org.apache.tools.ant.taskdefs.optional.junit.JUnitTestRunner.main(JUnitTestRunner.java:546)
Caused by: java.lang.NullPointerException
	at java.lang.reflect.Proxy.newProxyInstance(Proxy.java:200)
	at org.apache.harmony.lang.annotation.AnnotationFactory.createAnnotation(AnnotationFactory.java:101)
	at org.apache.harmony.vm.VMGenericsAndAnnotations.getParameterAnnotations(VMGenericsAndAnnotations.java)
	at java.lang.reflect.Constructor$ConstructorData.getParameterAnnotations(Constructor.java:395)
	at java.lang.reflect.Constructor.getParameterAnnotations(Constructor.java:50)
	at java.lang.reflect.VMReflection.invokeMethod(VMReflection.java)
	... 16 more
Test: testGetParameterAnnotations3Class: java.lang.reflect.Ctor5Testjava.lang.reflect.InvocationTargetException
	at java.lang.reflect.VMReflection.invokeMethod(VMReflection.java)
	at java.lang.reflect.Method.invoke(Method.java:317)
	at java.lang.reflect.Method5Test.getParamAnnotations(Method5Test.java:81)
	at java.lang.reflect.Method5Test.testGetParameterAnnotations3(Method5Test.java:140)
	at java.lang.reflect.VMReflection.invokeMethod(VMReflection.java)
	at java.lang.reflect.Method.invoke(Method.java:317)
	at junit.framework.TestCase.runTest(TestCase.java:164)
	at junit.framework.TestCase.runBare(TestCase.java)
	at junit.framework.TestResult$1.protect(TestResult.java)
	at junit.framework.TestResult.runProtected(TestResult.java)
	at junit.framework.TestResult.run(TestResult.java:109)
	at junit.framework.TestCase.run(TestCase.java:120)
	at junit.framework.TestSuite.runTest(TestSuite.java:230)
	at junit.framework.TestSuite.run(TestSuite.java:225)
	at org.apache.tools.ant.taskdefs.optional.junit.JUnitTestRunner.run(JUnitTestRunner.java:297)
	at org.apache.tools.ant.taskdefs.optional.junit.JUnitTestRunner.launch(JUnitTestRunner.java:672)
	at org.apache.tools.ant.taskdefs.optional.junit.JUnitTestRunner.main(JUnitTestRunner.java:546)
Caused by: java.lang.NullPointerException
	at java.lang.reflect.Proxy.newProxyInstance(Proxy.java:200)
	at org.apache.harmony.lang.annotation.AnnotationFactory.createAnnotation(AnnotationFactory.java:101)
	at org.apache.harmony.vm.VMGenericsAndAnnotations.getParameterAnnotations(VMGenericsAndAnnotations.java)
	at java.lang.reflect.Constructor$ConstructorData.getParameterAnnotations(Constructor.java:395)
	at java.lang.reflect.Constructor.getParameterAnnotations(Constructor.java:50)
	at java.lang.reflect.VMReflection.invokeMethod(VMReflection.java)
	... 16 more
Test: testGetParameterAnnotationsImmutableClass: java.lang.reflect.Ctor5Testjava.lang.reflect.InvocationTargetException
	at java.lang.reflect.VMReflection.invokeMethod(VMReflection.java)
	at java.lang.reflect.Method.invoke(Method.java:317)
	at java.lang.reflect.Method5Test.getParamAnnotations(Method5Test.java:81)
	at java.lang.reflect.Method5Test.testGetParameterAnnotationsImmutable(Method5Test.java:157)
	at java.lang.reflect.VMReflection.invokeMethod(VMReflection.java)
	at java.lang.reflect.Method.invoke(Method.java:317)
	at junit.framework.TestCase.runTest(TestCase.java:164)
	at junit.framework.TestCase.runBare(TestCase.java)
	at junit.framework.TestResult$1.protect(TestResult.java)
	at junit.framework.TestResult.runProtected(TestResult.java)
	at junit.framework.TestResult.run(TestResult.java:109)
	at junit.framework.TestCase.run(TestCase.java:120)
	at junit.framework.TestSuite.runTest(TestSuite.java:230)
	at junit.framework.TestSuite.run(TestSuite.java:225)
	at org.apache.tools.ant.taskdefs.optional.junit.JUnitTestRunner.run(JUnitTestRunner.java:297)
	at org.apache.tools.ant.taskdefs.optional.junit.JUnitTestRunner.launch(JUnitTestRunner.java:672)
	at org.apache.tools.ant.taskdefs.optional.junit.JUnitTestRunner.main(JUnitTestRunner.java:546)
Caused by: java.lang.NullPointerException
	at java.lang.reflect.Proxy.newProxyInstance(Proxy.java:200)
	at org.apache.harmony.lang.annotation.AnnotationFactory.createAnnotation(AnnotationFactory.java:101)
	at org.apache.harmony.vm.VMGenericsAndAnnotations.getParameterAnnotations(VMGenericsAndAnnotations.java)
	at java.lang.reflect.Constructor$ConstructorData.getParameterAnnotations(Constructor.java:395)
	at java.lang.reflect.Constructor.getParameterAnnotations(Constructor.java:50)
	at java.lang.reflect.VMReflection.invokeMethod(VMReflection.java)
	... 16 more
Test: testGetAnnotationClass: java.lang.reflect.Ctor5Testjava.lang.NullPointerException
	at java.lang.reflect.Proxy.newProxyInstance(Proxy.java:200)
	at org.apache.harmony.lang.annotation.AnnotationFactory.createAnnotation(AnnotationFactory.java:101)
	at org.apache.harmony.vm.VMGenericsAndAnnotations.getDeclaredAnnotations(VMGenericsAndAnnotations.java)
	at java.lang.reflect.Constructor$ConstructorData.getDeclaredAnnotations(Constructor.java:377)
	at java.lang.reflect.Constructor.getAnnotation(Constructor.java:77)
	at org.apache.harmony.lang.AnnotatedElementTestFrame.testGetAnnotation(AnnotatedElementTestFrame.java)
	at java.lang.reflect.VMReflection.invokeMethod(VMReflection.java)
	at java.lang.reflect.Method.invoke(Method.java:317)
	at junit.framework.TestCase.runTest(TestCase.java:164)
	at junit.framework.TestCase.runBare(TestCase.java)
	at junit.framework.TestResult$1.protect(TestResult.java)
	at junit.framework.TestResult.runProtected(TestResult.java)
	at junit.framework.TestResult.run(TestResult.java:109)
	at junit.framework.TestCase.run(TestCase.java:120)
	at junit.framework.TestSuite.runTest(TestSuite.java:230)
	at junit.framework.TestSuite.run(TestSuite.java:225)
	at org.apache.tools.ant.taskdefs.optional.junit.JUnitTestRunner.run(JUnitTestRunner.java:297)
	at org.apache.tools.ant.taskdefs.optional.junit.JUnitTestRunner.launch(JUnitTestRunner.java:672)
	at org.apache.tools.ant.taskdefs.optional.junit.JUnitTestRunner.main(JUnitTestRunner.java:546)
Test: testGetAnnotation2Class: java.lang.reflect.Ctor5Testjava.lang.NullPointerException
	at java.lang.reflect.Proxy.newProxyInstance(Proxy.java:200)
	at org.apache.harmony.lang.annotation.AnnotationFactory.createAnnotation(AnnotationFactory.java:101)
	at org.apache.harmony.vm.VMGenericsAndAnnotations.getDeclaredAnnotations(VMGenericsAndAnnotations.java)
	at java.lang.reflect.Constructor$ConstructorData.getDeclaredAnnotations(Constructor.java:377)
	at java.lang.reflect.Constructor.getAnnotation(Constructor.java:77)
	at org.apache.harmony.lang.AnnotatedElementTestFrame.testGetAnnotation2(AnnotatedElementTestFrame.java)
	at java.lang.reflect.VMReflection.invokeMethod(VMReflection.java)
	at java.lang.reflect.Method.invoke(Method.java:317)
	at junit.framework.TestCase.runTest(TestCase.java:164)
	at junit.framework.TestCase.runBare(TestCase.java)
	at junit.framework.TestResult$1.protect(TestResult.java)
	at junit.framework.TestResult.runProtected(TestResult.java)
	at junit.framework.TestResult.run(TestResult.java:109)
	at junit.framework.TestCase.run(TestCase.java:120)
	at junit.framework.TestSuite.runTest(TestSuite.java:230)
	at junit.framework.TestSuite.run(TestSuite.java:225)
	at org.apache.tools.ant.taskdefs.optional.junit.JUnitTestRunner.run(JUnitTestRunner.java:297)
	at org.apache.tools.ant.taskdefs.optional.junit.JUnitTestRunner.launch(JUnitTestRunner.java:672)
	at org.apache.tools.ant.taskdefs.optional.junit.JUnitTestRunner.main(JUnitTestRunner.java:546)
Test: testGetAnnotation_NegativeClass: java.lang.reflect.Ctor5Testjava.lang.NullPointerException
	at java.lang.reflect.Proxy.newProxyInstance(Proxy.java:200)
	at org.apache.harmony.lang.annotation.AnnotationFactory.createAnnotation(AnnotationFactory.java:101)
	at org.apache.harmony.vm.VMGenericsAndAnnotations.getDeclaredAnnotations(VMGenericsAndAnnotations.java)
	at java.lang.reflect.Constructor$ConstructorData.getDeclaredAnnotations(Constructor.java:377)
	at java.lang.reflect.Constructor.getAnnotation(Constructor.java:77)
	at org.apache.harmony.lang.AnnotatedElementTestFrame.testGetAnnotation_Negative(AnnotatedElementTestFrame.java)
	at java.lang.reflect.VMReflection.invokeMethod(VMReflection.java)
	at java.lang.reflect.Method.invoke(Method.java:317)
	at junit.framework.TestCase.runTest(TestCase.java:164)
	at junit.framework.TestCase.runBare(TestCase.java)
	at junit.framework.TestResult$1.protect(TestResult.java)
	at junit.framework.TestResult.runProtected(TestResult.java)
	at junit.framework.TestResult.run(TestResult.java:109)
	at junit.framework.TestCase.run(TestCase.java:120)
	at junit.framework.TestSuite.runTest(TestSuite.java:230)
	at junit.framework.TestSuite.run(TestSuite.java:225)
	at org.apache.tools.ant.taskdefs.optional.junit.JUnitTestRunner.run(JUnitTestRunner.java:297)
	at org.apache.tools.ant.taskdefs.optional.junit.JUnitTestRunner.launch(JUnitTestRunner.java:672)
	at org.apache.tools.ant.taskdefs.optional.junit.JUnitTestRunner.main(JUnitTestRunner.java:546)
Test: testGetDeclaredAnnotationsClass: java.lang.reflect.Ctor5Testjava.lang.NullPointerException
	at java.lang.reflect.Proxy.newProxyInstance(Proxy.java:200)
	at org.apache.harmony.lang.annotation.AnnotationFactory.createAnnotation(AnnotationFactory.java:101)
	at org.apache.harmony.vm.VMGenericsAndAnnotations.getDeclaredAnnotations(VMGenericsAndAnnotations.java)
	at java.lang.reflect.Constructor$ConstructorData.getDeclaredAnnotations(Constructor.java:377)
	at java.lang.reflect.Constructor.getDeclaredAnnotations(Constructor.java:63)
	at org.apache.harmony.lang.AnnotatedElementTestFrame.testGetDeclaredAnnotations(AnnotatedElementTestFrame.java:162)
	at java.lang.reflect.VMReflection.invokeMethod(VMReflection.java)
	at java.lang.reflect.Method.invoke(Method.java:317)
	at junit.framework.TestCase.runTest(TestCase.java:164)
	at junit.framework.TestCase.runBare(TestCase.java)
	at junit.framework.TestResult$1.protect(TestResult.java)
	at junit.framework.TestResult.runProtected(TestResult.java)
	at junit.framework.TestResult.run(TestResult.java:109)
	at junit.framework.TestCase.run(TestCase.java:120)
	at junit.framework.TestSuite.runTest(TestSuite.java:230)
	at junit.framework.TestSuite.run(TestSuite.java:225)
	at org.apache.tools.ant.taskdefs.optional.junit.JUnitTestRunner.run(JUnitTestRunner.java:297)
	at org.apache.tools.ant.taskdefs.optional.junit.JUnitTestRunner.launch(JUnitTestRunner.java:672)
	at org.apache.tools.ant.taskdefs.optional.junit.JUnitTestRunner.main(JUnitTestRunner.java:546)
Test: testGetDeclaredAnnotations2Class: java.lang.reflect.Ctor5Testjava.lang.NullPointerException
	at java.lang.reflect.Proxy.newProxyInstance(Proxy.java:200)
	at org.apache.harmony.lang.annotation.AnnotationFactory.createAnnotation(AnnotationFactory.java:101)
	at org.apache.harmony.vm.VMGenericsAndAnnotations.getDeclaredAnnotations(VMGenericsAndAnnotations.java)
	at java.lang.reflect.Constructor$ConstructorData.getDeclaredAnnotations(Constructor.java:377)
	at java.lang.reflect.Constructor.getDeclaredAnnotations(Constructor.java:63)
	at org.apache.harmony.lang.AnnotatedElementTestFrame.testGetDeclaredAnnotations2(AnnotatedElementTestFrame.java:173)
	at java.lang.reflect.VMReflection.invokeMethod(VMReflection.java)
	at java.lang.reflect.Method.invoke(Method.java:317)
	at junit.framework.TestCase.runTest(TestCase.java:164)
	at junit.framework.TestCase.runBare(TestCase.java)
	at junit.framework.TestResult$1.protect(TestResult.java)
	at junit.framework.TestResult.runProtected(TestResult.java)
	at junit.framework.TestResult.run(TestResult.java:109)
	at junit.framework.TestCase.run(TestCase.java:120)
	at junit.framework.TestSuite.runTest(TestSuite.java:230)
	at junit.framework.TestSuite.run(TestSuite.java:225)
	at org.apache.tools.ant.taskdefs.optional.junit.JUnitTestRunner.run(JUnitTestRunner.java:297)
	at org.apache.tools.ant.taskdefs.optional.junit.JUnitTestRunner.launch(JUnitTestRunner.java:672)
	at org.apache.tools.ant.taskdefs.optional.junit.JUnitTestRunner.main(JUnitTestRunner.java:546)
Test: testGetDeclaredAnnotationsImmutableClass: java.lang.reflect.Ctor5Testjava.lang.NullPointerException
	at java.lang.reflect.Proxy.newProxyInstance(Proxy.java:200)
	at org.apache.harmony.lang.annotation.AnnotationFactory.createAnnotation(AnnotationFactory.java:101)
	at org.apache.harmony.vm.VMGenericsAndAnnotations.getDeclaredAnnotations(VMGenericsAndAnnotations.java)
	at java.lang.reflect.Constructor$ConstructorData.getDeclaredAnnotations(Constructor.java:377)
	at java.lang.reflect.Constructor.getDeclaredAnnotations(Constructor.java:63)
	at org.apache.harmony.lang.AnnotatedElementTestFrame.testGetDeclaredAnnotationsImmutable(AnnotatedElementTestFrame.java:198)
	at java.lang.reflect.VMReflection.invokeMethod(VMReflection.java)
	at java.lang.reflect.Method.invoke(Method.java:317)
	at junit.framework.TestCase.runTest(TestCase.java:164)
	at junit.framework.TestCase.runBare(TestCase.java)
	at junit.framework.TestResult$1.protect(TestResult.java)
	at junit.framework.TestResult.runProtected(TestResult.java)
	at junit.framework.TestResult.run(TestResult.java:109)
	at junit.framework.TestCase.run(TestCase.java:120)
	at junit.framework.TestSuite.runTest(TestSuite.java:230)
	at junit.framework.TestSuite.run(TestSuite.java:225)
	at org.apache.tools.ant.taskdefs.optional.junit.JUnitTestRunner.run(JUnitTestRunner.java:297)
	at org.apache.tools.ant.taskdefs.optional.junit.JUnitTestRunner.launch(JUnitTestRunner.java:672)
	at org.apache.tools.ant.taskdefs.optional.junit.JUnitTestRunner.main(JUnitTestRunner.java:546)
Test: testGetAnnotationsClass: java.lang.reflect.Ctor5Testjava.lang.NullPointerException
	at java.lang.reflect.Proxy.newProxyInstance(Proxy.java:200)
	at org.apache.harmony.lang.annotation.AnnotationFactory.createAnnotation(AnnotationFactory.java:101)
	at org.apache.harmony.vm.VMGenericsAndAnnotations.getDeclaredAnnotations(VMGenericsAndAnnotations.java)
	at java.lang.reflect.Constructor$ConstructorData.getDeclaredAnnotations(Constructor.java:377)
	at java.lang.reflect.Constructor.getDeclaredAnnotations(Constructor.java:63)
	at java.lang.reflect.AccessibleObject.getAnnotations(AccessibleObject.java)
	at org.apache.harmony.lang.AnnotatedElementTestFrame.testGetAnnotations(AnnotatedElementTestFrame.java:215)
	at java.lang.reflect.VMReflection.invokeMethod(VMReflection.java)
	at java.lang.reflect.Method.invoke(Method.java:317)
	at junit.framework.TestCase.runTest(TestCase.java:164)
	at junit.framework.TestCase.runBare(TestCase.java)
	at junit.framework.TestResult$1.protect(TestResult.java)
	at junit.framework.TestResult.runProtected(TestResult.java)
	at junit.framework.TestResult.run(TestResult.java:109)
	at junit.framework.TestCase.run(TestCase.java:120)
	at junit.framework.TestSuite.runTest(TestSuite.java:230)
	at junit.framework.TestSuite.run(TestSuite.java:225)
	at org.apache.tools.ant.taskdefs.optional.junit.JUnitTestRunner.run(JUnitTestRunner.java:297)
	at org.apache.tools.ant.taskdefs.optional.junit.JUnitTestRunner.launch(JUnitTestRunner.java:672)
	at org.apache.tools.ant.taskdefs.optional.junit.JUnitTestRunner.main(JUnitTestRunner.java:546)
Test: testGetAnnotations2Class: java.lang.reflect.Ctor5Testjava.lang.NullPointerException
	at java.lang.reflect.Proxy.newProxyInstance(Proxy.java:200)
	at org.apache.harmony.lang.annotation.AnnotationFactory.createAnnotation(AnnotationFactory.java:101)
	at org.apache.harmony.vm.VMGenericsAndAnnotations.getDeclaredAnnotations(VMGenericsAndAnnotations.java)
	at java.lang.reflect.Constructor$ConstructorData.getDeclaredAnnotations(Constructor.java:377)
	at java.lang.reflect.Constructor.getDeclaredAnnotations(Constructor.java:63)
	at java.lang.reflect.AccessibleObject.getAnnotations(AccessibleObject.java)
	at org.apache.harmony.lang.AnnotatedElementTestFrame.testGetAnnotations2(AnnotatedElementTestFrame.java:226)
	at java.lang.reflect.VMReflection.invokeMethod(VMReflection.java)
	at java.lang.reflect.Method.invoke(Method.java:317)
	at junit.framework.TestCase.runTest(TestCase.java:164)
	at junit.framework.TestCase.runBare(TestCase.java)
	at junit.framework.TestResult$1.protect(TestResult.java)
	at junit.framework.TestResult.runProtected(TestResult.java)
	at junit.framework.TestResult.run(TestResult.java:109)
	at junit.framework.TestCase.run(TestCase.java:120)
	at junit.framework.TestSuite.runTest(TestSuite.java:230)
	at junit.framework.TestSuite.run(TestSuite.java:225)
	at org.apache.tools.ant.taskdefs.optional.junit.JUnitTestRunner.run(JUnitTestRunner.java:297)
	at org.apache.tools.ant.taskdefs.optional.junit.JUnitTestRunner.launch(JUnitTestRunner.java:672)
	at org.apache.tools.ant.taskdefs.optional.junit.JUnitTestRunner.main(JUnitTestRunner.java:546)
Test: testGetAnnotations5Class: java.lang.reflect.Ctor5Testjava.lang.NullPointerException
	at java.lang.reflect.Proxy.newProxyInstance(Proxy.java:200)
	at org.apache.harmony.lang.annotation.AnnotationFactory.createAnnotation(AnnotationFactory.java:101)
	at org.apache.harmony.vm.VMGenericsAndAnnotations.getDeclaredAnnotations(VMGenericsAndAnnotations.java)
	at java.lang.reflect.Constructor$ConstructorData.getDeclaredAnnotations(Constructor.java:377)
	at java.lang.reflect.Constructor.getDeclaredAnnotations(Constructor.java:63)
	at java.lang.reflect.AccessibleObject.getAnnotations(AccessibleObject.java)
	at org.apache.harmony.lang.AnnotatedElementTestFrame.testGetAnnotations5(AnnotatedElementTestFrame.java:264)
	at java.lang.reflect.VMReflection.invokeMethod(VMReflection.java)
	at java.lang.reflect.Method.invoke(Method.java:317)
	at junit.framework.TestCase.runTest(TestCase.java:164)
	at junit.framework.TestCase.runBare(TestCase.java)
	at junit.framework.TestResult$1.protect(TestResult.java)
	at junit.framework.TestResult.runProtected(TestResult.java)
	at junit.framework.TestResult.run(TestResult.java:109)
	at junit.framework.TestCase.run(TestCase.java:120)
	at junit.framework.TestSuite.runTest(TestSuite.java:230)
	at junit.framework.TestSuite.run(TestSuite.java:225)
	at org.apache.tools.ant.taskdefs.optional.junit.JUnitTestRunner.run(JUnitTestRunner.java:297)
	at org.apache.tools.ant.taskdefs.optional.junit.JUnitTestRunner.launch(JUnitTestRunner.java:672)
	at org.apache.tools.ant.taskdefs.optional.junit.JUnitTestRunner.main(JUnitTestRunner.java:546)
Test: testGetAnnotationsImmutableClass: java.lang.reflect.Ctor5Testjava.lang.NullPointerException
	at java.lang.reflect.Proxy.newProxyInstance(Proxy.java:200)
	at org.apache.harmony.lang.annotation.AnnotationFactory.createAnnotation(AnnotationFactory.java:101)
	at org.apache.harmony.vm.VMGenericsAndAnnotations.getDeclaredAnnotations(VMGenericsAndAnnotations.java)
	at java.lang.reflect.Constructor$ConstructorData.getDeclaredAnnotations(Constructor.java:377)
	at java.lang.reflect.Constructor.getDeclaredAnnotations(Constructor.java:63)
	at java.lang.reflect.AccessibleObject.getAnnotations(AccessibleObject.java)
	at org.apache.harmony.lang.AnnotatedElementTestFrame.testGetAnnotationsImmutable(AnnotatedElementTestFrame.java:293)
	at java.lang.reflect.VMReflection.invokeMethod(VMReflection.java)
	at java.lang.reflect.Method.invoke(Method.java:317)
	at junit.framework.TestCase.runTest(TestCase.java:164)
	at junit.framework.TestCase.runBare(TestCase.java)
	at junit.framework.TestResult$1.protect(TestResult.java)
	at junit.framework.TestResult.runProtected(TestResult.java)
	at junit.framework.TestResult.run(TestResult.java:109)
	at junit.framework.TestCase.run(TestCase.java:120)
	at junit.framework.TestSuite.runTest(TestSuite.java:230)
	at junit.framework.TestSuite.run(TestSuite.java:225)
	at org.apache.tools.ant.taskdefs.optional.junit.JUnitTestRunner.run(JUnitTestRunner.java:297)
	at org.apache.tools.ant.taskdefs.optional.junit.JUnitTestRunner.launch(JUnitTestRunner.java:672)
	at org.apache.tools.ant.taskdefs.optional.junit.JUnitTestRunner.main(JUnitTestRunner.java:546)
Test: testIsAnnotationPresentClass: java.lang.reflect.Ctor5Testjava.lang.NullPointerException
	at java.lang.reflect.Proxy.newProxyInstance(Proxy.java:200)
	at org.apache.harmony.lang.annotation.AnnotationFactory.createAnnotation(AnnotationFactory.java:101)
	at org.apache.harmony.vm.VMGenericsAndAnnotations.getDeclaredAnnotations(VMGenericsAndAnnotations.java)
	at java.lang.reflect.Constructor$ConstructorData.getDeclaredAnnotations(Constructor.java:377)
	at java.lang.reflect.Constructor.getAnnotation(Constructor.java:77)
	at java.lang.reflect.AccessibleObject.isAnnotationPresent(AccessibleObject.java)
	at org.apache.harmony.lang.AnnotatedElementTestFrame.testIsAnnotationPresent(AnnotatedElementTestFrame.java:310)
	at java.lang.reflect.VMReflection.invokeMethod(VMReflection.java)
	at java.lang.reflect.Method.invoke(Method.java:317)
	at junit.framework.TestCase.runTest(TestCase.java:164)
	at junit.framework.TestCase.runBare(TestCase.java)
	at junit.framework.TestResult$1.protect(TestResult.java)
	at junit.framework.TestResult.runProtected(TestResult.java)
	at junit.framework.TestResult.run(TestResult.java:109)
	at junit.framework.TestCase.run(TestCase.java:120)
	at junit.framework.TestSuite.runTest(TestSuite.java:230)
	at junit.framework.TestSuite.run(TestSuite.java:225)
	at org.apache.tools.ant.taskdefs.optional.junit.JUnitTestRunner.run(JUnitTestRunner.java:297)
	at org.apache.tools.ant.taskdefs.optional.junit.JUnitTestRunner.launch(JUnitTestRunner.java:672)
	at org.apache.tools.ant.taskdefs.optional.junit.JUnitTestRunner.main(JUnitTestRunner.java:546)
Test: testIsAnnotationPresent_NegativeClass: java.lang.reflect.Ctor5Testjava.lang.NullPointerException
	at java.lang.reflect.Proxy.newProxyInstance(Proxy.java:200)
	at org.apache.harmony.lang.annotation.AnnotationFactory.createAnnotation(AnnotationFactory.java:101)
	at org.apache.harmony.vm.VMGenericsAndAnnotations.getDeclaredAnnotations(VMGenericsAndAnnotations.java)
	at java.lang.reflect.Constructor$ConstructorData.getDeclaredAnnotations(Constructor.java:377)
	at java.lang.reflect.Constructor.getAnnotation(Constructor.java:77)
	at java.lang.reflect.AccessibleObject.isAnnotationPresent(AccessibleObject.java)
	at org.apache.harmony.lang.AnnotatedElementTestFrame.testIsAnnotationPresent_Negative(AnnotatedElementTestFrame.java:320)
	at java.lang.reflect.VMReflection.invokeMethod(VMReflection.java)
	at java.lang.reflect.Method.invoke(Method.java:317)
	at junit.framework.TestCase.runTest(TestCase.java:164)
	at junit.framework.TestCase.runBare(TestCase.java)
	at junit.framework.TestResult$1.protect(TestResult.java)
	at junit.framework.TestResult.runProtected(TestResult.java)
	at junit.framework.TestResult.run(TestResult.java:109)
	at junit.framework.TestCase.run(TestCase.java:120)
	at junit.framework.TestSuite.runTest(TestSuite.java:230)
	at junit.framework.TestSuite.run(TestSuite.java:225)
	at org.apache.tools.ant.taskdefs.optional.junit.JUnitTestRunner.run(JUnitTestRunner.java:297)
	at org.apache.tools.ant.taskdefs.optional.junit.JUnitTestRunner.launch(JUnitTestRunner.java:672)
	at org.apache.tools.ant.taskdefs.optional.junit.JUnitTestRunner.main(JUnitTestRunner.java:546)
Test: testGetAnnotationClass: java.lang.reflect.Field5Testjava.lang.NullPointerException
	at java.lang.reflect.Proxy.newProxyInstance(Proxy.java:200)
	at org.apache.harmony.lang.annotation.AnnotationFactory.createAnnotation(AnnotationFactory.java:101)
	at org.apache.harmony.vm.VMGenericsAndAnnotations.getDeclaredAnnotations(VMGenericsAndAnnotations.java)
	at java.lang.reflect.Field$FieldData.getAnnotations(Field.java:458)
	at java.lang.reflect.Field.getAnnotation(Field.java:56)
	at org.apache.harmony.lang.AnnotatedElementTestFrame.testGetAnnotation(AnnotatedElementTestFrame.java)
	at java.lang.reflect.VMReflection.invokeMethod(VMReflection.java)
	at java.lang.reflect.Method.invoke(Method.java:317)
	at junit.framework.TestCase.runTest(TestCase.java:164)
	at junit.framework.TestCase.runBare(TestCase.java)
	at junit.framework.TestResult$1.protect(TestResult.java)
	at junit.framework.TestResult.runProtected(TestResult.java)
	at junit.framework.TestResult.run(TestResult.java:109)
	at junit.framework.TestCase.run(TestCase.java:120)
	at junit.framework.TestSuite.runTest(TestSuite.java:230)
	at junit.framework.TestSuite.run(TestSuite.java:225)
	at org.apache.tools.ant.taskdefs.optional.junit.JUnitTestRunner.run(JUnitTestRunner.java:297)
	at org.apache.tools.ant.taskdefs.optional.junit.JUnitTestRunner.launch(JUnitTestRunner.java:672)
	at org.apache.tools.ant.taskdefs.optional.junit.JUnitTestRunner.main(JUnitTestRunner.java:546)
Test: testGetAnnotation2Class: java.lang.reflect.Field5Testjava.lang.NullPointerException
	at java.lang.reflect.Proxy.newProxyInstance(Proxy.java:200)
	at org.apache.harmony.lang.annotation.AnnotationFactory.createAnnotation(AnnotationFactory.java:101)
	at org.apache.harmony.vm.VMGenericsAndAnnotations.getDeclaredAnnotations(VMGenericsAndAnnotations.java)
	at java.lang.reflect.Field$FieldData.getAnnotations(Field.java:458)
	at java.lang.reflect.Field.getAnnotation(Field.java:56)
	at org.apache.harmony.lang.AnnotatedElementTestFrame.testGetAnnotation2(AnnotatedElementTestFrame.java)
	at java.lang.reflect.VMReflection.invokeMethod(VMReflection.java)
	at java.lang.reflect.Method.invoke(Method.java:317)
	at junit.framework.TestCase.runTest(TestCase.java:164)
	at junit.framework.TestCase.runBare(TestCase.java)
	at junit.framework.TestResult$1.protect(TestResult.java)
	at junit.framework.TestResult.runProtected(TestResult.java)
	at junit.framework.TestResult.run(TestResult.java:109)
	at junit.framework.TestCase.run(TestCase.java:120)
	at junit.framework.TestSuite.runTest(TestSuite.java:230)
	at junit.framework.TestSuite.run(TestSuite.java:225)
	at org.apache.tools.ant.taskdefs.optional.junit.JUnitTestRunner.run(JUnitTestRunner.java:297)
	at org.apache.tools.ant.taskdefs.optional.junit.JUnitTestRunner.launch(JUnitTestRunner.java:672)
	at org.apache.tools.ant.taskdefs.optional.junit.JUnitTestRunner.main(JUnitTestRunner.java:546)
Test: testGetAnnotation_NegativeClass: java.lang.reflect.Field5Testjava.lang.NullPointerException
	at java.lang.reflect.Proxy.newProxyInstance(Proxy.java:200)
	at org.apache.harmony.lang.annotation.AnnotationFactory.createAnnotation(AnnotationFactory.java:101)
	at org.apache.harmony.vm.VMGenericsAndAnnotations.getDeclaredAnnotations(VMGenericsAndAnnotations.java)
	at java.lang.reflect.Field$FieldData.getAnnotations(Field.java:458)
	at java.lang.reflect.Field.getAnnotation(Field.java:56)
	at org.apache.harmony.lang.AnnotatedElementTestFrame.testGetAnnotation_Negative(AnnotatedElementTestFrame.java)
	at java.lang.reflect.VMReflection.invokeMethod(VMReflection.java)
	at java.lang.reflect.Method.invoke(Method.java:317)
	at junit.framework.TestCase.runTest(TestCase.java:164)
	at junit.framework.TestCase.runBare(TestCase.java)
	at junit.framework.TestResult$1.protect(TestResult.java)
	at junit.framework.TestResult.runProtected(TestResult.java)
	at junit.framework.TestResult.run(TestResult.java:109)
	at junit.framework.TestCase.run(TestCase.java:120)
	at junit.framework.TestSuite.runTest(TestSuite.java:230)
	at junit.framework.TestSuite.run(TestSuite.java:225)
	at org.apache.tools.ant.taskdefs.optional.junit.JUnitTestRunner.run(JUnitTestRunner.java:297)
	at org.apache.tools.ant.taskdefs.optional.junit.JUnitTestRunner.launch(JUnitTestRunner.java:672)
	at org.apache.tools.ant.taskdefs.optional.junit.JUnitTestRunner.main(JUnitTestRunner.java:546)
Test: testGetDeclaredAnnotationsClass: java.lang.reflect.Field5Testjava.lang.NullPointerException
	at java.lang.reflect.Proxy.newProxyInstance(Proxy.java:200)
	at org.apache.harmony.lang.annotation.AnnotationFactory.createAnnotation(AnnotationFactory.java:101)
	at org.apache.harmony.vm.VMGenericsAndAnnotations.getDeclaredAnnotations(VMGenericsAndAnnotations.java)
	at java.lang.reflect.Field$FieldData.getAnnotations(Field.java:458)
	at java.lang.reflect.Field.getDeclaredAnnotations(Field.java:42)
	at org.apache.harmony.lang.AnnotatedElementTestFrame.testGetDeclaredAnnotations(AnnotatedElementTestFrame.java:162)
	at java.lang.reflect.VMReflection.invokeMethod(VMReflection.java)
	at java.lang.reflect.Method.invoke(Method.java:317)
	at junit.framework.TestCase.runTest(TestCase.java:164)
	at junit.framework.TestCase.runBare(TestCase.java)
	at junit.framework.TestResult$1.protect(TestResult.java)
	at junit.framework.TestResult.runProtected(TestResult.java)
	at junit.framework.TestResult.run(TestResult.java:109)
	at junit.framework.TestCase.run(TestCase.java:120)
	at junit.framework.TestSuite.runTest(TestSuite.java:230)
	at junit.framework.TestSuite.run(TestSuite.java:225)
	at org.apache.tools.ant.taskdefs.optional.junit.JUnitTestRunner.run(JUnitTestRunner.java:297)
	at org.apache.tools.ant.taskdefs.optional.junit.JUnitTestRunner.launch(JUnitTestRunner.java:672)
	at org.apache.tools.ant.taskdefs.optional.junit.JUnitTestRunner.main(JUnitTestRunner.java:546)
Test: testGetDeclaredAnnotations2Class: java.lang.reflect.Field5Testjava.lang.NullPointerException
	at java.lang.reflect.Proxy.newProxyInstance(Proxy.java:200)
	at org.apache.harmony.lang.annotation.AnnotationFactory.createAnnotation(AnnotationFactory.java:101)
	at org.apache.harmony.vm.VMGenericsAndAnnotations.getDeclaredAnnotations(VMGenericsAndAnnotations.java)
	at java.lang.reflect.Field$FieldData.getAnnotations(Field.java:458)
	at java.lang.reflect.Field.getDeclaredAnnotations(Field.java:42)
	at org.apache.harmony.lang.AnnotatedElementTestFrame.testGetDeclaredAnnotations2(AnnotatedElementTestFrame.java:173)
	at java.lang.reflect.VMReflection.invokeMethod(VMReflection.java)
	at java.lang.reflect.Method.invoke(Method.java:317)
	at junit.framework.TestCase.runTest(TestCase.java:164)
	at junit.framework.TestCase.runBare(TestCase.java)
	at junit.framework.TestResult$1.protect(TestResult.java)
	at junit.framework.TestResult.runProtected(TestResult.java)
	at junit.framework.TestResult.run(TestResult.java:109)
	at junit.framework.TestCase.run(TestCase.java:120)
	at junit.framework.TestSuite.runTest(TestSuite.java:230)
	at junit.framework.TestSuite.run(TestSuite.java:225)
	at org.apache.tools.ant.taskdefs.optional.junit.JUnitTestRunner.run(JUnitTestRunner.java:297)
	at org.apache.tools.ant.taskdefs.optional.junit.JUnitTestRunner.launch(JUnitTestRunner.java:672)
	at org.apache.tools.ant.taskdefs.optional.junit.JUnitTestRunner.main(JUnitTestRunner.java:546)
Test: testGetDeclaredAnnotationsImmutableClass: java.lang.reflect.Field5Testjava.lang.NullPointerException
	at java.lang.reflect.Proxy.newProxyInstance(Proxy.java:200)
	at org.apache.harmony.lang.annotation.AnnotationFactory.createAnnotation(AnnotationFactory.java:101)
	at org.apache.harmony.vm.VMGenericsAndAnnotations.getDeclaredAnnotations(VMGenericsAndAnnotations.java)
	at java.lang.reflect.Field$FieldData.getAnnotations(Field.java:458)
	at java.lang.reflect.Field.getDeclaredAnnotations(Field.java:42)
	at org.apache.harmony.lang.AnnotatedElementTestFrame.testGetDeclaredAnnotationsImmutable(AnnotatedElementTestFrame.java:198)
	at java.lang.reflect.VMReflection.invokeMethod(VMReflection.java)
	at java.lang.reflect.Method.invoke(Method.java:317)
	at junit.framework.TestCase.runTest(TestCase.java:164)
	at junit.framework.TestCase.runBare(TestCase.java)
	at junit.framework.TestResult$1.protect(TestResult.java)
	at junit.framework.TestResult.runProtected(TestResult.java)
	at junit.framework.TestResult.run(TestResult.java:109)
	at junit.framework.TestCase.run(TestCase.java:120)
	at junit.framework.TestSuite.runTest(TestSuite.java:230)
	at junit.framework.TestSuite.run(TestSuite.java:225)
	at org.apache.tools.ant.taskdefs.optional.junit.JUnitTestRunner.run(JUnitTestRunner.java:297)
	at org.apache.tools.ant.taskdefs.optional.junit.JUnitTestRunner.launch(JUnitTestRunner.java:672)
	at org.apache.tools.ant.taskdefs.optional.junit.JUnitTestRunner.main(JUnitTestRunner.java:546)
Test: testGetAnnotationsClass: java.lang.reflect.Field5Testjava.lang.NullPointerException
	at java.lang.reflect.Proxy.newProxyInstance(Proxy.java:200)
	at org.apache.harmony.lang.annotation.AnnotationFactory.createAnnotation(AnnotationFactory.java:101)
	at org.apache.harmony.vm.VMGenericsAndAnnotations.getDeclaredAnnotations(VMGenericsAndAnnotations.java)
	at java.lang.reflect.Field$FieldData.getAnnotations(Field.java:458)
	at java.lang.reflect.Field.getDeclaredAnnotations(Field.java:42)
	at java.lang.reflect.AccessibleObject.getAnnotations(AccessibleObject.java)
	at org.apache.harmony.lang.AnnotatedElementTestFrame.testGetAnnotations(AnnotatedElementTestFrame.java:215)
	at java.lang.reflect.VMReflection.invokeMethod(VMReflection.java)
	at java.lang.reflect.Method.invoke(Method.java:317)
	at junit.framework.TestCase.runTest(TestCase.java:164)
	at junit.framework.TestCase.runBare(TestCase.java)
	at junit.framework.TestResult$1.protect(TestResult.java)
	at junit.framework.TestResult.runProtected(TestResult.java)
	at junit.framework.TestResult.run(TestResult.java:109)
	at junit.framework.TestCase.run(TestCase.java:120)
	at junit.framework.TestSuite.runTest(TestSuite.java:230)
	at junit.framework.TestSuite.run(TestSuite.java:225)
	at org.apache.tools.ant.taskdefs.optional.junit.JUnitTestRunner.run(JUnitTestRunner.java:297)
	at org.apache.tools.ant.taskdefs.optional.junit.JUnitTestRunner.launch(JUnitTestRunner.java:672)
	at org.apache.tools.ant.taskdefs.optional.junit.JUnitTestRunner.main(JUnitTestRunner.java:546)
Test: testGetAnnotations2Class: java.lang.reflect.Field5Testjava.lang.NullPointerException
	at java.lang.reflect.Proxy.newProxyInstance(Proxy.java:200)
	at org.apache.harmony.lang.annotation.AnnotationFactory.createAnnotation(AnnotationFactory.java:101)
	at org.apache.harmony.vm.VMGenericsAndAnnotations.getDeclaredAnnotations(VMGenericsAndAnnotations.java)
	at java.lang.reflect.Field$FieldData.getAnnotations(Field.java:458)
	at java.lang.reflect.Field.getDeclaredAnnotations(Field.java:42)
	at java.lang.reflect.AccessibleObject.getAnnotations(AccessibleObject.java)
	at org.apache.harmony.lang.AnnotatedElementTestFrame.testGetAnnotations2(AnnotatedElementTestFrame.java:226)
	at java.lang.reflect.VMReflection.invokeMethod(VMReflection.java)
	at java.lang.reflect.Method.invoke(Method.java:317)
	at junit.framework.TestCase.runTest(TestCase.java:164)
	at junit.framework.TestCase.runBare(TestCase.java)
	at junit.framework.TestResult$1.protect(TestResult.java)
	at junit.framework.TestResult.runProtected(TestResult.java)
	at junit.framework.TestResult.run(TestResult.java:109)
	at junit.framework.TestCase.run(TestCase.java:120)
	at junit.framework.TestSuite.runTest(TestSuite.java:230)
	at junit.framework.TestSuite.run(TestSuite.java:225)
	at org.apache.tools.ant.taskdefs.optional.junit.JUnitTestRunner.run(JUnitTestRunner.java:297)
	at org.apache.tools.ant.taskdefs.optional.junit.JUnitTestRunner.launch(JUnitTestRunner.java:672)
	at org.apache.tools.ant.taskdefs.optional.junit.JUnitTestRunner.main(JUnitTestRunner.java:546)
Test: testGetAnnotations5Class: java.lang.reflect.Field5Testjava.lang.NullPointerException
	at java.lang.reflect.Proxy.newProxyInstance(Proxy.java:200)
	at org.apache.harmony.lang.annotation.AnnotationFactory.createAnnotation(AnnotationFactory.java:101)
	at org.apache.harmony.vm.VMGenericsAndAnnotations.getDeclaredAnnotations(VMGenericsAndAnnotations.java)
	at java.lang.reflect.Field$FieldData.getAnnotations(Field.java:458)
	at java.lang.reflect.Field.getDeclaredAnnotations(Field.java:42)
	at java.lang.reflect.AccessibleObject.getAnnotations(AccessibleObject.java)
	at org.apache.harmony.lang.AnnotatedElementTestFrame.testGetAnnotations5(AnnotatedElementTestFrame.java:264)
	at java.lang.reflect.VMReflection.invokeMethod(VMReflection.java)
	at java.lang.reflect.Method.invoke(Method.java:317)
	at junit.framework.TestCase.runTest(TestCase.java:164)
	at junit.framework.TestCase.runBare(TestCase.java)
	at junit.framework.TestResult$1.protect(TestResult.java)
	at junit.framework.TestResult.runProtected(TestResult.java)
	at junit.framework.TestResult.run(TestResult.java:109)
	at junit.framework.TestCase.run(TestCase.java:120)
	at junit.framework.TestSuite.runTest(TestSuite.java:230)
	at junit.framework.TestSuite.run(TestSuite.java:225)
	at org.apache.tools.ant.taskdefs.optional.junit.JUnitTestRunner.run(JUnitTestRunner.java:297)
	at org.apache.tools.ant.taskdefs.optional.junit.JUnitTestRunner.launch(JUnitTestRunner.java:672)
	at org.apache.tools.ant.taskdefs.optional.junit.JUnitTestRunner.main(JUnitTestRunner.java:546)
Test: testGetAnnotationsImmutableClass: java.lang.reflect.Field5Testjava.lang.NullPointerException
	at java.lang.reflect.Proxy.newProxyInstance(Proxy.java:200)
	at org.apache.harmony.lang.annotation.AnnotationFactory.createAnnotation(AnnotationFactory.java:101)
	at org.apache.harmony.vm.VMGenericsAndAnnotations.getDeclaredAnnotations(VMGenericsAndAnnotations.java)
	at java.lang.reflect.Field$FieldData.getAnnotations(Field.java:458)
	at java.lang.reflect.Field.getDeclaredAnnotations(Field.java:42)
	at java.lang.reflect.AccessibleObject.getAnnotations(AccessibleObject.java)
	at org.apache.harmony.lang.AnnotatedElementTestFrame.testGetAnnotationsImmutable(AnnotatedElementTestFrame.java:293)
	at java.lang.reflect.VMReflection.invokeMethod(VMReflection.java)
	at java.lang.reflect.Method.invoke(Method.java:317)
	at junit.framework.TestCase.runTest(TestCase.java:164)
	at junit.framework.TestCase.runBare(TestCase.java)
	at junit.framework.TestResult$1.protect(TestResult.java)
	at junit.framework.TestResult.runProtected(TestResult.java)
	at junit.framework.TestResult.run(TestResult.java:109)
	at junit.framework.TestCase.run(TestCase.java:120)
	at junit.framework.TestSuite.runTest(TestSuite.java:230)
	at junit.framework.TestSuite.run(TestSuite.java:225)
	at org.apache.tools.ant.taskdefs.optional.junit.JUnitTestRunner.run(JUnitTestRunner.java:297)
	at org.apache.tools.ant.taskdefs.optional.junit.JUnitTestRunner.launch(JUnitTestRunner.java:672)
	at org.apache.tools.ant.taskdefs.optional.junit.JUnitTestRunner.main(JUnitTestRunner.java:546)
Test: testIsAnnotationPresentClass: java.lang.reflect.Field5Testjava.lang.NullPointerException
	at java.lang.reflect.Proxy.newProxyInstance(Proxy.java:200)
	at org.apache.harmony.lang.annotation.AnnotationFactory.createAnnotation(AnnotationFactory.java:101)
	at org.apache.harmony.vm.VMGenericsAndAnnotations.getDeclaredAnnotations(VMGenericsAndAnnotations.java)
	at java.lang.reflect.Field$FieldData.getAnnotations(Field.java:458)
	at java.lang.reflect.Field.getAnnotation(Field.java:56)
	at java.lang.reflect.AccessibleObject.isAnnotationPresent(AccessibleObject.java)
	at org.apache.harmony.lang.AnnotatedElementTestFrame.testIsAnnotationPresent(AnnotatedElementTestFrame.java:310)
	at java.lang.reflect.VMReflection.invokeMethod(VMReflection.java)
	at java.lang.reflect.Method.invoke(Method.java:317)
	at junit.framework.TestCase.runTest(TestCase.java:164)
	at junit.framework.TestCase.runBare(TestCase.java)
	at junit.framework.TestResult$1.protect(TestResult.java)
	at junit.framework.TestResult.runProtected(TestResult.java)
	at junit.framework.TestResult.run(TestResult.java:109)
	at junit.framework.TestCase.run(TestCase.java:120)
	at junit.framework.TestSuite.runTest(TestSuite.java:230)
	at junit.framework.TestSuite.run(TestSuite.java:225)
	at org.apache.tools.ant.taskdefs.optional.junit.JUnitTestRunner.run(JUnitTestRunner.java:297)
	at org.apache.tools.ant.taskdefs.optional.junit.JUnitTestRunner.launch(JUnitTestRunner.java:672)
	at org.apache.tools.ant.taskdefs.optional.junit.JUnitTestRunner.main(JUnitTestRunner.java:546)
Test: testIsAnnotationPresent_NegativeClass: java.lang.reflect.Field5Testjava.lang.NullPointerException
	at java.lang.reflect.Proxy.newProxyInstance(Proxy.java:200)
	at org.apache.harmony.lang.annotation.AnnotationFactory.createAnnotation(AnnotationFactory.java:101)
	at org.apache.harmony.vm.VMGenericsAndAnnotations.getDeclaredAnnotations(VMGenericsAndAnnotations.java)
	at java.lang.reflect.Field$FieldData.getAnnotations(Field.java:458)
	at java.lang.reflect.Field.getAnnotation(Field.java:56)
	at java.lang.reflect.AccessibleObject.isAnnotationPresent(AccessibleObject.java)
	at org.apache.harmony.lang.AnnotatedElementTestFrame.testIsAnnotationPresent_Negative(AnnotatedElementTestFrame.java:320)
	at java.lang.reflect.VMReflection.invokeMethod(VMReflection.java)
	at java.lang.reflect.Method.invoke(Method.java:317)
	at junit.framework.TestCase.runTest(TestCase.java:164)
	at junit.framework.TestCase.runBare(TestCase.java)
	at junit.framework.TestResult$1.protect(TestResult.java)
	at junit.framework.TestResult.runProtected(TestResult.java)
	at junit.framework.TestResult.run(TestResult.java:109)
	at junit.framework.TestCase.run(TestCase.java:120)
	at junit.framework.TestSuite.runTest(TestSuite.java:230)
	at junit.framework.TestSuite.run(TestSuite.java:225)
	at org.apache.tools.ant.taskdefs.optional.junit.JUnitTestRunner.run(JUnitTestRunner.java:297)
	at org.apache.tools.ant.taskdefs.optional.junit.JUnitTestRunner.launch(JUnitTestRunner.java:672)
	at org.apache.tools.ant.taskdefs.optional.junit.JUnitTestRunner.main(JUnitTestRunner.java:546)
Test: testGetParameterAnnotations2Class: java.lang.reflect.Method5Testjava.lang.reflect.InvocationTargetException
	at java.lang.reflect.VMReflection.invokeMethod(VMReflection.java)
	at java.lang.reflect.Method.invoke(Method.java:317)
	at java.lang.reflect.Method5Test.getParamAnnotations(Method5Test.java:81)
	at java.lang.reflect.Method5Test.testGetParameterAnnotations2(Method5Test.java:113)
	at java.lang.reflect.VMReflection.invokeMethod(VMReflection.java)
	at java.lang.reflect.Method.invoke(Method.java:317)
	at junit.framework.TestCase.runTest(TestCase.java:164)
	at junit.framework.TestCase.runBare(TestCase.java)
	at junit.framework.TestResult$1.protect(TestResult.java)
	at junit.framework.TestResult.runProtected(TestResult.java)
	at junit.framework.TestResult.run(TestResult.java:109)
	at junit.framework.TestCase.run(TestCase.java:120)
	at junit.framework.TestSuite.runTest(TestSuite.java:230)
	at junit.framework.TestSuite.run(TestSuite.java:225)
	at org.apache.tools.ant.taskdefs.optional.junit.JUnitTestRunner.run(JUnitTestRunner.java:297)
	at org.apache.tools.ant.taskdefs.optional.junit.JUnitTestRunner.launch(JUnitTestRunner.java:672)
	at org.apache.tools.ant.taskdefs.optional.junit.JUnitTestRunner.main(JUnitTestRunner.java:546)
Caused by: java.lang.NullPointerException
	at java.lang.reflect.Proxy.newProxyInstance(Proxy.java:200)
	at org.apache.harmony.lang.annotation.AnnotationFactory.createAnnotation(AnnotationFactory.java:101)
	at org.apache.harmony.vm.VMGenericsAndAnnotations.getParameterAnnotations(VMGenericsAndAnnotations.java)
	at java.lang.reflect.Method$MethodData.getParameterAnnotations(Method.java:444)
	at java.lang.reflect.Method.getParameterAnnotations(Method.java:58)
	at java.lang.reflect.VMReflection.invokeMethod(VMReflection.java)
	... 16 more
Test: testGetParameterAnnotations3Class: java.lang.reflect.Method5Testjava.lang.reflect.InvocationTargetException
	at java.lang.reflect.VMReflection.invokeMethod(VMReflection.java)
	at java.lang.reflect.Method.invoke(Method.java:317)
	at java.lang.reflect.Method5Test.getParamAnnotations(Method5Test.java:81)
	at java.lang.reflect.Method5Test.testGetParameterAnnotations3(Method5Test.java:140)
	at java.lang.reflect.VMReflection.invokeMethod(VMReflection.java)
	at java.lang.reflect.Method.invoke(Method.java:317)
	at junit.framework.TestCase.runTest(TestCase.java:164)
	at junit.framework.TestCase.runBare(TestCase.java)
	at junit.framework.TestResult$1.protect(TestResult.java)
	at junit.framework.TestResult.runProtected(TestResult.java)
	at junit.framework.TestResult.run(TestResult.java:109)
	at junit.framework.TestCase.run(TestCase.java:120)
	at junit.framework.TestSuite.runTest(TestSuite.java:230)
	at junit.framework.TestSuite.run(TestSuite.java:225)
	at org.apache.tools.ant.taskdefs.optional.junit.JUnitTestRunner.run(JUnitTestRunner.java:297)
	at org.apache.tools.ant.taskdefs.optional.junit.JUnitTestRunner.launch(JUnitTestRunner.java:672)
	at org.apache.tools.ant.taskdefs.optional.junit.JUnitTestRunner.main(JUnitTestRunner.java:546)
Caused by: java.lang.NullPointerException
	at java.lang.reflect.Proxy.newProxyInstance(Proxy.java:200)
	at org.apache.harmony.lang.annotation.AnnotationFactory.createAnnotation(AnnotationFactory.java:101)
	at org.apache.harmony.vm.VMGenericsAndAnnotations.getParameterAnnotations(VMGenericsAndAnnotations.java)
	at java.lang.reflect.Method$MethodData.getParameterAnnotations(Method.java:444)
	at java.lang.reflect.Method.getParameterAnnotations(Method.java:58)
	at java.lang.reflect.VMReflection.invokeMethod(VMReflection.java)
	... 16 more
Test: testGetParameterAnnotationsImmutableClass: java.lang.reflect.Method5Testjava.lang.reflect.InvocationTargetException
	at java.lang.reflect.VMReflection.invokeMethod(VMReflection.java)
	at java.lang.reflect.Method.invoke(Method.java:317)
	at java.lang.reflect.Method5Test.getParamAnnotations(Method5Test.java:81)
	at java.lang.reflect.Method5Test.testGetParameterAnnotationsImmutable(Method5Test.java:157)
	at java.lang.reflect.VMReflection.invokeMethod(VMReflection.java)
	at java.lang.reflect.Method.invoke(Method.java:317)
	at junit.framework.TestCase.runTest(TestCase.java:164)
	at junit.framework.TestCase.runBare(TestCase.java)
	at junit.framework.TestResult$1.protect(TestResult.java)
	at junit.framework.TestResult.runProtected(TestResult.java)
	at junit.framework.TestResult.run(TestResult.java:109)
	at junit.framework.TestCase.run(TestCase.java:120)
	at junit.framework.TestSuite.runTest(TestSuite.java:230)
	at junit.framework.TestSuite.run(TestSuite.java:225)
	at org.apache.tools.ant.taskdefs.optional.junit.JUnitTestRunner.run(JUnitTestRunner.java:297)
	at org.apache.tools.ant.taskdefs.optional.junit.JUnitTestRunner.launch(JUnitTestRunner.java:672)
	at org.apache.tools.ant.taskdefs.optional.junit.JUnitTestRunner.main(JUnitTestRunner.java:546)
Caused by: java.lang.NullPointerException
	at java.lang.reflect.Proxy.newProxyInstance(Proxy.java:200)
	at org.apache.harmony.lang.annotation.AnnotationFactory.createAnnotation(AnnotationFactory.java:101)
	at org.apache.harmony.vm.VMGenericsAndAnnotations.getParameterAnnotations(VMGenericsAndAnnotations.java)
	at java.lang.reflect.Method$MethodData.getParameterAnnotations(Method.java:444)
	at java.lang.reflect.Method.getParameterAnnotations(Method.java:58)
	at java.lang.reflect.VMReflection.invokeMethod(VMReflection.java)
	... 16 more
Test: testGetAnnotationClass: java.lang.reflect.Method5Testjava.lang.NullPointerException
	at java.lang.reflect.Proxy.newProxyInstance(Proxy.java:200)
	at org.apache.harmony.lang.annotation.AnnotationFactory.createAnnotation(AnnotationFactory.java:101)
	at org.apache.harmony.vm.VMGenericsAndAnnotations.getDeclaredAnnotations(VMGenericsAndAnnotations.java)
	at java.lang.reflect.Method$MethodData.getDeclaredAnnotations(Method.java:426)
	at java.lang.reflect.Method.getAnnotation(Method.java:85)
	at org.apache.harmony.lang.AnnotatedElementTestFrame.testGetAnnotation(AnnotatedElementTestFrame.java)
	at java.lang.reflect.VMReflection.invokeMethod(VMReflection.java)
	at java.lang.reflect.Method.invoke(Method.java:317)
	at junit.framework.TestCase.runTest(TestCase.java:164)
	at junit.framework.TestCase.runBare(TestCase.java)
	at junit.framework.TestResult$1.protect(TestResult.java)
	at junit.framework.TestResult.runProtected(TestResult.java)
	at junit.framework.TestResult.run(TestResult.java:109)
	at junit.framework.TestCase.run(TestCase.java:120)
	at junit.framework.TestSuite.runTest(TestSuite.java:230)
	at junit.framework.TestSuite.run(TestSuite.java:225)
	at org.apache.tools.ant.taskdefs.optional.junit.JUnitTestRunner.run(JUnitTestRunner.java:297)
	at org.apache.tools.ant.taskdefs.optional.junit.JUnitTestRunner.launch(JUnitTestRunner.java:672)
	at org.apache.tools.ant.taskdefs.optional.junit.JUnitTestRunner.main(JUnitTestRunner.java:546)
Test: testGetAnnotation2Class: java.lang.reflect.Method5Testjava.lang.NullPointerException
	at java.lang.reflect.Proxy.newProxyInstance(Proxy.java:200)
	at org.apache.harmony.lang.annotation.AnnotationFactory.createAnnotation(AnnotationFactory.java:101)
	at org.apache.harmony.vm.VMGenericsAndAnnotations.getDeclaredAnnotations(VMGenericsAndAnnotations.java)
	at java.lang.reflect.Method$MethodData.getDeclaredAnnotations(Method.java:426)
	at java.lang.reflect.Method.getAnnotation(Method.java:85)
	at org.apache.harmony.lang.AnnotatedElementTestFrame.testGetAnnotation2(AnnotatedElementTestFrame.java)
	at java.lang.reflect.VMReflection.invokeMethod(VMReflection.java)
	at java.lang.reflect.Method.invoke(Method.java:317)
	at junit.framework.TestCase.runTest(TestCase.java:164)
	at junit.framework.TestCase.runBare(TestCase.java)
	at junit.framework.TestResult$1.protect(TestResult.java)
	at junit.framework.TestResult.runProtected(TestResult.java)
	at junit.framework.TestResult.run(TestResult.java:109)
	at junit.framework.TestCase.run(TestCase.java:120)
	at junit.framework.TestSuite.runTest(TestSuite.java:230)
	at junit.framework.TestSuite.run(TestSuite.java:225)
	at org.apache.tools.ant.taskdefs.optional.junit.JUnitTestRunner.run(JUnitTestRunner.java:297)
	at org.apache.tools.ant.taskdefs.optional.junit.JUnitTestRunner.launch(JUnitTestRunner.java:672)
	at org.apache.tools.ant.taskdefs.optional.junit.JUnitTestRunner.main(JUnitTestRunner.java:546)
Test: testGetAnnotation_NegativeClass: java.lang.reflect.Method5Testjava.lang.NullPointerException
	at java.lang.reflect.Proxy.newProxyInstance(Proxy.java:200)
	at org.apache.harmony.lang.annotation.AnnotationFactory.createAnnotation(AnnotationFactory.java:101)
	at org.apache.harmony.vm.VMGenericsAndAnnotations.getDeclaredAnnotations(VMGenericsAndAnnotations.java)
	at java.lang.reflect.Method$MethodData.getDeclaredAnnotations(Method.java:426)
	at java.lang.reflect.Method.getAnnotation(Method.java:85)
	at org.apache.harmony.lang.AnnotatedElementTestFrame.testGetAnnotation_Negative(AnnotatedElementTestFrame.java)
	at java.lang.reflect.VMReflection.invokeMethod(VMReflection.java)
	at java.lang.reflect.Method.invoke(Method.java:317)
	at junit.framework.TestCase.runTest(TestCase.java:164)
	at junit.framework.TestCase.runBare(TestCase.java)
	at junit.framework.TestResult$1.protect(TestResult.java)
	at junit.framework.TestResult.runProtected(TestResult.java)
	at junit.framework.TestResult.run(TestResult.java:109)
	at junit.framework.TestCase.run(TestCase.java:120)
	at junit.framework.TestSuite.runTest(TestSuite.java:230)
	at junit.framework.TestSuite.run(TestSuite.java:225)
	at org.apache.tools.ant.taskdefs.optional.junit.JUnitTestRunner.run(JUnitTestRunner.java:297)
	at org.apache.tools.ant.taskdefs.optional.junit.JUnitTestRunner.launch(JUnitTestRunner.java:672)
	at org.apache.tools.ant.taskdefs.optional.junit.JUnitTestRunner.main(JUnitTestRunner.java:546)
Test: testGetDeclaredAnnotationsClass: java.lang.reflect.Method5Testjava.lang.NullPointerException
	at java.lang.reflect.Proxy.newProxyInstance(Proxy.java:200)
	at org.apache.harmony.lang.annotation.AnnotationFactory.createAnnotation(AnnotationFactory.java:101)
	at org.apache.harmony.vm.VMGenericsAndAnnotations.getDeclaredAnnotations(VMGenericsAndAnnotations.java)
	at java.lang.reflect.Method$MethodData.getDeclaredAnnotations(Method.java:426)
	at java.lang.reflect.Method.getDeclaredAnnotations(Method.java:71)
	at org.apache.harmony.lang.AnnotatedElementTestFrame.testGetDeclaredAnnotations(AnnotatedElementTestFrame.java:162)
	at java.lang.reflect.VMReflection.invokeMethod(VMReflection.java)
	at java.lang.reflect.Method.invoke(Method.java:317)
	at junit.framework.TestCase.runTest(TestCase.java:164)
	at junit.framework.TestCase.runBare(TestCase.java)
	at junit.framework.TestResult$1.protect(TestResult.java)
	at junit.framework.TestResult.runProtected(TestResult.java)
	at junit.framework.TestResult.run(TestResult.java:109)
	at junit.framework.TestCase.run(TestCase.java:120)
	at junit.framework.TestSuite.runTest(TestSuite.java:230)
	at junit.framework.TestSuite.run(TestSuite.java:225)
	at org.apache.tools.ant.taskdefs.optional.junit.JUnitTestRunner.run(JUnitTestRunner.java:297)
	at org.apache.tools.ant.taskdefs.optional.junit.JUnitTestRunner.launch(JUnitTestRunner.java:672)
	at org.apache.tools.ant.taskdefs.optional.junit.JUnitTestRunner.main(JUnitTestRunner.java:546)
Test: testGetDeclaredAnnotations2Class: java.lang.reflect.Method5Testjava.lang.NullPointerException
	at java.lang.reflect.Proxy.newProxyInstance(Proxy.java:200)
	at org.apache.harmony.lang.annotation.AnnotationFactory.createAnnotation(AnnotationFactory.java:101)
	at org.apache.harmony.vm.VMGenericsAndAnnotations.getDeclaredAnnotations(VMGenericsAndAnnotations.java)
	at java.lang.reflect.Method$MethodData.getDeclaredAnnotations(Method.java:426)
	at java.lang.reflect.Method.getDeclaredAnnotations(Method.java:71)
	at org.apache.harmony.lang.AnnotatedElementTestFrame.testGetDeclaredAnnotations2(AnnotatedElementTestFrame.java:173)
	at java.lang.reflect.VMReflection.invokeMethod(VMReflection.java)
	at java.lang.reflect.Method.invoke(Method.java:317)
	at junit.framework.TestCase.runTest(TestCase.java:164)
	at junit.framework.TestCase.runBare(TestCase.java)
	at junit.framework.TestResult$1.protect(TestResult.java)
	at junit.framework.TestResult.runProtected(TestResult.java)
	at junit.framework.TestResult.run(TestResult.java:109)
	at junit.framework.TestCase.run(TestCase.java:120)
	at junit.framework.TestSuite.runTest(TestSuite.java:230)
	at junit.framework.TestSuite.run(TestSuite.java:225)
	at org.apache.tools.ant.taskdefs.optional.junit.JUnitTestRunner.run(JUnitTestRunner.java:297)
	at org.apache.tools.ant.taskdefs.optional.junit.JUnitTestRunner.launch(JUnitTestRunner.java:672)
	at org.apache.tools.ant.taskdefs.optional.junit.JUnitTestRunner.main(JUnitTestRunner.java:546)
Test: testGetDeclaredAnnotationsImmutableClass: java.lang.reflect.Method5Testjava.lang.NullPointerException
	at java.lang.reflect.Proxy.newProxyInstance(Proxy.java:200)
	at org.apache.harmony.lang.annotation.AnnotationFactory.createAnnotation(AnnotationFactory.java:101)
	at org.apache.harmony.vm.VMGenericsAndAnnotations.getDeclaredAnnotations(VMGenericsAndAnnotations.java)
	at java.lang.reflect.Method$MethodData.getDeclaredAnnotations(Method.java:426)
	at java.lang.reflect.Method.getDeclaredAnnotations(Method.java:71)
	at org.apache.harmony.lang.AnnotatedElementTestFrame.testGetDeclaredAnnotationsImmutable(AnnotatedElementTestFrame.java:198)
	at java.lang.reflect.VMReflection.invokeMethod(VMReflection.java)
	at java.lang.reflect.Method.invoke(Method.java:317)
	at junit.framework.TestCase.runTest(TestCase.java:164)
	at junit.framework.TestCase.runBare(TestCase.java)
	at junit.framework.TestResult$1.protect(TestResult.java)
	at junit.framework.TestResult.runProtected(TestResult.java)
	at junit.framework.TestResult.run(TestResult.java:109)
	at junit.framework.TestCase.run(TestCase.java:120)
	at junit.framework.TestSuite.runTest(TestSuite.java:230)
	at junit.framework.TestSuite.run(TestSuite.java:225)
	at org.apache.tools.ant.taskdefs.optional.junit.JUnitTestRunner.run(JUnitTestRunner.java:297)
	at org.apache.tools.ant.taskdefs.optional.junit.JUnitTestRunner.launch(JUnitTestRunner.java:672)
	at org.apache.tools.ant.taskdefs.optional.junit.JUnitTestRunner.main(JUnitTestRunner.java:546)
Test: testGetAnnotationsClass: java.lang.reflect.Method5Testjava.lang.NullPointerException
	at java.lang.reflect.Proxy.newProxyInstance(Proxy.java:200)
	at org.apache.harmony.lang.annotation.AnnotationFactory.createAnnotation(AnnotationFactory.java:101)
	at org.apache.harmony.vm.VMGenericsAndAnnotations.getDeclaredAnnotations(VMGenericsAndAnnotations.java)
	at java.lang.reflect.Method$MethodData.getDeclaredAnnotations(Method.java:426)
	at java.lang.reflect.Method.getDeclaredAnnotations(Method.java:71)
	at java.lang.reflect.AccessibleObject.getAnnotations(AccessibleObject.java)
	at org.apache.harmony.lang.AnnotatedElementTestFrame.testGetAnnotations(AnnotatedElementTestFrame.java:215)
	at java.lang.reflect.VMReflection.invokeMethod(VMReflection.java)
	at java.lang.reflect.Method.invoke(Method.java:317)
	at junit.framework.TestCase.runTest(TestCase.java:164)
	at junit.framework.TestCase.runBare(TestCase.java)
	at junit.framework.TestResult$1.protect(TestResult.java)
	at junit.framework.TestResult.runProtected(TestResult.java)
	at junit.framework.TestResult.run(TestResult.java:109)
	at junit.framework.TestCase.run(TestCase.java:120)
	at junit.framework.TestSuite.runTest(TestSuite.java:230)
	at junit.framework.TestSuite.run(TestSuite.java:225)
	at org.apache.tools.ant.taskdefs.optional.junit.JUnitTestRunner.run(JUnitTestRunner.java:297)
	at org.apache.tools.ant.taskdefs.optional.junit.JUnitTestRunner.launch(JUnitTestRunner.java:672)
	at org.apache.tools.ant.taskdefs.optional.junit.JUnitTestRunner.main(JUnitTestRunner.java:546)
Test: testGetAnnotations2Class: java.lang.reflect.Method5Testjava.lang.NullPointerException
	at java.lang.reflect.Proxy.newProxyInstance(Proxy.java:200)
	at org.apache.harmony.lang.annotation.AnnotationFactory.createAnnotation(AnnotationFactory.java:101)
	at org.apache.harmony.vm.VMGenericsAndAnnotations.getDeclaredAnnotations(VMGenericsAndAnnotations.java)
	at java.lang.reflect.Method$MethodData.getDeclaredAnnotations(Method.java:426)
	at java.lang.reflect.Method.getDeclaredAnnotations(Method.java:71)
	at java.lang.reflect.AccessibleObject.getAnnotations(AccessibleObject.java)
	at org.apache.harmony.lang.AnnotatedElementTestFrame.testGetAnnotations2(AnnotatedElementTestFrame.java:226)
	at java.lang.reflect.VMReflection.invokeMethod(VMReflection.java)
	at java.lang.reflect.Method.invoke(Method.java:317)
	at junit.framework.TestCase.runTest(TestCase.java:164)
	at junit.framework.TestCase.runBare(TestCase.java)
	at junit.framework.TestResult$1.protect(TestResult.java)
	at junit.framework.TestResult.runProtected(TestResult.java)
	at junit.framework.TestResult.run(TestResult.java:109)
	at junit.framework.TestCase.run(TestCase.java:120)
	at junit.framework.TestSuite.runTest(TestSuite.java:230)
	at junit.framework.TestSuite.run(TestSuite.java:225)
	at org.apache.tools.ant.taskdefs.optional.junit.JUnitTestRunner.run(JUnitTestRunner.java:297)
	at org.apache.tools.ant.taskdefs.optional.junit.JUnitTestRunner.launch(JUnitTestRunner.java:672)
	at org.apache.tools.ant.taskdefs.optional.junit.JUnitTestRunner.main(JUnitTestRunner.java:546)
Test: testGetAnnotations5Class: java.lang.reflect.Method5Testjava.lang.NullPointerException
	at java.lang.reflect.Proxy.newProxyInstance(Proxy.java:200)
	at org.apache.harmony.lang.annotation.AnnotationFactory.createAnnotation(AnnotationFactory.java:101)
	at org.apache.harmony.vm.VMGenericsAndAnnotations.getDeclaredAnnotations(VMGenericsAndAnnotations.java)
	at java.lang.reflect.Method$MethodData.getDeclaredAnnotations(Method.java:426)
	at java.lang.reflect.Method.getDeclaredAnnotations(Method.java:71)
	at java.lang.reflect.AccessibleObject.getAnnotations(AccessibleObject.java)
	at org.apache.harmony.lang.AnnotatedElementTestFrame.testGetAnnotations5(AnnotatedElementTestFrame.java:264)
	at java.lang.reflect.VMReflection.invokeMethod(VMReflection.java)
	at java.lang.reflect.Method.invoke(Method.java:317)
	at junit.framework.TestCase.runTest(TestCase.java:164)
	at junit.framework.TestCase.runBare(TestCase.java)
	at junit.framework.TestResult$1.protect(TestResult.java)
	at junit.framework.TestResult.runProtected(TestResult.java)
	at junit.framework.TestResult.run(TestResult.java:109)
	at junit.framework.TestCase.run(TestCase.java:120)
	at junit.framework.TestSuite.runTest(TestSuite.java:230)
	at junit.framework.TestSuite.run(TestSuite.java:225)
	at org.apache.tools.ant.taskdefs.optional.junit.JUnitTestRunner.run(JUnitTestRunner.java:297)
	at org.apache.tools.ant.taskdefs.optional.junit.JUnitTestRunner.launch(JUnitTestRunner.java:672)
	at org.apache.tools.ant.taskdefs.optional.junit.JUnitTestRunner.main(JUnitTestRunner.java:546)
Test: testGetAnnotationsImmutableClass: java.lang.reflect.Method5Testjava.lang.NullPointerException
	at java.lang.reflect.Proxy.newProxyInstance(Proxy.java:200)
	at org.apache.harmony.lang.annotation.AnnotationFactory.createAnnotation(AnnotationFactory.java:101)
	at org.apache.harmony.vm.VMGenericsAndAnnotations.getDeclaredAnnotations(VMGenericsAndAnnotations.java)
	at java.lang.reflect.Method$MethodData.getDeclaredAnnotations(Method.java:426)
	at java.lang.reflect.Method.getDeclaredAnnotations(Method.java:71)
	at java.lang.reflect.AccessibleObject.getAnnotations(AccessibleObject.java)
	at org.apache.harmony.lang.AnnotatedElementTestFrame.testGetAnnotationsImmutable(AnnotatedElementTestFrame.java:293)
	at java.lang.reflect.VMReflection.invokeMethod(VMReflection.java)
	at java.lang.reflect.Method.invoke(Method.java:317)
	at junit.framework.TestCase.runTest(TestCase.java:164)
	at junit.framework.TestCase.runBare(TestCase.java)
	at junit.framework.TestResult$1.protect(TestResult.java)
	at junit.framework.TestResult.runProtected(TestResult.java)
	at junit.framework.TestResult.run(TestResult.java:109)
	at junit.framework.TestCase.run(TestCase.java:120)
	at junit.framework.TestSuite.runTest(TestSuite.java:230)
	at junit.framework.TestSuite.run(TestSuite.java:225)
	at org.apache.tools.ant.taskdefs.optional.junit.JUnitTestRunner.run(JUnitTestRunner.java:297)
	at org.apache.tools.ant.taskdefs.optional.junit.JUnitTestRunner.launch(JUnitTestRunner.java:672)
	at org.apache.tools.ant.taskdefs.optional.junit.JUnitTestRunner.main(JUnitTestRunner.java:546)
Test: testIsAnnotationPresentClass: java.lang.reflect.Method5Testjava.lang.NullPointerException
	at java.lang.reflect.Proxy.newProxyInstance(Proxy.java:200)
	at org.apache.harmony.lang.annotation.AnnotationFactory.createAnnotation(AnnotationFactory.java:101)
	at org.apache.harmony.vm.VMGenericsAndAnnotations.getDeclaredAnnotations(VMGenericsAndAnnotations.java)
	at java.lang.reflect.Method$MethodData.getDeclaredAnnotations(Method.java:426)
	at java.lang.reflect.Method.getAnnotation(Method.java:85)
	at java.lang.reflect.AccessibleObject.isAnnotationPresent(AccessibleObject.java)
	at org.apache.harmony.lang.AnnotatedElementTestFrame.testIsAnnotationPresent(AnnotatedElementTestFrame.java:310)
	at java.lang.reflect.VMReflection.invokeMethod(VMReflection.java)
	at java.lang.reflect.Method.invoke(Method.java:317)
	at junit.framework.TestCase.runTest(TestCase.java:164)
	at junit.framework.TestCase.runBare(TestCase.java)
	at junit.framework.TestResult$1.protect(TestResult.java)
	at junit.framework.TestResult.runProtected(TestResult.java)
	at junit.framework.TestResult.run(TestResult.java:109)
	at junit.framework.TestCase.run(TestCase.java:120)
	at junit.framework.TestSuite.runTest(TestSuite.java:230)
	at junit.framework.TestSuite.run(TestSuite.java:225)
	at org.apache.tools.ant.taskdefs.optional.junit.JUnitTestRunner.run(JUnitTestRunner.java:297)
	at org.apache.tools.ant.taskdefs.optional.junit.JUnitTestRunner.launch(JUnitTestRunner.java:672)
	at org.apache.tools.ant.taskdefs.optional.junit.JUnitTestRunner.main(JUnitTestRunner.java:546)
Test: testIsAnnotationPresent_NegativeClass: java.lang.reflect.Method5Testjava.lang.NullPointerException
	at java.lang.reflect.Proxy.newProxyInstance(Proxy.java:200)
	at org.apache.harmony.lang.annotation.AnnotationFactory.createAnnotation(AnnotationFactory.java:101)
	at org.apache.harmony.vm.VMGenericsAndAnnotations.getDeclaredAnnotations(VMGenericsAndAnnotations.java)
	at java.lang.reflect.Method$MethodData.getDeclaredAnnotations(Method.java:426)
	at java.lang.reflect.Method.getAnnotation(Method.java:85)
	at java.lang.reflect.AccessibleObject.isAnnotationPresent(AccessibleObject.java)
	at org.apache.harmony.lang.AnnotatedElementTestFrame.testIsAnnotationPresent_Negative(AnnotatedElementTestFrame.java:320)
	at java.lang.reflect.VMReflection.invokeMethod(VMReflection.java)
	at java.lang.reflect.Method.invoke(Method.java:317)
	at junit.framework.TestCase.runTest(TestCase.java:164)
	at junit.framework.TestCase.runBare(TestCase.java)
	at junit.framework.TestResult$1.protect(TestResult.java)
	at junit.framework.TestResult.runProtected(TestResult.java)
	at junit.framework.TestResult.run(TestResult.java:109)
	at junit.framework.TestCase.run(TestCase.java:120)
	at junit.framework.TestSuite.runTest(TestSuite.java:230)
	at junit.framework.TestSuite.run(TestSuite.java:225)
	at org.apache.tools.ant.taskdefs.optional.junit.JUnitTestRunner.run(JUnitTestRunner.java:297)
	at org.apache.tools.ant.taskdefs.optional.junit.JUnitTestRunner.launch(JUnitTestRunner.java:672)
	at org.apache.tools.ant.taskdefs.optional.junit.JUnitTestRunner.main(JUnitTestRunner.java:546)
Test: testGetAnnotation_ByDefaultClass: org.apache.harmony.lang.annotation.AllTypesTestjava.lang.NullPointerException
	at java.lang.reflect.Proxy.newProxyInstance(Proxy.java:200)
	at org.apache.harmony.lang.annotation.AnnotationFactory.createAnnotation(AnnotationFactory.java:101)
	at org.apache.harmony.vm.VMGenericsAndAnnotations.getDeclaredAnnotations(VMGenericsAndAnnotations.java)
	at java.lang.Class$GACache.getAllAnnotations(Class.java:1338)
	at java.lang.Class.getAnnotation(Class.java:890)
	at org.apache.harmony.lang.annotation.AllTypesTest.testGetAnnotation_ByDefault(AllTypesTest.java:51)
	at java.lang.reflect.VMReflection.invokeMethod(VMReflection.java)
	at java.lang.reflect.Method.invoke(Method.java:317)
	at junit.framework.TestCase.runTest(TestCase.java:164)
	at junit.framework.TestCase.runBare(TestCase.java)
	at junit.framework.TestResult$1.protect(TestResult.java)
	at junit.framework.TestResult.runProtected(TestResult.java)
	at junit.framework.TestResult.run(TestResult.java:109)
	at junit.framework.TestCase.run(TestCase.java:120)
	at junit.framework.TestSuite.runTest(TestSuite.java:230)
	at junit.framework.TestSuite.run(TestSuite.java:225)
	at org.apache.tools.ant.taskdefs.optional.junit.JUnitTestRunner.run(JUnitTestRunner.java:297)
	at org.apache.tools.ant.taskdefs.optional.junit.JUnitTestRunner.launch(JUnitTestRunner.java:672)
	at org.apache.tools.ant.taskdefs.optional.junit.JUnitTestRunner.main(JUnitTestRunner.java:546)
Test: testGetAnnotation_NoDefaultClass: org.apache.harmony.lang.annotation.AllTypesTestjava.lang.NullPointerException
	at java.lang.reflect.Proxy.newProxyInstance(Proxy.java:200)
	at org.apache.harmony.lang.annotation.AnnotationFactory.createAnnotation(AnnotationFactory.java:101)
	at org.apache.harmony.vm.VMGenericsAndAnnotations.getDeclaredAnnotations(VMGenericsAndAnnotations.java)
	at java.lang.Class$GACache.getAllAnnotations(Class.java:1338)
	at java.lang.Class.getAnnotation(Class.java:890)
	at org.apache.harmony.lang.annotation.AllTypesTest.testGetAnnotation_NoDefault(AllTypesTest.java:87)
	at java.lang.reflect.VMReflection.invokeMethod(VMReflection.java)
	at java.lang.reflect.Method.invoke(Method.java:317)
	at junit.framework.TestCase.runTest(TestCase.java:164)
	at junit.framework.TestCase.runBare(TestCase.java)
	at junit.framework.TestResult$1.protect(TestResult.java)
	at junit.framework.TestResult.runProtected(TestResult.java)
	at junit.framework.TestResult.run(TestResult.java:109)
	at junit.framework.TestCase.run(TestCase.java:120)
	at junit.framework.TestSuite.runTest(TestSuite.java:230)
	at junit.framework.TestSuite.run(TestSuite.java:225)
	at org.apache.tools.ant.taskdefs.optional.junit.JUnitTestRunner.run(JUnitTestRunner.java:297)
	at org.apache.tools.ant.taskdefs.optional.junit.JUnitTestRunner.launch(JUnitTestRunner.java:672)
	at org.apache.tools.ant.taskdefs.optional.junit.JUnitTestRunner.main(JUnitTestRunner.java:546)
Test: testEqualsClass: org.apache.harmony.lang.annotation.AllTypesTestjava.lang.NullPointerException
	at java.lang.reflect.Proxy.newProxyInstance(Proxy.java:200)
	at org.apache.harmony.lang.annotation.AnnotationFactory.createAnnotation(AnnotationFactory.java:101)
	at org.apache.harmony.vm.VMGenericsAndAnnotations.getDeclaredAnnotations(VMGenericsAndAnnotations.java)
	at java.lang.Class$GACache.getAllAnnotations(Class.java:1338)
	at java.lang.Class.getAnnotation(Class.java:890)
	at org.apache.harmony.lang.annotation.AllTypesTest.testEquals(AllTypesTest.java:114)
	at java.lang.reflect.VMReflection.invokeMethod(VMReflection.java)
	at java.lang.reflect.Method.invoke(Method.java:317)
	at junit.framework.TestCase.runTest(TestCase.java:164)
	at junit.framework.TestCase.runBare(TestCase.java)
	at junit.framework.TestResult$1.protect(TestResult.java)
	at junit.framework.TestResult.runProtected(TestResult.java)
	at junit.framework.TestResult.run(TestResult.java:109)
	at junit.framework.TestCase.run(TestCase.java:120)
	at junit.framework.TestSuite.runTest(TestSuite.java:230)
	at junit.framework.TestSuite.run(TestSuite.java:225)
	at org.apache.tools.ant.taskdefs.optional.junit.JUnitTestRunner.run(JUnitTestRunner.java:297)
	at org.apache.tools.ant.taskdefs.optional.junit.JUnitTestRunner.launch(JUnitTestRunner.java:672)
	at org.apache.tools.ant.taskdefs.optional.junit.JUnitTestRunner.main(JUnitTestRunner.java:546)
Test: testEquals_ForeignImplClass: org.apache.harmony.lang.annotation.AllTypesTestjava.lang.NullPointerException
	at java.lang.reflect.Proxy.newProxyInstance(Proxy.java:200)
	at org.apache.harmony.lang.annotation.AnnotationFactory.createAnnotation(AnnotationFactory.java:101)
	at org.apache.harmony.vm.VMGenericsAndAnnotations.getDeclaredAnnotations(VMGenericsAndAnnotations.java)
	at java.lang.Class$GACache.getAllAnnotations(Class.java:1338)
	at java.lang.Class.getAnnotation(Class.java:890)
	at org.apache.harmony.lang.annotation.AllTypesTest.testEquals_ForeignImpl(AllTypesTest.java:131)
	at java.lang.reflect.VMReflection.invokeMethod(VMReflection.java)
	at java.lang.reflect.Method.invoke(Method.java:317)
	at junit.framework.TestCase.runTest(TestCase.java:164)
	at junit.framework.TestCase.runBare(TestCase.java)
	at junit.framework.TestResult$1.protect(TestResult.java)
	at junit.framework.TestResult.runProtected(TestResult.java)
	at junit.framework.TestResult.run(TestResult.java:109)
	at junit.framework.TestCase.run(TestCase.java:120)
	at junit.framework.TestSuite.runTest(TestSuite.java:230)
	at junit.framework.TestSuite.run(TestSuite.java:225)
	at org.apache.tools.ant.taskdefs.optional.junit.JUnitTestRunner.run(JUnitTestRunner.java:297)
	at org.apache.tools.ant.taskdefs.optional.junit.JUnitTestRunner.launch(JUnitTestRunner.java:672)
	at org.apache.tools.ant.taskdefs.optional.junit.JUnitTestRunner.main(JUnitTestRunner.java:546)
Test: testToStringClass: org.apache.harmony.lang.annotation.AllTypesTestjava.lang.NullPointerException
	at java.lang.reflect.Proxy.newProxyInstance(Proxy.java:200)
	at org.apache.harmony.lang.annotation.AnnotationFactory.createAnnotation(AnnotationFactory.java:101)
	at org.apache.harmony.vm.VMGenericsAndAnnotations.getDeclaredAnnotations(VMGenericsAndAnnotations.java)
	at java.lang.Class$GACache.getAllAnnotations(Class.java:1338)
	at java.lang.Class.getAnnotation(Class.java:890)
	at org.apache.harmony.lang.annotation.AllTypesTest.testToString(AllTypesTest.java:140)
	at java.lang.reflect.VMReflection.invokeMethod(VMReflection.java)
	at java.lang.reflect.Method.invoke(Method.java:317)
	at junit.framework.TestCase.runTest(TestCase.java:164)
	at junit.framework.TestCase.runBare(TestCase.java)
	at junit.framework.TestResult$1.protect(TestResult.java)
	at junit.framework.TestResult.runProtected(TestResult.java)
	at junit.framework.TestResult.run(TestResult.java:109)
	at junit.framework.TestCase.run(TestCase.java:120)
	at junit.framework.TestSuite.runTest(TestSuite.java:230)
	at junit.framework.TestSuite.run(TestSuite.java:225)
	at org.apache.tools.ant.taskdefs.optional.junit.JUnitTestRunner.run(JUnitTestRunner.java:297)
	at org.apache.tools.ant.taskdefs.optional.junit.JUnitTestRunner.launch(JUnitTestRunner.java:672)
	at org.apache.tools.ant.taskdefs.optional.junit.JUnitTestRunner.main(JUnitTestRunner.java:546)
Test: testAnnotationTypeClass: org.apache.harmony.lang.annotation.AllTypesTestjava.lang.NullPointerException
	at java.lang.reflect.Proxy.newProxyInstance(Proxy.java:200)
	at org.apache.harmony.lang.annotation.AnnotationFactory.createAnnotation(AnnotationFactory.java:101)
	at org.apache.harmony.vm.VMGenericsAndAnnotations.getDeclaredAnnotations(VMGenericsAndAnnotations.java)
	at java.lang.Class$GACache.getAllAnnotations(Class.java:1338)
	at java.lang.Class.getAnnotation(Class.java:890)
	at org.apache.harmony.lang.annotation.AllTypesTest.testAnnotationType(AllTypesTest.java:152)
	at java.lang.reflect.VMReflection.invokeMethod(VMReflection.java)
	at java.lang.reflect.Method.invoke(Method.java:317)
	at junit.framework.TestCase.runTest(TestCase.java:164)
	at junit.framework.TestCase.runBare(TestCase.java)
	at junit.framework.TestResult$1.protect(TestResult.java)
	at junit.framework.TestResult.runProtected(TestResult.java)
	at junit.framework.TestResult.run(TestResult.java:109)
	at junit.framework.TestCase.run(TestCase.java:120)
	at junit.framework.TestSuite.runTest(TestSuite.java:230)
	at junit.framework.TestSuite.run(TestSuite.java:225)
	at org.apache.tools.ant.taskdefs.optional.junit.JUnitTestRunner.run(JUnitTestRunner.java:297)
	at org.apache.tools.ant.taskdefs.optional.junit.JUnitTestRunner.launch(JUnitTestRunner.java:672)
	at org.apache.tools.ant.taskdefs.optional.junit.JUnitTestRunner.main(JUnitTestRunner.java:546)
Test: testAnnotation_ElementErrorClass: org.apache.harmony.lang.annotation.AllTypesTestjava.lang.NullPointerException
	at java.lang.reflect.Proxy.newProxyInstance(Proxy.java:200)
	at org.apache.harmony.lang.annotation.AnnotationFactory.createAnnotation(AnnotationFactory.java:101)
	at org.apache.harmony.vm.VMGenericsAndAnnotations.getDeclaredAnnotations(VMGenericsAndAnnotations.java)
	at java.lang.reflect.Method$MethodData.getDeclaredAnnotations(Method.java:426)
	at java.lang.reflect.Method.getAnnotation(Method.java:85)
	at org.apache.harmony.lang.annotation.AllTypesTest.testAnnotation_ElementError(AllTypesTest.java:162)
	at java.lang.reflect.VMReflection.invokeMethod(VMReflection.java)
	at java.lang.reflect.Method.invoke(Method.java:317)
	at junit.framework.TestCase.runTest(TestCase.java:164)
	at junit.framework.TestCase.runBare(TestCase.java)
	at junit.framework.TestResult$1.protect(TestResult.java)
	at junit.framework.TestResult.runProtected(TestResult.java)
	at junit.framework.TestResult.run(TestResult.java:109)
	at junit.framework.TestCase.run(TestCase.java:120)
	at junit.framework.TestSuite.runTest(TestSuite.java:230)
	at junit.framework.TestSuite.run(TestSuite.java:225)
	at org.apache.tools.ant.taskdefs.optional.junit.JUnitTestRunner.run(JUnitTestRunner.java:297)
	at org.apache.tools.ant.taskdefs.optional.junit.JUnitTestRunner.launch(JUnitTestRunner.java:672)
	at org.apache.tools.ant.taskdefs.optional.junit.JUnitTestRunner.main(JUnitTestRunner.java:546)
Test: testSerializationClass: org.apache.harmony.lang.annotation.AllTypesTestjava.lang.NullPointerException
	at java.lang.reflect.Proxy.newProxyInstance(Proxy.java:200)
	at org.apache.harmony.lang.annotation.AnnotationFactory.createAnnotation(AnnotationFactory.java:101)
	at org.apache.harmony.vm.VMGenericsAndAnnotations.getDeclaredAnnotations(VMGenericsAndAnnotations.java)
	at java.lang.Class$GACache.getAllAnnotations(Class.java:1338)
	at java.lang.Class.getAnnotation(Class.java:890)
	at org.apache.harmony.lang.annotation.AllTypesTest.testSerialization(AllTypesTest.java:189)
	at java.lang.reflect.VMReflection.invokeMethod(VMReflection.java)
	at java.lang.reflect.Method.invoke(Method.java:317)
	at junit.framework.TestCase.runTest(TestCase.java:164)
	at junit.framework.TestCase.runBare(TestCase.java)
	at junit.framework.TestResult$1.protect(TestResult.java)
	at junit.framework.TestResult.runProtected(TestResult.java)
	at junit.framework.TestResult.run(TestResult.java:109)
	at junit.framework.TestCase.run(TestCase.java:120)
	at junit.framework.TestSuite.runTest(TestSuite.java:230)
	at junit.framework.TestSuite.run(TestSuite.java:225)
	at org.apache.tools.ant.taskdefs.optional.junit.JUnitTestRunner.run(JUnitTestRunner.java:297)
	at org.apache.tools.ant.taskdefs.optional.junit.JUnitTestRunner.launch(JUnitTestRunner.java:672)
	at org.apache.tools.ant.taskdefs.optional.junit.JUnitTestRunner.main(JUnitTestRunner.java:546)

***********************************************************
Modifications since last successful build:	(2)
            
add cc-hdk log20071028163357Lbuild.298 10/28/2007 16:33:57hdk
add cc-hdk log20071028163357Lbuild.298 10/28/2007 16:33:57hdk

begin 644 execution_log.zip
M4$L#! H    ( -"17#?#8SP^,AL  &VI 0 2    97AE8W5T:6]N7VQO9RYH
M=&UL[5WK<MNXDOZ?I\#6[-;)G!I3HD3=?#*I<A)GQEY[[(T\.;4UE5+1)&31
MID@M+XX]3[\-4K)U(<%N2;#D&:A2BF2A+V@T&@W@ _ANE(S]]^^N0_?Q_;M)
MQ-^_LUF<//K\YW\,PR YB+T_^2'KUO_K7_]X_R:=N';"#^+[X/#-FX/\&WR*
M4OC.&/O#Y3Y/^#?V2?SO!3>LW>NRH>?SF VC<,QJ_&$21DDMC7D4UQP'_ATX
MX7@<!K7KU//=6L3CU$_BFAOY]^.#A,>)X N<;^U[^QO[( H)?H=L;-_QG,AX
M&/L+I1:^@*X'+BCE)(?R0I,HG$B*\(>$1\' Y4N%\L_<&87P^?=85/KCV5&_
M?W;R@?U<76%GQ)V[,(4JC]R[VO<PN@,. \>WX]CWKLO5R:MDA+%A1\[(<!X>
M#&=X(]'?"[S$2 /OH:K,=R^H*@(U $^)8^X:X]#E,L/RQ(CYV(L-UXOBBH*Y
MB6U?5F[BIS=>8-A!XH!W1MYU=5EG,DGL^$[&5=2JO%D_AL'0NTDC._'"0-+Z
MXO5K&&>.?PH_0_N;1LNH#^H]]K:?!NS<<Z(P?HP3/H[92> 8/TJ9S;R 16&8
M;-F95A1_?H4QR#KS@O0!1R$<$"CXN&TE2!G@KD!QXSC8\L,;*._RZ_1&3@$=
MF47\WHNAI8"BU>TU&U:5$.'.8<"#),Z$3/SPL5*OT:,1A$;L";V&X+)<2@&E
M_="Q?>-/T9Q%% M?;N_'B6>(Z"?Q6:$U1,*#K' 6*N,#\<NJ@_XQOH/>!WX<
M<8C7+H,OA^LZT_UX^K,?/ RR)A] ,PZRIJEE2M2>M0>^PO=XO*C2'V .\=$1
M74M40G08B\5A&CE\.EPDX0XUK+1S *'@GN^5I7.52KWPAQ_F;'WZ]?SJA.44
M,3MD'T#=NTGH!8FY?U6JR;03WQSPHP8X3&+[S\YSS6<-YQJE5/W$CK)H#5:Y
MJ^J.?'PMQCL[\(8K'1-MZ<MP\CFRQWP?[5RNVVNS<A_^Z/-^PB?[:&>9=J_-
MTE_/3R!UVD<KEVDVLY6Y6PLO)JK1_/"R5\-*Q(40R?"(RE5@@C@_?NYC#6LP
MOI3V@<IT\.?*5R6++S!!R+M7IA=+L[DD:,4C\ ]X?PDE2@N =H'01YHJW,+\
M,H'9__&'WW\Y9+_P)'F.&3RX]Z)P#%FV81BK<I9H7<C'_Z.J4'\JP+$G]C7$
MI\3C\=:9\WLQ,=@:VW.>C$+W&*:NCZ"W[U_;SAWSXNPS^/TPC.9-;,Q_%F[Q
M=G7&N"3@DQ?;UUFLGA>5U0);"6S#@A3.@A2B7,02$,I!P#;XSTQ__51YE/U7
MR1A, C,E6W5EJCW+:*FM/H;T$P<W@HEF:?-LI?T_S%7><=*)!X[K!6R8!HY8
M(=G0@55[UT<Q:*S:EU+I)Z^JE.5S.Q*RDI&8V$9Q,B=U2_71;?ZB;=["!^ Y
M\JW&WUF B%/'X7$,XSY+HG1K3:W(H98S"<E4>'MYQ+HI GWTOP)'ASZ1C*#1
M73&BQV*JP-W*C"!+>86LHQN0=971(WQS9A51P/#MX,;(2=DFM-F:>NHD843@
M$D C0FU%G$-0/577%M6=VHM"=^.'US!OB_B01SP0"X:0,XDP@^<UT_S)!8VG
M3_]I4@Q8R,!(1E[D#L =)F]_9.,L"R/P7"<&+J8,N+%%S#>(;9 5W\SU*E@8
MCQ[W78K9I@R?(OR<)T" C"<\<$573#!FS&:QE4-=0:,O-#E.RE-J0$H(<MI9
M<S^O)#T-,$@&N6&6[(6W]M6<D46HR]DA@MV4_D"\F/EDRFSZD_\5R0%TG0Y_
M6)E?>)R"I+GZ[M2UYB=_J)GCMCC,.4V1>Q^RF,,P,'/FKS_EVY"'[.S)VVMS
MP>Y?K\GA&MKA-G$750X7I<%?S-&:&SC:$V6.A1%:9)GOX/C+EXLO@]\N!N<7
M7XX'G[\<G1_W\;XX#N_7'#)FHTUFSVD?P!MT[5[PW B["H_5');G--*-)[TZ
MNHW5T3D3&_.?]V9U]#A0//U_?<NO5E/]\JO5T<NO^?QDLQ[R>I;BK":Z*Q:,
M>ON\5+;LD<5#4AX4]Z8]Y[3,31(&F.1BE4K4#=_&N@E4-\$J?K)T4'W=_4P'
MUME0JO<XMK/'401"6OCB")X(I.\X# ;W8UD9P>A@"F#:.;[FN5IQ+;R^W2=U
MKKV@M-F><6XY!,<.8,XAYN)"5E%?$M\RN%Z3AB:;RCOS@KOIM%.\#T2)@9TD
M45PJJ;YEV%JE.M=V[!7 ]'>ECN="D/&&!0#]G6DD$%I1.BE C^U*)>@R7A+N
MDQ=-[*B 8F?:)-' "8/[_=%HNLZX%PKE -H]ZOA3A89V,O/L?5)K#YLN&7G!
M7IDJ\2!,QI# C?=%G>PXUB & ]DW!7G<;I2:-AG8:ACNBTX3R.\A6*9%Z.C=
M:!39W_=KA .=LEVY?5$F\<9 ]F+:%,Q#9@?"]R7I+SK%,&_$V7PM*UV8Z"\6
M1.3K,V#]Y5&_?_R)X2D*1)0,Q1(1<HH"$>5YM41*)5&1H/)T62:IDJI 5'F0
MD$BJ)"H05)S=2H1("8H$E":L,B%51 6"2I,9B9PJFD4Q\NRR6 R*IE",-&>4
M"L-0%HHDFA!)52A*GN=)Y:%(%X7*DKAB60B*%1$5B5FI(!S=BCAYRE4J#46V
M(DR62Y6*0A"M")*G2*6B4&0KPDIRGU(I\O(K[,NRF5+^!01%*4J6$BQF*?D2
M;_[+-W85V4$\#*,Q X[\D)D-TQR7V^72YW8L3GD$[MSRX?1"&V8G+Y/J;+C4
M'(_#.UZY'@TUE=T1,TTFC6=FQIY<F/"LT>R<\&I[[EZE6CQ*$S?\CEFHWHUB
M-0&3^V1S$',1_-OVRN>&2H]9YRIB#[+OA=$^VV"-XRB2+,QHDRV:[*1R@7W'
M%JL(?GL5]? 7\G3K+W@C3Y6*"U^R64<VVF=D>V7?JI6&\CQF^MK"(7[1::#6
MIU_/U=0ZOR*K=@OE;R,N=E1K0IF7J!K:*0;?O60TN/6209:E/UVB4![K7D+]
MOE!MFAV& ?OH>^+\E;A#CYV>7+&W+A_:D"[*KX5384JT(?(;#OF#XZ=N'AG6
MOYCNR<FRNQRG/./9!R.[ S)O3<,7U]$9#]WVH&T9T*JLXAJ^JCKFX/):?VS[
M/HP#SEU^_$ST'$/JRU")<#B&Q"=ZK/U37C0#Y,B+7/)HB"A6^L,/[->C+^<7
MO_WO0;/9[)86NW%J9Q=]N0PH<PZNY^6&B.6%)Z#W0O&^-Y[ H+=N+8:VYV<]
MXO=KF.>F;9:WM%19.]K<:HU.IS$5GL6(L9<DT"/]QW+B.!$W7];.O8?-VZQN
MUI^^6(U>HTIHYJF;B[5Z+3:R@YOE2LO,_=OE\>:">^8JLFQ.QB4HE83C+[.3
MO=6]$8C^S>T[ @5&S7:S5Q4XSNW@<>KZVY'9Z/466J/2%1X#9TVI12_4S@@[
M9+]ZB(482:$E=GGHY3%F/:RZ[!+S_-[3T'9Y9'P4GP7Q+SSYQ.$7<?0V^R-"
M\H:,)&H=/SA\(K"E)X$ "GJV[_W)(Z1!-F0D4>LLO#G+/A&UJ*:3"/TM3#Z'
M*6KAG$0F$=G/^M):5461+HGFLT9Z;BY*!UB+O%2%SUZ0.<EZ&N"I2Q6 $84D
M4E9^2<B-(Q0\$@A?A A,Z4(!>2=#2Z@H7B BA-DWDKVT: 'KR+X9RX:91>Y5
MI8L$<*SJLI*KC,\\E*M6E5QEO)Q]_$_*4X[L&&N1KZH Q-E!7:3EJHL7B$B#
M)U>,+X+C!R_!UY%*O"H^#YN@.$Y@=?$"$9 9C:(P "7=9VWQE5R#?E6)/#?,
M#Z.+N\AQHM%42P*S2_FS1>6%X;^ //]\"N_9P6P_.60%5Z2NZ(874*[?13)"
M!4M$X67VH7$41?8C,C2@BJ^*$,O0-QRUGXHIO23@-O ,D4V<>=>1'6%@.%B*
M)4%BZF[D"Z-B$O.42F#J1:?%"A?/U4A&FZA0P:%(D3Z_YY'M3^=Q6.%(JD*!
M63C[&$8!C_K0@= BL708H0/)0JU<K(2R2#!8*/PN&@DKKYI *H;NRA12I&B:
M(],92-584SA-9,2'OGCT#$R \SL4$/+P-$O"9AN!1O6&\XI0.JU,N&SC=MUA
M%2^@6C_)+FFA>LW5RTLK%)1)J-;O+'0P&$D\S;*P+%@9'[R;?G85X8=T.$3E
M&T3"8K&4V2":I%A4U@R8A!)7OE@(?DQ$$A2+^<H=''015[Y8B%@A_M6.1V-[
M@IP%$ F7Q$ZOG!*SH_[4FW\-0Q1 F$A9+/@D&(H<FE-\DDQ:)GH:(I AFD16
M+++O<S[!BY(7+Q:1^W9U^%L1AB64B;VX.*<*E)$LB4H3SS<^X?";U64+F8>7
MD7?/?9@-83(%/$V1L,LHQ/A"==DBYOGP@ Z_>)IEY"B;(F!>#D!:A6!9^"+>
M7QO2 M2#A@B-T^.KEY"^7M7W EO!-\96:(B$**PA$AHBL89@#9$HE:DA$E5<
M-41"HI:&2*PC4D,D-$1"0R00W#5$HE*:ADA@Q&N(A$RTADAHB(2&2*RG@H9(
M((5JB(2&2&B(!%FXADAHB$2Y6 V1T! )#9'XBT(DB@Y2$R12J#5&0R)#8S0T
M1D-\$>^O%:-Q<:DQ&E*,1CC1]U_D/VAPQQ; ':7E_@(XCA?$#&CT"%K-%T./
M%+VP^83&<6@<1[D6&L<A%:UQ'!K'H7$<J\PUCD/C.(H%:AP'2J#&<6@<!U:0
MQG%H',>:8C6.0^,X-(Y#XSC6TD_C.#2.0^,XY'(UCF,O<1P:1J%A%!I&\?1%
MO+\V&,6<7B\A?;VJ[P., @RU*8SBA[\,CB+VP^^E/V\-;M#KE.]/>V%MMI+T
MVB^M:'5-YD203D%@^[\4D@P6#D%^E>SM@ \T!F!9YM7(BZ<VS@<=^'K/H\?,
MZ;$A<]I&^?BFX0A2YAJ.H.$(<I$:CJ#A"!J.@."^3W"$BSZ.KZS@"Z(<YO&Y
M. $HBE5!N/Y445"C-#1*HT2F1FFLZ/:W1VEH$,7+@RA6#WQ@%2!0:O2&1F^4
M"]3H#8W>J!"NT1L:O5$N]@71&]D*!5Z,O+C&;I1*T]@-C=W0=W!H\ A!F :/
M:/!(_EH"C_1Y!)-&-@Y=SDY/]#T<4@!)'-WK>SBR'_0]'/H>#JE8?0_'O(R_
M'0:GZ(7-*33P10-?RK70P!>I: U\T< 7#7Q99:[OX= (CV*!&N&!$J@1'OH>
M#JP@#2'12(XUQ6HDAT9R:"2'1G*LI9]&<NA[.#260RY78SGV$LNAH10:2J&A
M%$]?,F:#O-CBCOL?MRE$C_R7;^PJLH-X&$9CEGAC#BF'V>PTQ^5#Q-4HQSZP
MG($X&.X%^U+IY\*'Y87NH)6Y7U4*M)]X/C_(2Q^LELX^CN]<+_K&\JFNR^#+
MH4);S&DNC!&':>3PI:;Z8_28[3@ZH%56!=%!FBPOFZ$^8I:$.U9RQZ:;]ER$
MX<QV:U>F*U02/KD0<1/^C7T2_PL=P7)9PO7XPIK5@C 9KFSJ+7R)TF"?.]!J
M-)F/=.6CQ_2U!227R%BAVJ=?S]54V^43/WRLW4+YVXC7KKV@)I1YB:J5>\7!
MDEL<7-N),]I+YZC=>HDAH'T[]1+(<Z:CUA1VF&90OH^^QX/D"7G(WKI\:$,:
M\N.+*+6>15X<A#AMU044(C3JQM=8B3MR>#S#@=H1? I#^9U0XB\UWPYN:M"@
M(MLZ<EU/+"?:OH@#%9A$J2J+FJ1!G-C78%J1F@HT5\5E2A6*F:9<LPKRIK49
M>6\C<JN^&?EF=;<::T/.CG,W=MDU=VSH&="&SS#$5J\<,KJB4C4*[9FD_P@#
MTOCX(<GW-E4#V/*YR/-,+HQN#'MB0W\W1G8$ >#1$&H9-SS@D>?$.;(K!_04
MKO;,&%YEG0$&FD/6,']BGVW/3R$9/63UGUBV?)M_O +S,.[;DYB[,/<QS);%
M8KZ*,"EBV\:RK1MFO8UE:[;P;'N=!I9M%\NU8?3J/2S7)E[79@O-E6"!=MM4
MH&O'1'L!VK?J1J..UM7L$=CV\,UEX7N"56\IL$'=W#%7@F'KC:827?$19N=<
M+;3'HCU+Z(H.ANBH)5H+K2LA<-=-=.>B6  =MDFJ=G;+M:.$*R%L$SH!R0+H
MX$+2%1U<2%UKQ[J2PNMNW944L]&QA6( ?&PA60 =7=5T A+75S06JK& I21D
M-;M*>H&:'HL.+J0!!I_!UY6$%U(@4!*UZV@GH(PP^,DAI;E:: N01D,5O:")
MG\JCTU?3:.!]H$%Q6 L?"0C)=@-O [1I&T:C@_8M0H.9;;P)*'Z MP%Z/<,T
M\&'+(CA7#Y\3$ *,V<0'0_P27,/HFN@&(R6Q>#>@#%\J+$O0%;^X*:(LFBUE
M]%*2P>!G\PU"W#);Z.9J4-K+0F=&34+*:>)3(U(BBU:6E!PJ414](%"\H-Y1
M,B*8'71SD7)Y-%>""=J6FMF,DMEW02QXO7@"OK]X@EM/X"!#X_3X2B,(*A $
M7",("(II!(%&$/Q=$ 2$I(V$(, /K20$ 9HM.KOHP(B]_1F<F!NCN:(MT# :
M^/4<@JX]%5O'+7PJ2 $0-/%L\0""AM'$.P$I&50!S2!PI<R,FTIF6GA8 F6J
MI89K4\WV.7KR0ID5XEN+M)"AQ@)*M@Z5S%_QJE(V#/ ABZ*J$@2%@L&0U =(
M?K5C74GKCDHVNI5@OM088-<!2TTG(''%+^?NGJN2X()?TB=Q5=,+U.P4H%N+
M,KX0DM<ZI<LJ 1+ANRPI:N/W(I6$0B7I $E5_"XWI6\I@0_@QP(2? !_'(($
M'^CB-_HI^ $E8<O$+Y&0\ -XC!8%/X#?X,0#","R2K;D3?SA#1J H*?B4 @!
MJD<"$'250*'QRI(0!%TEB6Q;22:/WXRD;!XW\/V6!"'HJ8$0X$]PD)9UE"SM
MX5=B26=8\, Z"I($O]E/&174'&)1<=Y&R6R& ,R@>,!JMO%J\0/A9/_Q Q>7
M&C]0@1^ 9M3X ;QB&C^@\0-_#_R :70*AJLROH2QU<(GF'@ 0:-MM!1LQID=
M [_73T$0=-&S(@*"H(M'J:)U[1I-_%(A(1=JMO%>@)[!-8UV#W^"";T"US3J
M^-4,->?8*%SQQZTH4V,U&;$:L#9^"5()M%[-TBX%0=!6L\6#YDJQ0$?)F@M^
MO9BTDH/N!*0SAVH6WI1LRBH8#D4O4-*W6OB5+"7X)$IX[2I9;R&L%"N)KZ0!
M1@V*0DD<4+/93=@Z4[)[2AH-5=A5#5,U-W$HB:[X5)LRON 7GDD0 GQ&2 H#
M*F(V?M=P]P@"_-XQ15<"8INP2:#D!@(E]P^8!+@V0=<N_D(>_.Y+TS )9\3Q
MRK:[:HZ;*@$0- DY(>%$"/X.!D)\:> C+ $_8!D]_"XW)1H2W( RSN+O *5 
M,_ P)0I^H*TBB6_B)T>D U?X?7["&@%^F*&@!\P>OG^ATTV3LLE-0@_L-C.D
MJ(H'JI$P)(3K@ DFL/"GS@@=@: LV@0MX*JDTZJX0*@H<+]:_( 7["]^P!,/
M8)I$'-XU?D".'P!3:?P 7C&-'WAY_, SWVS'_)?I_CD%"K!"6-$.&LNP5U@&
MPR(<*B:,\IT.?F4-/?6UC$Y[^].^1LMHX7<%T<JV2,<?\2TF[AS#)^?H.9II
M=#OH=2 "0*!G-)3LCUM*$ (6?MN=,/NU\.<*2;JJF$Y9^+L"25Q5+#-;^'M<
M"#,_"[]X3=IK47')@*7DQFLE^^,$ Q#V!"S\6BAAK8;@KB0+J%AAW7G7(NFJ
MXFYN"[\W2.H$*O:%"!V6-,"HN!# 4G+2A;#I3.*J9-@B7/)+Z04J@G9;#5>\
M#Y!Z@8I54$+?HHPPA W'.J5SJ< (6/B]W#T88I3D RIN1+ (>]E*>@$))( '
MS%%@ BW"X02TMFW#;"F!"5CX\^64O5'"A)[B"$UTX"+ !#J$:\T(NT)-?+^E
MA!@E#RJP*,A!@K;X^P H,($>X80&05?"??H$G^WA.QAA_.KA]]XIAL6';_P6
ML658>#?  P5,H]O&C^$$H$"]H^)$2==2,4OJXK%(%%WQ.&J\&S0IXRU^4# -
MLZ<"]=W#IW($$W3PN0%:5]-HXI^:2PE<!?>=OEJH0!S=[RU4H,^C>QXQH1X[
M/='7#53 !: I-5P KYB&"^CK!OX>6_2DJ3?IN@'"_4AE\\[&2C+0-=H5P_9Q
M_RIKW-R*F?&.@B!,;.&B&8:$?3XZ.3O^M-4LI=&D7-M R-?K^&D;X<8"_',6
M"1<6U DW6Q+ W80#))0+"P@F(%Q8T.BI>?RT$EBKFF?9XD$T)%W5/-)9Q4Q0
MU8T%2IYY@#\#K^86 -*Y<C5W"RBY[ES-C07X]1#2C04J#(!_\,?N'WJ /ZRN
MYOIL2GC%+[B26DO-/3M*!AA%%E#S[$XE3]G$[[VH>3X!A2M^L95@ <(M5B2N
M2IX7_YJ>>D"X<ZQ.&6&4! +"0Y>5!"W*$*,$GZCHZ5I*KBS XXDI< 0*,JO,
M8<V590:!@J>L,ES:SIU]PUO$U05\11M&JZO@NNFFBK86&!'\E)URWP&^9Q* 
M# W\\7D\D*%-6;:@7'B G["2@ SF]A^!*89^?)>GC-)J9A;X]2 *D,'"IY6$
MD:^!OTF"=/GZYD &L92[BD2K\*[%8!KQH<^=Q/B8A!$UHI8B(0IC?%7^4*S7
M9X_[+E4QRB,;\(^;(=VYL-L)'FG*L/ES.XK\L&J.6]S<YSP9A>3V)@'TE#S]
MA !]+#-BM\"&52TNC%BVI64_[<,81[Y_]3CAU/T82OW5/+P+E8855&CA2PZP
MF(>!+.[-Y]SR4L SLH-X&$9C)K8VA6^;[?HXIE!8O5Z;2-%M=X@4C5Z31M&R
MK&49"U\R#$2YE?+/LZW7?Y:_Y%3LO^?1)3$X:!JS2BJ4K(J=XH^^QX/D&</R
MUN5#._63']GE4;]?T",6R6=/VS@]OJ(1B,=SH CF[^- $2RC<JHZPCR'2Y_;
ML0#(!"YS>0(=DKO04V(P2,S2P 6^+XM_$I@K& '"Z-$HKT$2IL[H8#@-'P<"
MWE/DI4XX>?S&/L*[V/,W<QA0$JJK4;G&<U4]E-1+_O.'WT_./A4U[U: 3=E'
MXV'L'UH=ZY#UP_$,ZS/,W*)<KRL88/QI?($T8NP%*1"R;"@( W?1+*?PSKYD
M'@;1Z$U12[5[[:RM8E1C3;VUEN&PLHCU9MK^?WH3,)HH)+C"-P28;Y7;H%&'
M)+W>Z [,3KUC )LW;ZY&,$ ]<"<5X^JT1=AW+QFQ!'X9AKX??I\"T/A$E#G,
M2.9^$*,="QTGC2+H<=]'PC6G'.'G9.3%S/<"<&N)QK9K3Z"GS"L[^UO6CIWV
MH4"/19Q]%V_/I=BLZ[QY5[/?OZM!M('WZ]!]A/]&R=A___]02P$"% ,*    
M" #0D5PWPV,\/C(;  !MJ0$ $@              I($     97AE8W5T:6]N
?7VQO9RYH=&UL4$L%!@     !  $ 0    &(;      $! 
end

Mime
View raw message