harmony-alerts mailing list archives

Site index · List index
Message view « Date » · « Thread »
Top « Date » · « Thread »
From nom...@intel.com
Subject [build-test alert] FAILED Linux x86: jdktools-test debug
Date Fri, 26 Oct 2007 14:16:22 GMT

BUILD FAILED:
	Ant Error Message:
/export/users/cc/cc-common/scripts/cc-exec-adaptor.xml:104: The following error occurred while
executing this line: /export/users/cc/cc-common/adaptors/jdktools-test/adaptor.xml:28: The
following error occurred while executing this line: /export/users/cc/cc-common/build/checkouts/hdk/working_jdktools/build.xml:242:
The following error occurred while executing this line: /export/users/cc/cc-common/build/checkouts/hdk/working_jdktools/make/build-test.xml:97:
There were test errors.

Date of build:	2007-10-26 20:56:16 +0700
Time to build:	19 minutes 57 seconds
Last changed:	10/26/2007 18:30:27
Last log entry:	hdk

***********************************************************
Errors/Warnings:	(226)
            
Result: 1
========================================
Testing jdktools binaries...
========================================
Compiling JPDA tests
Since fork is false, ignoring memoryMaximumSize setting
----------
1. WARNING in /export/users/cc/cc-common/build/checkouts/hdk/working_jdktools/modules/jpda/test/common/unit/org/apache/harmony/jpda/tests/framework/DebuggeeRegister.java
(at line 58)
registered.add(debuggee);
^^^^^^^^^^^^^^^^^^^^^^^^
Type safety: The method add(Object) belongs to the raw type LinkedList. References to generic
type LinkedList<E> should be parameterized
----------
----------
2. WARNING in /export/users/cc/cc-common/build/checkouts/hdk/working_jdktools/modules/jpda/test/common/unit/org/apache/harmony/jpda/tests/framework/TestOptions.java
(at line 505)
internalProperties.put(name, value);
^^^^^^^^^^^^^^^^^^^^^^^^^^^^^^^^^^^
Type safety: The method put(Object, Object) belongs to the raw type HashMap. References to
generic type HashMap<K,V> should be parameterized
----------
----------
3. WARNING in /export/users/cc/cc-common/build/checkouts/hdk/working_jdktools/modules/jpda/test/common/unit/org/apache/harmony/jpda/tests/framework/jdwp/PacketDispatcher.java
(at line 114)
eventQueue.add(eventPacket);
^^^^^^^^^^^^^^^^^^^^^^^^^^^
Type safety: The method add(Object) belongs to the raw type List. References to generic type
List<E> should be parameterized
----------
4. WARNING in /export/users/cc/cc-common/build/checkouts/hdk/working_jdktools/modules/jpda/test/common/unit/org/apache/harmony/jpda/tests/framework/jdwp/PacketDispatcher.java
(at line 249)
replies.put(new Integer(replyPacket.getId()),
replyPacket);
^^^^^^^^^^^^^^^^^^^^^^^^^^^^^^^^^^^^^^^^^^^^^^^^^^^^^^^^^^^^^^^^^^^^^^^^^^^^^^^^^^^^^^^^^^
Type safety: The method put(Object, Object) belongs to the raw type Hashtable. References
to generic type Hashtable<K,V> should be parameterized
----------
5. WARNING in /export/users/cc/cc-common/build/checkouts/hdk/working_jdktools/modules/jpda/test/common/unit/org/apache/harmony/jpda/tests/framework/jdwp/PacketDispatcher.java
(at line 284)
commands.put(Id, command);
^^^^^^^^^^^^^^^^^^^^^^^^^
Type safety: The method put(Object, Object) belongs to the raw type Hashtable. References
to generic type Hashtable<K,V> should be parameterized
----------
6. WARNING in /export/users/cc/cc-common/build/checkouts/hdk/working_jdktools/modules/jpda/test/common/unit/org/apache/harmony/jpda/tests/framework/jdwp/PacketDispatcher.java
(at line 355)
commands.put(Id, command);
^^^^^^^^^^^^^^^^^^^^^^^^^
Type safety: The method put(Object, Object) belongs to the raw type Hashtable. References
to generic type Hashtable<K,V> should be parameterized
----------
----------
7. WARNING in /export/users/cc/cc-common/build/checkouts/hdk/working_jdktools/modules/jpda/test/common/unit/org/apache/harmony/jpda/tests/framework/jdwp/VmMirror.java
(at line 1834)
frames.add(frame);
^^^^^^^^^^^^^^^^^
Type safety: The method add(Object) belongs to the raw type ArrayList. References to generic
type ArrayList<E> should be parameterized
----------
8. WARNING in /export/users/cc/cc-common/build/checkouts/hdk/working_jdktools/modules/jpda/test/common/unit/org/apache/harmony/jpda/tests/framework/jdwp/VmMirror.java
(at line 1902)
vars.add(var);
^^^^^^^^^^^^^
Type safety: The method add(Object) belongs to the raw type ArrayList. References to generic
type ArrayList<E> should be parameterized
----------
9. WARNING in /export/users/cc/cc-common/build/checkouts/hdk/working_jdktools/modules/jpda/test/common/unit/org/apache/harmony/jpda/tests/framework/jdwp/VmMirror.java
(at line 2122)
fields.add(superClassFields.toArray()[i]);
^^^^^^^^^^^^^^^^^^^^^^^^^^^^^^^^^^^^^^^^^
Type safety: The method add(Object) belongs to the raw type ArrayList. References to generic
type ArrayList<E> should be parameterized
----------
10. WARNING in /export/users/cc/cc-common/build/checkouts/hdk/working_jdktools/modules/jpda/test/common/unit/org/apache/harmony/jpda/tests/framework/jdwp/VmMirror.java
(at line 2132)
fields.add(field);
^^^^^^^^^^^^^^^^^
Type safety: The method add(Object) belongs to the raw type ArrayList. References to generic
type ArrayList<E> should be parameterized
----------
----------
11. WARNING in /export/users/cc/cc-common/build/checkouts/hdk/working_jdktools/modules/jpda/test/common/unit/org/apache/harmony/jpda/tests/jdwp/DebuggerOnDemand/OnthowDebuggerLaunchDebuggee.java
(at line 94)
class ExceptionForDebugger extends Exception {
^^^^^^^^^^^^^^^^^^^^
The serializable class ExceptionForDebugger does not declare a static final serialVersionUID
field of type long
----------
----------
12. WARNING in /export/users/cc/cc-common/build/checkouts/hdk/working_jdktools/modules/jpda/test/common/unit/org/apache/harmony/jpda/tests/jdwp/Events/ClassUnloadDebuggee.java
(at line 32)
import java.util.LinkedList;
^^^^^^^^^^^^^^^^^^^^
The import java.util.LinkedList is never used
----------
13. WARNING in /export/users/cc/cc-common/build/checkouts/hdk/working_jdktools/modules/jpda/test/common/unit/org/apache/harmony/jpda/tests/jdwp/Events/ClassUnloadDebuggee.java
(at line 97)
boolean isOutOfMemory = false;
^^^^^^^^^^^^^
The local variable isOutOfMemory is never read
----------
14. WARNING in /export/users/cc/cc-common/build/checkouts/hdk/working_jdktools/modules/jpda/test/common/unit/org/apache/harmony/jpda/tests/jdwp/Events/ClassUnloadDebuggee.java
(at line 171)
public Class loadClass(String name) throws ClassNotFoundException {
^^^^^
Type safety: The return type Class for loadClass(String) from the type ClassUnloadDebuggee.CustomLoader
needs unchecked conversion to conform to Class<?> from the type ClassLoader
----------
15. WARNING in /export/users/cc/cc-common/build/checkouts/hdk/working_jdktools/modules/jpda/test/common/unit/org/apache/harmony/jpda/tests/jdwp/Events/ClassUnloadDebuggee.java
(at line 179)
public Class findClass(String name) throws ClassNotFoundException {
^^^^^
Type safety: The return type Class for findClass(String) from the type ClassUnloadDebuggee.CustomLoader
needs unchecked conversion to conform to Class<?> from the type ClassLoader
----------
----------
16. WARNING in /export/users/cc/cc-common/build/checkouts/hdk/working_jdktools/modules/jpda/test/common/unit/org/apache/harmony/jpda/tests/jdwp/Events/CombinedEvents002Test.java
(at line 100)
boolean expectColocatedEvents = (testedMethodStartCodeIndex == testedMethodEndCodeIndex);
^^^^^^^^^^^^^^^^^^^^^
The local variable expectColocatedEvents is never read
----------
----------
17. WARNING in /export/users/cc/cc-common/build/checkouts/hdk/working_jdktools/modules/jpda/test/common/unit/org/apache/harmony/jpda/tests/jdwp/Events/CombinedEvents003Test.java
(at line 36)
private boolean eventMethodExitReceived = false;
^^^^^^^^^^^^^^^^^^^^^^^
The field CombinedEvents003Test.eventMethodExitReceived is never read locally
----------
18. WARNING in /export/users/cc/cc-common/build/checkouts/hdk/working_jdktools/modules/jpda/test/common/unit/org/apache/harmony/jpda/tests/jdwp/Events/CombinedEvents003Test.java
(at line 59)
int EXPECTED_EVENTS_COUNT = EXPECTED_EVENTS_ARRAY.length;
^^^^^^^^^^^^^^^^^^^^^
The local variable EXPECTED_EVENTS_COUNT is never read
----------
----------
19. WARNING in /export/users/cc/cc-common/build/checkouts/hdk/working_jdktools/modules/jpda/test/common/unit/org/apache/harmony/jpda/tests/jdwp/Events/CombinedEventsTest.java
(at line 67)
int EXPECTED_EVENTS_COUNT = EXPECTED_EVENTS_ARRAY.length;
^^^^^^^^^^^^^^^^^^^^^
The local variable EXPECTED_EVENTS_COUNT is never read
----------
20. WARNING in /export/users/cc/cc-common/build/checkouts/hdk/working_jdktools/modules/jpda/test/common/unit/org/apache/harmony/jpda/tests/jdwp/Events/CombinedEventsTest.java
(at line 195)
int EXPECTED_EVENTS_COUNT = EXPECTED_EVENTS_ARRAY.length;
^^^^^^^^^^^^^^^^^^^^^
The local variable EXPECTED_EVENTS_COUNT is never read
----------
21. WARNING in /export/users/cc/cc-common/build/checkouts/hdk/working_jdktools/modules/jpda/test/common/unit/org/apache/harmony/jpda/tests/jdwp/Events/CombinedEventsTest.java
(at line 331)
int EXPECTED_EVENTS_COUNT = EXPECTED_EVENTS_ARRAY.length;
^^^^^^^^^^^^^^^^^^^^^
The local variable EXPECTED_EVENTS_COUNT is never read
----------
22. WARNING in /export/users/cc/cc-common/build/checkouts/hdk/working_jdktools/modules/jpda/test/common/unit/org/apache/harmony/jpda/tests/jdwp/Events/CombinedEventsTest.java
(at line 715)
String failureMessage = "## FAILURE during checking events! !";
^^^^^^^^^^^^^^
The local variable failureMessage is never read
----------
23. WARNING in /export/users/cc/cc-common/build/checkouts/hdk/working_jdktools/modules/jpda/test/common/unit/org/apache/harmony/jpda/tests/jdwp/Events/CombinedEventsTest.java
(at line 877)
String failureMessage = "## FAILURE during checking events !";
^^^^^^^^^^^^^^
The local variable failureMessage is never read
----------
----------
24. WARNING in /export/users/cc/cc-common/build/checkouts/hdk/working_jdktools/modules/jpda/test/common/unit/org/apache/harmony/jpda/tests/jdwp/Events/CombinedEventsTestCase.java
(at line 135)
long methodStartCodeIndex = lineTableReply.getNextValueAsLong();
^^^^^^^^^^^^^^^^^^^^
The local variable methodStartCodeIndex is never read
----------
25. WARNING in /export/users/cc/cc-common/build/checkouts/hdk/working_jdktools/modules/jpda/test/common/unit/org/apache/harmony/jpda/tests/jdwp/Events/CombinedEventsTestCase.java
(at line 187)
long methodStartCodeIndex = reply.getNextValueAsLong();
^^^^^^^^^^^^^^^^^^^^
The local variable methodStartCodeIndex is never read
----------
----------
26. WARNING in /export/users/cc/cc-common/build/checkouts/hdk/working_jdktools/modules/jpda/test/common/unit/org/apache/harmony/jpda/tests/jdwp/Events/ExceptionTest.java
(at line 188)
long frameID = reply.getNextValueAsFrameID();
^^^^^^^
The local variable frameID is never read
----------
----------
27. WARNING in /export/users/cc/cc-common/build/checkouts/hdk/working_jdktools/modules/jpda/test/common/unit/org/apache/harmony/jpda/tests/jdwp/ThreadReference/FramesTest.java
(at line 450)
frames.add(new FrameStruct(frameID, loc));
^^^^^^^^^^^^^^^^^^^^^^^^^^^^^^^^^^^^^^^^^
Type safety: The method add(Object) belongs to the raw type Vector. References to generic
type Vector<E> should be parameterized
----------
----------
28. WARNING in /export/users/cc/cc-common/build/checkouts/hdk/working_jdktools/modules/jpda/test/common/unit/org/apache/harmony/jpda/tests/jdwp/share/JDWPUnitDebuggeeProcessWrapper.java
(at line 233)
argv.add(val);
^^^^^^^^^^^^^
Type safety: The method add(Object) belongs to the raw type Vector. References to generic
type Vector<E> should be parameterized
----------
29. WARNING in /export/users/cc/cc-common/build/checkouts/hdk/working_jdktools/modules/jpda/test/common/unit/org/apache/harmony/jpda/tests/jdwp/share/JDWPUnitDebuggeeProcessWrapper.java
(at line 253)
return (String[])argv.toArray(args);
^^^^^^^^^^^^^^^^^^
Type safety: The method toArray(Object[]) belongs to the raw type Vector. References to generic
type Vector<E> should be parameterized
----------
29 problems (29 warnings)
JPDA exclude list: /export/users/cc/cc-common/build/checkouts/hdk/working_classlib/deploy/build/jdktools.jpda.exclude
Running JPDA tests
Debugger JVM=/export/users/cc/cc-common/build/checkouts/hdk/target/hdk/jdk/jre/bin/java
Debuggee JVM=/export/users/cc/cc-common/build/checkouts/hdk/target/hdk/jdk/jre/bin/java
SAMSA exclude list: /export/users/cc/cc-common/build/checkouts/hdk/working_classlib/deploy/build/jdktools.samsa.exclude
Running SAMSA tests
test.jre.home=/export/users/cc/cc-common/build/checkouts/hdk/target/hdk/jdk/jre
Run jdk/bin/java -version in /export/users/cc/cc-common/build/checkouts/hdk/working_jdktools/build/test_report
java version "1.5.0"
pre-alpha : not complete or compatible
svn = r588606, (Oct 26 2007), Linux/ia32/gcc 4.1.0, debug build
http://harmony.apache.org
Run jdk/bin/javac -version in /export/users/cc/cc-common/build/checkouts/hdk/working_jdktools/build/test_report
Run jdk/bin/javah in /export/users/cc/cc-common/build/checkouts/hdk/working_jdktools/build/test_report
Run jdk/bin/javadoc in /export/users/cc/cc-common/build/checkouts/hdk/working_jdktools/build/test_report
Run jdk/bin/jarsigner in /export/users/cc/cc-common/build/checkouts/hdk/working_jdktools/build/test_report
Run jdk/bin/keytool -help in /export/users/cc/cc-common/build/checkouts/hdk/working_jdktools/build/test_report
Compiling TOOLS tests
Since fork is false, ignoring memoryMaximumSize setting
----------
1. WARNING in /export/users/cc/cc-common/build/checkouts/hdk/working_jdktools/modules/tools/src/test/java/org/apache/harmony/tests/tools/javah/Test/Test01.java
(at line 24)
private static final long xxx2 = 1;
^^^^
The field Test01.xxx2 is never read locally
----------
1 problem (1 warning)
TOOLS exclude list: /export/users/cc/cc-common/build/checkouts/hdk/working_classlib/deploy/build/jdktools.tools.exclude
Running TOOLS tests
test.jre.home=/export/users/cc/cc-common/build/checkouts/hdk/target/hdk/jdk/jre
The test report is in /export/users/cc/cc-common/build/checkouts/hdk/working_jdktools/build/test_report/html/index.html
The execution FAILED with the following exception:
The following error occurred while executing this line:
/export/users/cc/cc-common/adaptors/jdktools-test/adaptor.xml:28: The following error occurred
while executing this line:
/export/users/cc/cc-common/build/checkouts/hdk/working_jdktools/build.xml:242: The following
error occurred while executing this line:
/export/users/cc/cc-common/build/checkouts/hdk/working_jdktools/make/build-test.xml:97: There
were test errors.

***********************************************************
Unit Tests: (161)
        
error: testNestedTypes001 org.apache.harmony.jpda.tests.jdwp.ReferenceType.NestedTypesTest
Unit Test Error Details:	(1)
                
Test: testNestedTypes001Class: org.apache.harmony.jpda.tests.jdwp.ReferenceType.NestedTypesTestorg.apache.harmony.jpda.tests.framework.TestErrorException:
org.apache.harmony.jpda.tests.framework.jdwp.exceptions.TimeoutException: Connection was closed
	at org.apache.harmony.jpda.tests.framework.jdwp.VmMirror.performCommand(VmMirror.java:1590)
	at org.apache.harmony.jpda.tests.jdwp.ReferenceType.NestedTypesTest.testNestedTypes001(NestedTypesTest.java:75)
	at java.lang.reflect.VMReflection.invokeMethod(VMReflection.java)
Caused by: org.apache.harmony.jpda.tests.framework.jdwp.exceptions.TimeoutException: Connection
was closed
	at org.apache.harmony.jpda.tests.framework.jdwp.PacketDispatcher.run(PacketDispatcher.java:600)

***********************************************************
Modifications since last successful build:	(1)
            
add cc-hdk log20071026183027Lbuild.336 10/26/2007 18:30:27hdk

begin 644 execution_log.zip
M4$L#! H    (  >J6C>I*2L2E!(  "Q_   2    97AE8W5T:6]N7VQO9RYH
M=&UL[5U[<]LXDO_;^A38V;I:N\JBWL]1?.6SG8TS<>RU',]>I7(IF(0D.A3!
M!4C;VM1\]^L&2$FD)4JR88^26M6,PP?0:/2ON]%H@F!O%(Z]@]X-=R8'O4"P
M@QXE,IQX[,W?!MP/B]+]-^N2=OF_?OW;02$*'!JRHKSSNX5"4;(P"HJWSK>0
M<T\6[R5>C(NDKXH(*AQ'@>?:<-,A@>"WS Z)3\>,N#YQQP$7H44NXNM7/"A^
M8'?,PY(!$^&$.&S@^F[H<E_J8R S<(4,L7Z)/2"!4B29D"7;AO^*-A^/N5^2
MMG"#4)9B0BZ3UL/8(]1W"!U2;#NW^DWD>D[)'C'[&X^ S,CY5KKGXIOK#[\F
M?2R-Z3>6::!0")D,NP6"O\_,'O$OI/!FS5_A"NI""R1I@=RX/A5(VK+6IU*P
M/4;](C(BB\!]$ %#!9L'D^*M8,6!ZS$$QQZ-N9.^$A?IZEX4X7ZD[JC.C+\Y
MKOA"C@136,))]]D2U(6PL:^"(:77:$H6"NI$2RB-U1$?!ZZ'&+R_.#XDNOAK
M\%2R/2HEBQN[I7?4GN>FVJH0R2-A,Z+0(B%_\=;[KH_-037B2C*@GF3[Q!WZ
M7"!'8S;F8G)&']QQ-.Z#MR#@%U![4S2*TU_J<L4BOQ]>?CS]^'<C=JCUM'0+
M/DCUIQ37CL!SE+@8EFA @49I1 5<GLP*RM) @"]"BJ5C=A,-AXQ=LJ$K0R8L
MY#7%-=FE(0$X&&FT]U)W=D1<B3D6=9Q=)Z:U]RM)E_N_);]4J:M) -*D Q9.
MNN1JQ$#6X8B#XP+*YS?H*??(#?.X/U1Z$$()0>])B-4^N/XWYGP 9BQRR0; 
M$8"HB@V9SX1K9XOU3@Z('/'(<X F"2C* SH"@#KK(+GD<G4+ 4;O>AZHH207
MVW(C Z[K@T!\ZEW,7#WXU%T<Q?;)'?4BP'D]F#=%')O1B.^35<B_HW)T1H-<
MV.,RO=_VKU\"]=H6HG[KW >E"VI_8^&Q*P,:0HU<VZY4ZAG\(2+QPW]$+&+*
MN-6IIK@![@8M?*5M/]NJZS\#D-5ZYY&7AE TL5YV3T[!L(=,[.+UB29M#5EX
MZNSN[>VGJ:[XS5%X@B]XXN]%7$A(;SRVTHFH4L]V(XV?0LW:67^!S<)$0^O9
MJ;-/X@MK:\8/#VSS9P"VUL@& O\!=LGEUK;B?3T^<X7@^0-^NY:U8$5%JM%>
M':X$V-CH?B@$G:P<XJ>EGCG.MW]HW#KE:@:W.RHT:G"0B]D/BE?G1\:K6JEF
M\1JXS',T8C*"N=41IB'>ZHLA5U+;W?OL?GER3/6#XEPI_]A UW* 5H<_JT-=
MAN?V)+P4BG&N2YS[QPP#F-*Y#P*]3RY_H)%OCY*$6![4G4>Q+UHP.7FPF<JT
MO.4B(4K80\@@>)K=)-_3=?54:K49CS#7*%SJN?_&H(;DM.EP -OG(7$8E!*,
MX%,.&@+L ]>G7DSG&F" BI].CXG23L('6BU0I9X#^_:DP13L)YBYD"7E93_Y
M'J?..A@_,F;]V(;@J16%KF?-LHF_+D)T/4ASJ&+^V6=W@">(;CT'NCVIJ&=(
MOM/*2/X&N&'4!WF<1^'YX$SEX,D;G9Q?+'N2+W6/VV &$"ZYRI32A*=B%XRN
M)_;M21P]0^R55B4C]R"Z\<!G*#H$R:BCW7ZH'H5@(G@/1AW![Z4N\Y&';WGD
M.RM<'5ECJ!,LC(2OW9%N?\#%(Q[VR$#PL1KY9B4S/3Z*9,C''^ 2(.HS!JX8
MW3P@P!R8R?IWV@OBV AGT,H8#Q6EWG\?+&I TUI+,;8GU?,LQ<AF%%.* 4/*
MGZX861ZV73&6Z<OV9)!2^L+'-[@$09^6RU5\II2K,>7R$A<./8*X]8BC PX3
MBN#*=[%5YIRI"+<?4@%E'';J.^R!O'E#YN^> -3)O6Q O=#[KSL*+.9MX]%@
M&;;;DRW*P[:V"MM:,^L,A'L'\B)3B)%2#-6#&UXRF[EW8%+YXW4N<@NPTQ'K
M8NZ7<9""4J/O3=;";GLR1L_"KI%UY*X?DI-_7IP<79T<?SVY/OEXU?]Z=/[I
MXQ6@E;U^>'EY^+^6Q_QA.%H XI-,;G';QDQN>Q)'RV%;A5DS&PW_))A5MR?9
M\W1P*IT%JR9^"G2V+'7S)'1JM>R,YF=!9TLS+!NATZID;2>>/PRHZT6"G3$I
MZ9 !,K_\]:_D[>'IAT^7)\2)5!G5(SQ08[W\"_G++^LD85;ADVEZ<V"V- &S
M$3#M5G;(>3HP6X++,KBV-''S"*XC*O.GZ+6L+6$.-WY@D)U.J2I7*-=+7+^#
M:W\^LH?P&I?T'<(DUA_N+IQ7/<7A+>1@<[/:TCS*YCBULZ:5AY/X0>!9AMIV
M9C.F2:B5P5T[N]Y9@:4>#9X>+\'GK;Z;"]%*;Q>W8 R(+4L]7(VP0]/GDB4E
MLY7#4KV132K-K5?!=8V*# Q5D1WNQB+<1]'N_?G/T:_A+A>YSV)UD1=:E[YE
M^0L)-UCI_?'O%Y^@1I*1O1 <!"-_%S0(5BP^K-4RJD#%\"Y> N.]SA*8UX*T
MNF5)C&=CU\AB%Z?TX]3]YR]["LQD(0R<R&5IWNGOB::;M*&QAI:W &U\"1 &
M@;$DNW!R3X4/0I%[A4( PPV(OL@>;"]R6/H-+O7>5GP'Y"S#)[^FI985>.Y-
MR8'1C4_BLHG^6*@.5MR0>M5QT?MDEY'O+WB;++E-R'2EPOOKLS<;,@K!"@RY
MZO 6_P=MA"BL-%6Y1ZVPEVCE\RT:S*RK8#F6MAPKMAPM*M5["RW'NG9%&%'O
M# J!(5CQ\@L<]E(4\8(D^!(IJ>R3MWKF([NDO$].< V2/KQRQXPPCP:2.5W2
MLBK-"I',?C:ENE6IUPQ1*I=-\51MMPU1:I@A5+/:[:HAEEIE4P*OYLJ[MBZA
M2M6J5W+E5%V75-NJU5NFU*EF1IU:5JN9*_%-!%7KY#)57Y<4Q.C5>M.0;G::
MIBBU&V;0:X+EE<W9L!FF&E8['[WFVH*J6LW\[JUM,2VK8T@/P)67S0BJ8Y4[
M#5-6W#(U*)0-]0XH57)[M[815QI6M=,Q9L2F*+5;9L #2AU3@UZS92S*J)FA
M!+TS97?ELAGH4#/-Z#BH4\>4P&L-,TH /+5-0=<Q-"0 I59N[S:(?!J&8DV0
M>-V4V54,N2>(->O&!&XL[&F;X0G,SIB&=XS--XQ-\,HU8]&AH;$<9U.F!%XV
MII=-<Y2,N;FF,3G5MFU@024P)?&V,7UZ8L1362"GQH(H[*1_M4[J:)IVQ$RF
M]5&MAL5#]=!$/8(_.3;A&0R-,^@93*E7VU"@" !4C?7.4*2([LJ,!\6)1Z[Q
MK)W3J((:& L26BTSE*![;3-SF):I#""*R=@\O6YJ@M8Q9G>=?'W:I'?Y:<F-
M8LY<=6JLW;N*53<6!'6,=:_<-A:<-\R U[;JAI(L%1Q*S7AR1<J,$5?,Y?$K
MYO(LZ#?-3$);5KMA1L];5BL_5[J!+U^1*MUD5#"4G@:)UW-[MX'$6_G^8!-*
M^3.0]1]3U*UVON?<)/:I& O2J]OV+ ZG1<9&8D/F@G(RY(*M>L=4=% UED*H
M&*-D2 D:5LM0^A8?GQE+ 1H;6QKFYNOU9;U;,"-]^D*)=]R;6V)K(*9I&\I]
M-%M6TU NO&G5#?G5EE4W-N0W#'E#H)2_GF"CN9(9OXK@&9KB0/<,Y>6 )T,S
M9NA>PU J%$C5#3U>:5DU0X]\(*3)?VB[?O=F69A"R"-[5(S?-I%JB_AN<I4I
M M-K;+I5?'?%VKS^X5G_=1;G23J6L]5YR('-?9N"8#YR8,#5^^SKK=3QFP ^
M)[[*)9*0/83[Q.%J_P8>CG!'\U6K^W2_5('4?;QBW0KP[WS,GK_N+MLV?B=@
MNA:/%)-M&@RLC5V\+S\T_<#L+^10#5KDG1ZTB-XMB@G2);OV'CGBP42XPU%(
M*A#Y[9-JN=Q42TWC:GT^".]Q*R:U$095FV!P05Q05\^UF2]!M_8)!5P"]>$(
MW-PRU;SJ;=+97RI6PRK_0E(E0 F+U M&%%C"S9^@ZX''0H;MX#$T"E135>2=
MC^\Q--KM9KFY3W;/[9! : ?,M_;V<;OTZ*'DTEJU-+1M]+T66(_:Y9TH6:5H
MC<(PZ):2=</)& _#?2Z ]BLB>&)[+M@\>8^BU%\9 /S*,-L&P&I6#7LWP_'T
M?\[@3 0HC;("M&610\\CZC9X&09,WC''RNW?Z.6[]?[C:5%]Q(2,F-K,1!NX
M6IQ,<=5RJG3JY!.^3M==%)/%JWVQ!]89?CGD,]>;R'\A/;WS&&[S(@^6TYY6
M2%TEI'C#>:A(@$:.2 __'BA3&;H0Y1%U]=X%0>,":N@O\QWT4#Q#9_$/5VT[
M;$ C+XQW2$-Z.2( AAXQ@[\E#.'Z]I?FAY,>0GB0(H2:A\3TITVF_ CFN(+9
MZ,-=?P.>9,!L=^"J[\ID74V6'X?T="-<3*9,)?RD="[ARHZ_%P)ZDVIL+?:F
M;9'[D6N/'A,=@-O4+T?A.P=43/+9=WTPA&PCI^IB_ &0.753KS% (S0*^1@\
MIMHC))\^^*\;#FXE"Q=N?R3BL1*M'68P^;RF#&N>E@H:U/9\N/-)!!R1?\$$
M2>,W5VDM\4H,590@;R:X,2#8?0;_2R9!72&$RO5L#K=?P;=!0\?8D-[/T,41
M#04)W$]8F,,?#"E#1/@5.!1]W=2(>8&UP+WNS+CY'OO$/\C[PTL52A* D::!
MFRN/NN4.)@OJ+=>BN,X._$A<'5!&>@[6)H]J%[^QB01[8Z27''U5?G!'O9BH
M0Q6M>\G]='UU2;T#,R. IT! 75U=.4 5GF]=2H#! 0)3WI)KCUB?UIVKMD.2
M78G@^K0JV077X;B# >B!WK]K09-[&?:4X  1[9._HITA??4QK[ACN<*%FPKG
MQ=6M_EL5B5O'$$HK'_H(2^5;=E27^)T+,PCJ..K38-2+!X-L@QX82+H&=)?=
M)T,'G 5<RD?!8-%F N(:I3B.*P./3@A> C>#&V))L@L6!*X21L-$+Y'UA,>,
MX$))2>^J?_CUT^6' R29TB68@0'R=!R@HQUQX8:31]6Q;4T"C[XJ0YG7"'4A
MP0"*S3.;)@9R>)B0WHB#"8/T('*3!]^[/;3E@S^4F."VBN; BJ$0B0NI_F&I
M?<*LH:4+6KJ@!2ZD6ZG6Z@N:TK: ?Z> SQM"JKW==U=7%QBB]\^/?NOO/:*&
M  KMX_7X@-1F/A]IVF(2A'PH: #CI:(+,XH$?+&8HJK;2[A+KBJ2&0N3BYG8
MB >U2=^8^G2(@^%B1S!K*,W;S ,L9Q*,S!27Z/ZUDJ-9TQ 3 4L;2W,ZK9#'
M*BJI>5[G[71Y>_/LSE?)XW?LF.=V'._CX;C#^>Q!ML&T=-.5%K/\*!  Y<%!
MG!1Q<'[Y8"!U\EO<=J2B@-2MA*WOQ5[\,0WM*/Z8OZ+'?+S6TX=?U5>W#OZP
M+(L4W_<P"$L*Y7#A\WL_^62'3+.QH[1#L'_M[/Q=SQ992BW@3I2DW.?JH(1L
MX>WL'.%1>HP0["[Q\[CE="2SE=7&FB'4U0<S\PXYN%L>CK2V0.R=J>DP3&; 
M2'+)QOR.$1CD8(J@AO&%#F6GJ*&&&B?J(-4U;$T-N.AZ9>CP*-L>S)^!+M3N
M,YAY*$:QK XH7)',KZ&GF8JH:E#M:@1!JU*[1'.YCA$)R(8FB&3JZNV@H?:I
MWA>:IIC>M4<P%=]#0I0<]2_U#A09$L"@[7$?)#7]!BF41K:5Q!Z75J&/@VA2
M?YB.F#*%(:CR0UO!=X&'*$4MNPRC"I5'L=!.43)OH.M/]0UB4[@8QUDI(LI5
M3+.6P%:66!(YIIG/"1=W9K'Q=1(9S[>HQ+O<E-XA>#G6K)W,]XQ)IU-0$$9T
M=S(UM*:EV\TDF-?X=.?5^?F'_ORW.^-7RF<E&O_YF.:J;1'TF12VWAL!VUJT
M*8+NL2ZL<F3J,XOJ3[F2_W6V);NGIO;G5_O,/#P\5,D;4EFU]\'TMW!K&;U/
M:LR8(OGT75"3K0G(;B79F&#5O@1:*5_CV8?^^UK//K+&]I+//M9X@CX3 7Y#
M0,8/TR$ Z:,SU/M2]RF GO<$?>V5256K8FA)"JYYS'T>N#9/9:L<\_3DAW@Z
ML"F"MRJR<1!.\%*<$)Q>R)YC,JZH \%N0?.OSZ 7@OI2;QL.G'9)HU5NC=/:
M@@:*/!!=!TWS)4+4$G[UO.3BYEX6'A8*$J;<X93O @Q LQ,M!24:H1.!A0(R
MB@-3I ([O;I#C\\J(\DQV:DV_4OVUNJJ*G,W4.Z$VW8D!)C<_<CUIA3A=HBQ
M$CK(;B&G]]2A,,<0<FKTBLOD,GZ(O%MMZPU>#+>\OMPU%_7JG\>&^C[[+%Y0
M#'5:BA^(B^[QC](Y;0I6H5>B![T2>''X>\.="?R#2G+P_U!+ 0(4 PH    (
M  >J6C>I*2L2E!(  "Q_   2              "D@0    !E>&5C=71I;VY?
>;&]G+FAT;6Q02P4&      $  0!     Q!(      
end

Mime
View raw message