harmony-alerts mailing list archives

Site index · List index
Message view « Date » · « Thread »
Top « Date » · « Thread »
From nom...@intel.com
Subject [build-test alert] FAILED Windows 2003 x86: jdktools-test debug
Date Fri, 26 Oct 2007 07:01:34 GMT

BUILD FAILED:
	Ant Error Message:
D:\cc\cc-common\scripts\cc-exec-adaptor.xml:104: The following error occurred while executing
this line: D:\cc\cc-common\adaptors\jdktools-test\adaptor.xml:28: The following error occurred
while executing this line: D:\cc\cc-common\build\checkouts\hdk\working_jdktools\build.xml:242:
The following error occurred while executing this line: D:\cc\cc-common\build\checkouts\hdk\working_jdktools\make\build-test.xml:97:
There were test errors.

Date of build:	2007-10-26 13:21:53 +0700
Time to build:	39 minutes 33 seconds
Last changed:	10/26/2007 08:23:05
Last log entry:	hdk

***********************************************************
Errors/Warnings:	(229)
            
Result: 1
[cc-ant]: Test Suite 'jdktools-test' execution. Repository updated: ${repository.updated}
[cc-ant]: Check for 'run' failure of hdk = ${hdk.parameters.run.failed}
[cc-ant]: Result: failed.superiors = '${failed.superiors}'
========================================
Testing jdktools binaries...
========================================
Compiling JPDA tests
Since fork is false, ignoring memoryMaximumSize setting
----------
1. WARNING in D:\cc\cc-common\build\checkouts\hdk\working_jdktools\modules\jpda\test\common\unit\org\apache\harmony\jpda\tests\framework\DebuggeeRegister.java
(at line 58)
registered.add(debuggee);
^^^^^^^^^^^^^^^^^^^^^^^^
Type safety: The method add(Object) belongs to the raw type LinkedList. References to generic
type LinkedList<E> should be parameterized
----------
----------
2. WARNING in D:\cc\cc-common\build\checkouts\hdk\working_jdktools\modules\jpda\test\common\unit\org\apache\harmony\jpda\tests\framework\TestOptions.java
(at line 505)
internalProperties.put(name, value);
^^^^^^^^^^^^^^^^^^^^^^^^^^^^^^^^^^^
Type safety: The method put(Object, Object) belongs to the raw type HashMap. References to
generic type HashMap<K,V> should be parameterized
----------
----------
3. WARNING in D:\cc\cc-common\build\checkouts\hdk\working_jdktools\modules\jpda\test\common\unit\org\apache\harmony\jpda\tests\framework\jdwp\PacketDispatcher.java
(at line 114)
eventQueue.add(eventPacket);
^^^^^^^^^^^^^^^^^^^^^^^^^^^
Type safety: The method add(Object) belongs to the raw type List. References to generic type
List<E> should be parameterized
----------
4. WARNING in D:\cc\cc-common\build\checkouts\hdk\working_jdktools\modules\jpda\test\common\unit\org\apache\harmony\jpda\tests\framework\jdwp\PacketDispatcher.java
(at line 249)
replies.put(new Integer(replyPacket.getId()),
replyPacket);
^^^^^^^^^^^^^^^^^^^^^^^^^^^^^^^^^^^^^^^^^^^^^^^^^^^^^^^^^^^^^^^^^^^^^^^^^^^^^^^^^^^^^^^^^^^
Type safety: The method put(Object, Object) belongs to the raw type Hashtable. References
to generic type Hashtable<K,V> should be parameterized
----------
5. WARNING in D:\cc\cc-common\build\checkouts\hdk\working_jdktools\modules\jpda\test\common\unit\org\apache\harmony\jpda\tests\framework\jdwp\PacketDispatcher.java
(at line 284)
commands.put(Id, command);
^^^^^^^^^^^^^^^^^^^^^^^^^
Type safety: The method put(Object, Object) belongs to the raw type Hashtable. References
to generic type Hashtable<K,V> should be parameterized
----------
6. WARNING in D:\cc\cc-common\build\checkouts\hdk\working_jdktools\modules\jpda\test\common\unit\org\apache\harmony\jpda\tests\framework\jdwp\PacketDispatcher.java
(at line 355)
commands.put(Id, command);
^^^^^^^^^^^^^^^^^^^^^^^^^
Type safety: The method put(Object, Object) belongs to the raw type Hashtable. References
to generic type Hashtable<K,V> should be parameterized
----------
----------
7. WARNING in D:\cc\cc-common\build\checkouts\hdk\working_jdktools\modules\jpda\test\common\unit\org\apache\harmony\jpda\tests\framework\jdwp\VmMirror.java
(at line 1834)
frames.add(frame);
^^^^^^^^^^^^^^^^^
Type safety: The method add(Object) belongs to the raw type ArrayList. References to generic
type ArrayList<E> should be parameterized
----------
8. WARNING in D:\cc\cc-common\build\checkouts\hdk\working_jdktools\modules\jpda\test\common\unit\org\apache\harmony\jpda\tests\framework\jdwp\VmMirror.java
(at line 1902)
vars.add(var);
^^^^^^^^^^^^^
Type safety: The method add(Object) belongs to the raw type ArrayList. References to generic
type ArrayList<E> should be parameterized
----------
9. WARNING in D:\cc\cc-common\build\checkouts\hdk\working_jdktools\modules\jpda\test\common\unit\org\apache\harmony\jpda\tests\framework\jdwp\VmMirror.java
(at line 2122)
fields.add(superClassFields.toArray()[i]);
^^^^^^^^^^^^^^^^^^^^^^^^^^^^^^^^^^^^^^^^^
Type safety: The method add(Object) belongs to the raw type ArrayList. References to generic
type ArrayList<E> should be parameterized
----------
10. WARNING in D:\cc\cc-common\build\checkouts\hdk\working_jdktools\modules\jpda\test\common\unit\org\apache\harmony\jpda\tests\framework\jdwp\VmMirror.java
(at line 2132)
fields.add(field);
^^^^^^^^^^^^^^^^^
Type safety: The method add(Object) belongs to the raw type ArrayList. References to generic
type ArrayList<E> should be parameterized
----------
----------
11. WARNING in D:\cc\cc-common\build\checkouts\hdk\working_jdktools\modules\jpda\test\common\unit\org\apache\harmony\jpda\tests\jdwp\DebuggerOnDemand\OnthowDebuggerLaunchDebuggee.java
(at line 94)
class ExceptionForDebugger extends Exception {
^^^^^^^^^^^^^^^^^^^^
The serializable class ExceptionForDebugger does not declare a static final serialVersionUID
field of type long
----------
----------
12. WARNING in D:\cc\cc-common\build\checkouts\hdk\working_jdktools\modules\jpda\test\common\unit\org\apache\harmony\jpda\tests\jdwp\Events\ClassUnloadDebuggee.java
(at line 32)
import java.util.LinkedList;
^^^^^^^^^^^^^^^^^^^^
The import java.util.LinkedList is never used
----------
13. WARNING in D:\cc\cc-common\build\checkouts\hdk\working_jdktools\modules\jpda\test\common\unit\org\apache\harmony\jpda\tests\jdwp\Events\ClassUnloadDebuggee.java
(at line 97)
boolean isOutOfMemory = false;
^^^^^^^^^^^^^
The local variable isOutOfMemory is never read
----------
14. WARNING in D:\cc\cc-common\build\checkouts\hdk\working_jdktools\modules\jpda\test\common\unit\org\apache\harmony\jpda\tests\jdwp\Events\ClassUnloadDebuggee.java
(at line 171)
public Class loadClass(String name) throws ClassNotFoundException {
^^^^^
Type safety: The return type Class for loadClass(String) from the type ClassUnloadDebuggee.CustomLoader
needs unchecked conversion to conform to Class<?> from the type ClassLoader
----------
15. WARNING in D:\cc\cc-common\build\checkouts\hdk\working_jdktools\modules\jpda\test\common\unit\org\apache\harmony\jpda\tests\jdwp\Events\ClassUnloadDebuggee.java
(at line 179)
public Class findClass(String name) throws ClassNotFoundException {
^^^^^
Type safety: The return type Class for findClass(String) from the type ClassUnloadDebuggee.CustomLoader
needs unchecked conversion to conform to Class<?> from the type ClassLoader
----------
----------
16. WARNING in D:\cc\cc-common\build\checkouts\hdk\working_jdktools\modules\jpda\test\common\unit\org\apache\harmony\jpda\tests\jdwp\Events\CombinedEvents002Test.java
(at line 100)
boolean expectColocatedEvents = (testedMethodStartCodeIndex == testedMethodEndCodeIndex);
^^^^^^^^^^^^^^^^^^^^^
The local variable expectColocatedEvents is never read
----------
----------
17. WARNING in D:\cc\cc-common\build\checkouts\hdk\working_jdktools\modules\jpda\test\common\unit\org\apache\harmony\jpda\tests\jdwp\Events\CombinedEvents003Test.java
(at line 36)
private boolean eventMethodExitReceived = false;
^^^^^^^^^^^^^^^^^^^^^^^
The field CombinedEvents003Test.eventMethodExitReceived is never read locally
----------
18. WARNING in D:\cc\cc-common\build\checkouts\hdk\working_jdktools\modules\jpda\test\common\unit\org\apache\harmony\jpda\tests\jdwp\Events\CombinedEvents003Test.java
(at line 59)
int EXPECTED_EVENTS_COUNT = EXPECTED_EVENTS_ARRAY.length;
^^^^^^^^^^^^^^^^^^^^^
The local variable EXPECTED_EVENTS_COUNT is never read
----------
----------
19. WARNING in D:\cc\cc-common\build\checkouts\hdk\working_jdktools\modules\jpda\test\common\unit\org\apache\harmony\jpda\tests\jdwp\Events\CombinedEventsTest.java
(at line 67)
int EXPECTED_EVENTS_COUNT = EXPECTED_EVENTS_ARRAY.length;
^^^^^^^^^^^^^^^^^^^^^
The local variable EXPECTED_EVENTS_COUNT is never read
----------
20. WARNING in D:\cc\cc-common\build\checkouts\hdk\working_jdktools\modules\jpda\test\common\unit\org\apache\harmony\jpda\tests\jdwp\Events\CombinedEventsTest.java
(at line 195)
int EXPECTED_EVENTS_COUNT = EXPECTED_EVENTS_ARRAY.length;
^^^^^^^^^^^^^^^^^^^^^
The local variable EXPECTED_EVENTS_COUNT is never read
----------
21. WARNING in D:\cc\cc-common\build\checkouts\hdk\working_jdktools\modules\jpda\test\common\unit\org\apache\harmony\jpda\tests\jdwp\Events\CombinedEventsTest.java
(at line 331)
int EXPECTED_EVENTS_COUNT = EXPECTED_EVENTS_ARRAY.length;
^^^^^^^^^^^^^^^^^^^^^
The local variable EXPECTED_EVENTS_COUNT is never read
----------
22. WARNING in D:\cc\cc-common\build\checkouts\hdk\working_jdktools\modules\jpda\test\common\unit\org\apache\harmony\jpda\tests\jdwp\Events\CombinedEventsTest.java
(at line 715)
String failureMessage = "## FAILURE during checking events! !";
^^^^^^^^^^^^^^
The local variable failureMessage is never read
----------
23. WARNING in D:\cc\cc-common\build\checkouts\hdk\working_jdktools\modules\jpda\test\common\unit\org\apache\harmony\jpda\tests\jdwp\Events\CombinedEventsTest.java
(at line 877)
String failureMessage = "## FAILURE during checking events !";
^^^^^^^^^^^^^^
The local variable failureMessage is never read
----------
----------
24. WARNING in D:\cc\cc-common\build\checkouts\hdk\working_jdktools\modules\jpda\test\common\unit\org\apache\harmony\jpda\tests\jdwp\Events\CombinedEventsTestCase.java
(at line 135)
long methodStartCodeIndex = lineTableReply.getNextValueAsLong();
^^^^^^^^^^^^^^^^^^^^
The local variable methodStartCodeIndex is never read
----------
25. WARNING in D:\cc\cc-common\build\checkouts\hdk\working_jdktools\modules\jpda\test\common\unit\org\apache\harmony\jpda\tests\jdwp\Events\CombinedEventsTestCase.java
(at line 187)
long methodStartCodeIndex = reply.getNextValueAsLong();
^^^^^^^^^^^^^^^^^^^^
The local variable methodStartCodeIndex is never read
----------
----------
26. WARNING in D:\cc\cc-common\build\checkouts\hdk\working_jdktools\modules\jpda\test\common\unit\org\apache\harmony\jpda\tests\jdwp\Events\ExceptionTest.java
(at line 188)
long frameID = reply.getNextValueAsFrameID();
^^^^^^^
The local variable frameID is never read
----------
----------
27. WARNING in D:\cc\cc-common\build\checkouts\hdk\working_jdktools\modules\jpda\test\common\unit\org\apache\harmony\jpda\tests\jdwp\ThreadReference\FramesTest.java
(at line 450)
frames.add(new FrameStruct(frameID, loc));
^^^^^^^^^^^^^^^^^^^^^^^^^^^^^^^^^^^^^^^^^
Type safety: The method add(Object) belongs to the raw type Vector. References to generic
type Vector<E> should be parameterized
----------
----------
28. WARNING in D:\cc\cc-common\build\checkouts\hdk\working_jdktools\modules\jpda\test\common\unit\org\apache\harmony\jpda\tests\jdwp\share\JDWPUnitDebuggeeProcessWrapper.java
(at line 233)
argv.add(val);
^^^^^^^^^^^^^
Type safety: The method add(Object) belongs to the raw type Vector. References to generic
type Vector<E> should be parameterized
----------
29. WARNING in D:\cc\cc-common\build\checkouts\hdk\working_jdktools\modules\jpda\test\common\unit\org\apache\harmony\jpda\tests\jdwp\share\JDWPUnitDebuggeeProcessWrapper.java
(at line 253)
return (String[])argv.toArray(args);
^^^^^^^^^^^^^^^^^^
Type safety: The method toArray(Object[]) belongs to the raw type Vector. References to generic
type Vector<E> should be parameterized
----------
29 problems (29 warnings)
JPDA exclude list: D:\cc\cc-common\build\checkouts\hdk\working_classlib\deploy\build\jdktools.jpda.exclude
Running JPDA tests
Debugger JVM=D:\cc\cc-common\build\checkouts\hdk\target\hdk\jdk\jre/bin/java
Debuggee JVM=D:\cc\cc-common\build\checkouts\hdk\target\hdk\jdk\jre/bin/java
SAMSA exclude list: D:\cc\cc-common\build\checkouts\hdk\working_classlib\deploy\build\jdktools.samsa.exclude
Running SAMSA tests
test.jre.home=D:\cc\cc-common\build\checkouts\hdk\target\hdk\jdk\jre
Run jdk/bin/java -version in D:\cc\cc-common\build\checkouts\hdk\working_jdktools\build\test_report
java version "1.5.0"
pre-alpha : not complete or compatible
svn = r588463, (Oct 26 2007), Windows/ia32/msvc 1310, debug build
http://harmony.apache.org
Run jdk/bin/javac -version in D:\cc\cc-common\build\checkouts\hdk\working_jdktools\build\test_report
Run jdk/bin/javah in D:\cc\cc-common\build\checkouts\hdk\working_jdktools\build\test_report
Run jdk/bin/javadoc in D:\cc\cc-common\build\checkouts\hdk\working_jdktools\build\test_report
Run jdk/bin/jarsigner in D:\cc\cc-common\build\checkouts\hdk\working_jdktools\build\test_report
Run jdk/bin/keytool -help in D:\cc\cc-common\build\checkouts\hdk\working_jdktools\build\test_report
Compiling TOOLS tests
Since fork is false, ignoring memoryMaximumSize setting
----------
1. WARNING in D:\cc\cc-common\build\checkouts\hdk\working_jdktools\modules\tools\src\test\java\org\apache\harmony\tests\tools\javah\Test\Test01.java
(at line 24)
private static final long xxx2 = 1;
^^^^
The field Test01.xxx2 is never read locally
----------
1 problem (1 warning)
TOOLS exclude list: D:\cc\cc-common\build\checkouts\hdk\working_classlib\deploy\build\jdktools.tools.exclude
Running TOOLS tests
test.jre.home=D:\cc\cc-common\build\checkouts\hdk\target\hdk\jdk\jre
The test report is in D:\cc\cc-common\build\checkouts\hdk\working_jdktools\build\test_report\html\index.html
The execution FAILED with the following exception:
The following error occurred while executing this line:
D:\cc\cc-common\adaptors\jdktools-test\adaptor.xml:28: The following error occurred while
executing this line:
D:\cc\cc-common\build\checkouts\hdk\working_jdktools\build.xml:242: The following error occurred
while executing this line:
D:\cc\cc-common\build\checkouts\hdk\working_jdktools\make\build-test.xml:97: There were test
errors.

***********************************************************
Unit Tests: (161)
        
error: testReflectedType001 org.apache.harmony.jpda.tests.jdwp.ClassObjectReference.ReflectedTypeTest
Unit Test Error Details:	(1)
                
Test: testReflectedType001Class: org.apache.harmony.jpda.tests.jdwp.ClassObjectReference.ReflectedTypeTestorg.apache.harmony.jpda.tests.framework.TestErrorException:
Debuggee process did not finish during timeout
	at org.apache.harmony.jpda.tests.jdwp.share.JDWPUnitDebuggeeProcessWrapper.WaitForProcessExit(JDWPUnitDebuggeeProcessWrapper.java:284)
	at org.apache.harmony.jpda.tests.jdwp.share.JDWPUnitDebuggeeProcessWrapper.finishProcessAndRedirectors(JDWPUnitDebuggeeProcessWrapper.java:87)
	at org.apache.harmony.jpda.tests.jdwp.share.JDWPUnitDebuggeeWrapper.stop(JDWPUnitDebuggeeWrapper.java:109)
	at org.apache.harmony.jpda.tests.jdwp.share.JDWPTestCase.internalTearDown(JDWPTestCase.java:108)
	at org.apache.harmony.jpda.tests.jdwp.share.JDWPSyncTestCase.internalTearDown(JDWPSyncTestCase.java:83)
	at org.apache.harmony.jpda.tests.jdwp.share.JDWPRawTestCase.tearDown(JDWPRawTestCase.java:118)
Caused by: java.lang.IllegalThreadStateException: process has not exited
	at java.lang.Runtime$SubProcess.exitValue(Runtime.java:357)
	at org.apache.harmony.jpda.tests.jdwp.share.JDWPUnitDebuggeeProcessWrapper.WaitForProcessExit(JDWPUnitDebuggeeProcessWrapper.java:279)
	at org.apache.harmony.jpda.tests.jdwp.share.JDWPUnitDebuggeeProcessWrapper.finishProcessAndRedirectors(JDWPUnitDebuggeeProcessWrapper.java:87)
	... 14 more

***********************************************************
Modifications since last successful build:	(1)
            
add cc-hdk log20071026082305Lbuild.294 10/26/2007 08:23:05hdk

begin 644 execution_log.zip
M4$L#! H    ( "]P6C=F[C!+1Q(  $I_   2    97AE8W5T:6]N7VQO9RYH
M=&UL[5UM<]LXDO[L5.4_8&?K:NTJB]'[BU?QE<]V-L[$<<YR,G<5Y5(P"4E,
M*((+D+:UJ?GOUPV0DDA*E"S#L9):U8Q#@D"CT4]WH]$DP>XH''N'W6ON3 Z[
M@6"'74ID./'8R[\-N!^6I/LO=D#:Y?_X^]\.GS^+ H>&K"1O_(/GSYX_*TD6
M1D'IJ_,MY-R3I5NIB^-JV7(18;.3*/!<&ZX[)!#\*[-#XM,Q(ZY/W'' 16B1
M]W'Y%0]*;]D-\[!FP$0X(0X;N+X;NMR7^AC(#%PA0VQ_<M"W;?BO9//QF/M]
M:0LW"&4_;NTR:=V-/4)]A] AQ0[S;:XCUW/Z]HC9WW@$;4?.M_XM%]]<?_@E
M&5!_3+^Q#%4<8,AD"",D^/O$[!'_3)Z]7//W[ H:0R<DZ81<NSX52-VRUJ>"
M;-@>HWX)F9$E&$,0A4K\-@\FI:^"E0:NQS0B]FC,G6Q97.T@&5$)ZD3ZJAK8
M^)OCBL_D6# %(IP<;"9%70F[^"(8(O]X'4@<C#K5<LF@=,S'@>NA]-^\/SDB
M<8M'8Z9O>U1*EG3QE=Y0>YZ):JM")(^$S8C"A83\D?KLN3YV NV(*\F >I+M
M$W?H<X%\C-F8B\DYO7/'T;@'GH" P:.2IHF4IK]T><4B?QQ=OCM[]X_-#4VK
M7O\K>!0UCG[<.@(GT.=BV*<!!1K]$150/)E5E/V! +>"%/LG[#H:#AF[9$-7
MADQ8R&":5[)+0P+"9Z31WDM?VA%Q,^98U'%VG9C:WM])IN+_+?FEJUU- A D
M';!P<D"N1@S$'(XXN"2@?7&-CF^/7#./^T,%? @U!+TE(39[Z_K?F/,6V+'(
M)1L 3X"?JC9D/A.NG:W6/3TD<L0CSP&:)* H$Q@*8.FL!^*R\NJV@(M^\R)0
M,T(QKN5&%EC7!U'XU'L_\^3@+'=Q.MHG-]2+ .,U(;XWVMB11GN?K$+]-96C
M<QH40A[7Z?Z^__&1$*]M"^)?G=N@_Y[:WUAXXLJ AM"BV*8KE7H6>P@K_/"_
M(Q8Q9=3J5-.\#^8F+7NE31NPYOK/BV&UWLD[9@@E$Z-EM^0,['G(Q"Z63S1Q
M:\C",V=W;V\_0W?%;X[$)CY@T]_C^(Z07GMLI?=0M0SXC\9/K&/MG)_ CF'!
MH)7LS-DG<<'Z6O$K8-K\>3&M-7+S_K\Q+2IO;176'\?GKA!\Q?S>KN4,5]&1
M:G)7AZO!-3>9'PE!)RMG]&FM!T_K[9\0LDZYFH7LA@H-&!P4P_7S0M7Y^:"J
M5JHYJ 8N\QP-EHQ@\72,V857NC#D2ER[>Y_<SYL'3S\OQ)7RSXAQK0AC=?@K
M>]"E6#YQ$DLA&.>OQ(5_PC!.Z5_X(,C;I/@MC7Q[E"2Y"F'NY.-;-%QR>F<S
ME4-YQ45"EK"[D$&4-+M(OF<:Z[72&M8[PM2A<*GG_@NC%U+0J\,!:)^'Q&%0
M2S""-R1H") /7)]Z,9V/3$AH^.'LA"C=)'R@50+5Z8&0/W%J2T%^BOD(V5=N
M]8/O<>JLA6_>B/4]%8*G5A2ZGC7+#6;-F=P'S@*ZF$KVV0U@&<FU?>839Y<>
M(O1.*ROT:^"'41\$<1&%%X-SE4<G+W6"?8G8R0J!>]P&[8?(R%46E"8]E;A@
M=%V)/W$NZ"$2K[0J69$'T;4'/D)1(DA('>WV0G4G U.Z>S##"'XK=9UW/'S%
M(]]9Y=S(.A.;8&$D?.V - <#+G)<[)&!X&,US\UJ9D9]',F0C]]"$8#I,P;N
M%YT[H, <6*;Z-]KOX4P(9]#+& \5I>Y_'B[J0--:4R>>.'?S,)W(Y0=3.@&S
MQQ;H1):+[=>)I;KRQ#FAE*[P\34^"J!/R^4JWA0JUI9R>9G39G<!A*;''!UN
MF- $Y[V+_3+G7 6QO9 *J..P,]]A=^3E2S)_]11 3J[EHN:%_GYMO[^8NPW\
M_U)<GSC_4X1K;26NM6;."0CW!B1%IO BK1BF.S>\9#9S;\"05LS.A:@MPDV'
MI8M'L(R'%(P:>6^R)FQ/G -Z&&R-G.]V_9"<_L_[T^.KTY,OIQ]/WUWUOAQ?
M?'AW!4!ERX\N+X_^U_*8/PQ'B_#;S-(6]V[2TIXX%[0<LI5X-7,A[R^$5_6)
M\S</P*726?20PR\#S#8D8S8#IE;+K5A^)6"V*65R/V!:E9S%Q.N# 76]2+!S
M)B4=,@#EM[_^E;PZ.GO[X?*4.)&JH\:$!VI&EW\A?_EMK:S*2F@RG6^"R39E
M5.Z'2;N5FUXVQV2+(%D*U3:E8G)0'5.Y8N5=RYD09F'C=']VI:3:7*%$+_$9
M&WQ YQV["S_BXW9'L#+UA[N+ETP;N;B%/&QB3=N4&=D HG;.HHH@$C\1,DL1
MVZ+\Q#2AM#J :^<>/U9 J7MZ9R=+L'FEKQ;#L]K!Q7V8!&$;D@E7(QS(]#9B
M7TEK]2Q4;^121'//E.#SAHH0S$R1'>[&PMM'H>YMPUWOCW"5B\+;I[K*XSTB
MO@TI"0D76/_-R1_O/T"+)*?Z7G 0B/Q#T"!8]4Q@K995 RJ&-_%S*MZ/>D[E
MQ\%9W8:TQ,-A:^1@BS/R<>;]T^<]A6/RM J<R*6YVNEO4XM->M$P0]]; 32^
M5P>>?RS)+IS<4N&#8.0>OBP5P#P#$)38G>U%#LN\,*5>DXHO@;QE>+^7HM3M
M?\^][CLPF?%)7#?1'@N5P8JIQR\.+GQMZS+R_44O;277"9D^5?#FX_G+=3B$
M< 2F5G7X%?\7[ 7$6B]FFI:CS<S1_O05S6,V+K 32]N)%=N)%HT:JH5V8GUT
M11A1[QPJ@=9;\6,1.+>E26*))/@&)JGLDU=Z*2,/2'F?G.+#0?KPRATSPCP:
M2.9 Q2J1S#9 IVS5FQUCM!JMMCE:E88Y6O66.7G5-J-5R=%J=ZQJN;* V&GO
M:AT%4_<+M=>:>B0+CCPH8 ZZ.V1+K<%/3XR,O=5I%HZ]MBZM6M6JK=#AZKJT
MJA6K6=]*%6Z6BTUK?7%5K'JGF%9]75J-YL8JO&B,[99!,ZTMLH8-:'7J5KEI
MB%:E8E6JYL;8:A:;4'-=6LT&N.YB7;V/"95-R1Y=9*-F3/8&16]2[9MM@[0:
MQ2JQMFG7*U:K;0[&57P]761@D*^FN4C*Y!AK!MUJS5R 5R^;$WW-%"F8'*L&
MXV&#7L*D=JU \3Z^OMXV%2]5C"JJ.;[**^?&7\%)= RJ?:ML:LZ&,6YA)&%8
MNTSZ08/K;X-!G,GUM\E(PJ2O;W0,JH3!></8U&A4NU8M9^]G0 :E53>'8JUA
M<(P&-6)+'4ZK5BSZM3,<]:I5[ICS]<V6.2=ADE;;H'K56B:C)8-JOZW!N,$D
M\*J)H[%V-JYF-M%MD)91'-L&,V@K?,[:M*KF7&'5H#D:9LN485=6!N/K+T'!
M$5;-+8-,TFI5S#E"D\NS5;'7?63?6>%4[T5K15RR_BV.NE4UN 0U&2\9782:
M7"68# "V,5:%F+!NB%3'JA@,X^HU<Q['9%JBU=S2Z7]++:B KT5WS3=_^.,U
M]^:>"3; >\.JU WE>EH0@K9,R;1F<"E1,Q@VU@SFQH!6TZ ^K[BQ?Q\<C=$R
M+"]CF2/455-3@F&]-Y?CQ/M9IFP;,UKQ7/7\6<@C>U2*7Y:1:F/Y@UDY4T3F
M2MET@_F#U8\=]H[.>X_XW*&D8SGWX"'V:W/?IB"7=QRZ=?4._7I/=OR*@,^)
MS_"U?Q*RNW"?.%QM+,'#D=HD??63BWI JD:Z A997P7X?CYF&SY=F.L2ORTP
M?>20E))](S9]R'?)_OW0X1VS/Y,C-7F1UWKR(GJ7*B;( =FU]\@Q#R;"'8Y"
M4NET0-6J90CH\('9N%F/#\);W/Y)[<A!U6X<7! 7M--S;>9+4*-]0@&'0'U/
M G?.3/>O!IF,\;>*U;#*OY%T%="V$O6"$06F<,LI&'W@L9!A3W@,W0+==!MY
MX^-;&(UVN]Z$A<?NA1V2:A/Y;^WMDS]<W^&W\H5+:]478WEC@]56P&+4IO%$
M22Q-;A2&P<&+%\D4'\_X,/D7HV<_.GRGMN>"?9,W*$;];0( #\*_%J!5LVH6
MC&H&XME_G<.9"% .985FRR)'GD?49? H3#)QPQRK>%BCQQK-FW=G)?5=$S)B
M:A\5;<3JL6J*SUNGJZ?//N +?P>+(K+X>67DW#K'+XI\XGHK^L^DJ_<XPUUF
MY&$1]6F3=#$AI6O.0T4%%'%$NOCW4-G(T(4PCZC26Q>$C,]_PZB9[Z KXEE"
MBW_XU+G#!C3RPG@_-B18* C@*<</_I;PA$_I_P"6..DBFH<I4JA[2$Y_ &7*
MDF".*]2CJZ!I]V%+!LQV!Z[ZW$S.U>18<DA7]\/%9,I7PE)* Q/&[/@#(Z!#
MJ>[6XW#:&;D=N?8H3W4 GE._V(4O4% Q634"UP?+R'9SI@KC+XG,J9YZ*P.Z
MH5'(Q^ TU;XEJWH _W7-P<%D8</MF$0\/Z('@ 7-*GY3MC9/3<4(:F] W)$E
M J[(/V'%I(&<:[2>E"7&)DJ>UQ/<EA!\0583+ID$Y87@J=C/.=Q^-$\'Y$^0
MO-Y%T<49#64(7$]86,063"=#Q/?1&!,]W<&(>8&UR,7NS)CX'GO%/\F;HTL5
M+Q+ C6:0FFN ^N0.)@L:%FE.W&H'?B0F , B10?;DWS[TC<VD6!JC'23HR_*
M$^ZH]REUH*(5+KF>(:#*U(L\,PIX"A14Z1JM ]3<^?ZE!#@<H##E+BG+<S]M
M/-=NAR3[)$'YM"W9!<?AN(,!A!IZ'[$%?>YE&532 V"T6_Z"!H8=J*]\Q6,K
MEC!<58 O;F_U7JG@VSJ!T%DYT3RDRK'LJ%'Q&Q?6"M1QU%?#J!?/"+DN/;"1
M=!,8,KM-)A X"[B4^7BP9#,! 8[2(,>5@4<G!(O Q^ .79+L1L#+K0OS8J*B
MR'W"959ZH:2D>]4[^O+A\NTATDPI%:R[0 'H.$!7.^+"#2?Y]MB[IH%'7Y39
MS&N&*DB0@&KS[&:H@2SN)J0[XF#3($*(XN3A]X,N&O?AGTI4<%E%=F#54(G$
ME=00L=8^8=;0TA4M7=$"GW)0J=;JB_K29H%_I[C/VT2JP]W75U?O,53O71S_
MWLL*,H91:"^O9P@D-_/Z2-06DR#D0T$#F#<585A<)"H@EI!4C;L)?TFIHIFU
M-KF8C7MQH38.'%.?#G%*7.(69CVEN9OY@P(VP>!,\8FS@M9VM'$:8A)@>6]I
M7J<M"IE%;37/[;S)%G0XS_!\FT*.QXYY?L?Q-B2..TQE#[(]IB6<;K6$Z5QH
M #J$,SPIX<3]6.%!^NSWN,M(Q07I:PD[WTO=^,,=VE?\.5^BHP LZ^K#+^J#
M7H=_6I9%2F^Z&(4EE0H9\?FMGWP@1&8XV5&Z(=@_=W;^H5>2+*44<"6:IN+G
M&J&@;.'M[!SC47JZ$.PF\?BX[W64C7A*>L?/$!KK@YF)AQS\+@]'6ED@$,\V
M=1AF-V!6N61C?L,(3'FP9% 3^V*WLE-B=P@5-#E5!ZGA87]J!D8G+$.'9Z?5
MG1(LL($R-.\Q6(LH7K&R#C)<D2S 8;39EJAKT.YJ!(&LTKM$=[D.( D(B"; 
M9!OKW:FA^9G>IIJF^-ZU1[!6WT-*E!SW+O6>&ED:P*/M<1_$-?UD*51'SI78
M%E17(9&#J%)_F(ZDLK4AVO)#6\'X'@]1EEJ"&5X5./D8::<DF3?0!*:J!Y$K
M%,8!6(J*<AG3!"8PEJ.61)5I_HM"R9U9[/PQB9SG^U1"+C*MUXABD8%K?_,]
M8^69-!6$%P<[F29:Z[)]Y[/-ZWP1].KBXFTO]4G0^/7Y697&O[_6F=KU09])
M8>NM'["#17L^Z)'JRBJ%IK[EJ/Z4*RN^!;=LE]?4IP+4SCEW=W=5\I)45F[M
M,/TMWBQ'[^<:,Z>(/F2WUF3G!;);2?9=6&/;!:V+CW;_0__]D?<_<L9E_O['
M&O?59Z/'+QG(^!8[A" ]=']ZL^P>!:0+[ZNO_413S6J:>N&TL>(UF+5Y*EOE
MY';S0V_AZ?"F!&ZJQ,9!.-&%<9)PKBA?@@FZDHX-X5P/1Y_"H 3UI=[;'!@_
M(/56HSS.* V:*7)#=",T4&/!:A\_E-YW<9<R"P^17PDK\'#&\/-G,._,GVI!
M*/D(G1=\_NP9,HDS4J1"//T$B)Z?58Z28P)4[5Z8[!EVH)K,74#Y$V[;D1!@
M>;<CUYM2A,LA!DSH)?%;ZYFA4X?""D/(J<DKYI)B_(SY0;6M]ZTQTM_ZHM9]
MUZL_NG/U)?=9&*#8Z+04%Q#XW.(?I5%:Z2T M?N"'G9?@)^&O]?<F< _J ^'
M_P]02P$"% ,*    "  O<%HW9NXP2T<2  !*?P  $@              I($ 
K    97AE8W5T:6]N7VQO9RYH=&UL4$L%!@     !  $ 0    '<2      $! 
end

Mime
View raw message