harmony-alerts mailing list archives

Site index · List index
Message view « Date » · « Thread »
Top « Date » · « Thread »
From nom...@intel.com
Subject [build-test alert] FAILED Linux x86_64: struts_test
Date Fri, 26 Oct 2007 02:44:55 GMT
svn.revision=588030
BUILD FAILED:
	Ant Error Message:
/export/users/cc/cc-suites/scripts/cc-exec-adaptor.xml:104: The following error occurred while
executing this line: /export/users/cc/cc-suites/adaptors/struts_test/adaptor.xml:67: The following
error occurred while executing this line: /export/users/cc/cc-suites/adaptors/struts_test/adaptor.xml:229:
Test failed

Date of build:	2007-10-26 09:44:18 +0700
Time to build:	30 seconds
Last changed:	10/25/2007 17:02:40
Last log entry:	snapshot

***********************************************************
Errors/Warnings:	(2)
            
The execution FAILED with the following exception:
The following error occurred while executing this line:
/export/users/cc/cc-suites/adaptors/struts_test/adaptor.xml:67: The following error occurred
while executing this line:
/export/users/cc/cc-suites/adaptors/struts_test/adaptor.xml:229: Test failed

***********************************************************
Unit Tests: (1)
        
error: unknown org.apache.harmony.struts.test.WebAppTest
Unit Test Error Details:	(1)
                
Test: unknownClass: org.apache.harmony.struts.test.WebAppTestjunit.framework.AssertionFailedError:
Lines number mismatch: local=244, remote=22
	at org.apache.harmony.struts.test.WebAppTest.checkResponse(Unknown Source)
	at org.apache.harmony.struts.test.WebAppTest.performTest(Unknown Source)
	at org.apache.harmony.struts.test.WebAppTest.visitAnchors(Unknown Source)
	at org.apache.harmony.struts.test.WebAppTest.visitAnchors(Unknown Source)
	at org.apache.harmony.struts.test.WebAppTest.launchSpiderR(Unknown Source)
	at org.apache.harmony.struts.test.WebAppTest.test(Unknown Source)
	at org.junit.internal.runners.TestMethodRunner.executeMethodBody(TestMethodRunner.java:99)
	at org.junit.internal.runners.TestMethodRunner.runUnprotected(TestMethodRunner.java:81)
	at org.junit.internal.runners.BeforeAndAfterRunner.runProtected(BeforeAndAfterRunner.java:34)
	at org.junit.internal.runners.TestMethodRunner.runMethod(TestMethodRunner.java:75)
	at org.junit.internal.runners.TestMethodRunner.run(TestMethodRunner.java:45)
	at org.junit.internal.runners.TestClassMethodsRunner.invokeTestMethod(TestClassMethodsRunner.java:71)
	at org.junit.internal.runners.TestClassMethodsRunner.run(TestClassMethodsRunner.java:35)
	at org.junit.internal.runners.TestClassRunner$1.runUnprotected(TestClassRunner.java:42)
	at org.junit.internal.runners.BeforeAndAfterRunner.runProtected(BeforeAndAfterRunner.java:34)
	at org.junit.internal.runners.TestClassRunner.run(TestClassRunner.java:52)
	at junit.framework.JUnit4TestAdapter.run(JUnit4TestAdapter.java:32)

***********************************************************
Modifications since last successful build:	(1)
            
add cc-snapshot log20071025170240Lbuild.26 10/25/2007 17:02:40snapshot

begin 644 execution_log.zip
M4$L#! H    ( )E-6C<&^X$IQP(  ,L&   2    97AE8W5T:6]N7VQO9RYH
M=&ULQ55;;],P%'[OKS@O: _,<9*MM]!5JG81H''1& )IFI#KG#;>DCBRG5X0
M/Y[CIMTH'3#& U&3.N?D?)_/U8/,%?EP,-;I<CBH# X' JQ;YGBT-]&E8U9]
MQ01ZX;,7>\-67:7"(;.S,FFUF$575TSJ,E5.Z=*2S-2D 8"K%'-T> TG_E^5
MTP0X+BIM'*\M&LNEI!^SM7)H^;A6><H-VCIWEEMG:F>_D,)Q*9S(52D"7;L'
M<2%5!J739ODT O]@:X4G@*OBEB"OX=@@N9IZ_"?N?0NZQ2BVE3#(-B$B*JFK
M)3'1TWL2P43E"$[_F4YF*&\I)$18BLIFVO$LO>4W_C;(<S7F8ZU=DR.ZS0P-
M\Y ^;;2E7:%UPFR$_GTNE&,3;3;?K?28KM/.9H4PTY\QZO*7*G*:^7@TGE_=
MU*5RUW!1EZ7W7)MI("I!7@69,(4NET$3R,#;!)]P/*JJ2UIN63.Z/EZ<0Q32
M%= J6(<_9A21N10661R$08=O7H,;6R7@,3TKS)7+5C%OQ^%AI]<^Z :^&;9(
MGA/)>S%%^+#&N+<GWB@,1F^/7[Z[" [NT:)N',=1/^RW=^&^T?H.<O1Z]!E.
M%Z*H<K1;N/$=;GB/RZ*P%[9[_4X8[0*?JQ(ME'4Q1@.%LH5P,DL@UU+D1_'A
MX3X8++3#HSC>LO-1M>!K$J)].!,JKXW?3+@/I\9H8U?R2U4@8$ZE1B4 41ST
M^FVP*'>@'I]*.!N].C\]:376U!M4*81A1&FI[ IP1$ESI]\M[+I;"CVCQG^C
M9W_9+ _T)E7D1)7*9JO"5!,V(<>;ZKZ7)__(^^@FO<PHN N4M9^BZ[@T:7>D
MF>@\UW//C0N)E?\F69G\H/"9 BUE;0R-K'GFM[A&)+7+E 6:HIBT?K-ID8J*
MYNCV#%L+@T61)YUN O^#-X[[25-<399: RZ& [XZJWAS;O'5(?8=4$L! A0#
M"@    @ F4U:-P;[@2G' @  RP8  !(              *2!     &5X96-U
C=&EO;E]L;V<N:'1M;%!+!08      0 ! $    #W @     ! 
end

Mime
View raw message