harmony-alerts mailing list archives

Site index · List index
Message view « Date » · « Thread »
Top « Date » · « Thread »
From nom...@intel.com
Subject [build-test alert] FAILED Linux x86_64: ehwa
Date Thu, 25 Oct 2007 19:28:00 GMT
svn.revision=588030
BUILD FAILED:
	Ant Error Message:
/export/users/cc/cc-suites/scripts/cc-exec-adaptor.xml:104: The following error occurred while
executing this line: /export/users/cc/cc-suites/adaptors/ehwa/adaptor.xml:116: The following
error occurred while executing this line: /export/users/cc/cc-suites/scripts/framework.xml:1069:
Java returned: 1

Date of build:	2007-10-26 02:20:44 +0700
Time to build:	7 minutes 10 seconds
Last changed:	10/25/2007 17:02:40
Last log entry:	snapshot

***********************************************************
Errors/Warnings:	(52)
            
[exec] Result: 25
[echo]
[echo]
[echo] ========================== EHWA.log =======================
[echo]
[echo] Eclipse Home = /export/users/cc/cc-suites/build/libs/eclipse-3.2.1-lnx-x86_64/eclipse
[echo] Tested JRE = /export/users/cc/cc-suites/build/checkouts/snapshot/hdk/jdk/jre
[echo] Tested JRE options for Eclipse launching =
[echo] Delay factor = 2
[echo]
[echo] --- Automated EHWA scenario for Eclipse 3.2.1 ---
[echo]
[echo] Start:
[echo]
[echo] Run Eclipse
[echo] Select workspace
[echo]  wait window 'Workspace Launcher' to appear ...
[echo]  window 'Workspace Launcher' appeared
[echo] Press 'OK' button
[echo]  wait window '' to close ...
[echo]  window '' successfully closed
[echo] Close Welcome page
[echo]  wait window 'Java - Eclipse SDK' to appear ...
[echo] ERROR: Window 'Java - Eclipse SDK' didn't appear for 360 sec!
[echo]
[echo] Kill Eclipse:
[echo] 	Eclipse process wasn't found
[echo]
[echo]
[echo] EHWA FAILED!
[echo]
[echo] ======================= eclipse.log =======================
[echo] Install location:
[echo]     file:/export/users/cc/cc-suites/build/libs/eclipse-3.2.1-lnx-x86_64/eclipse/
[echo] Configuration file:
[echo]     file:/export/users/cc/cc-suites/build/libs/eclipse-3.2.1-lnx-x86_64/eclipse/configuration/config.ini
loaded
[echo] Configuration location:
[echo]     file:/export/users/cc/cc-suites/build/libs/eclipse-3.2.1-lnx-x86_64/eclipse/configuration/
[echo] Framework located:
[echo]     file:/export/users/cc/cc-suites/build/libs/eclipse-3.2.1-lnx-x86_64/eclipse/plugins/org.eclipse.osgi_3.2.1.R32x_v20060919.jar
[echo] Framework classpath:
[echo]     file:/export/users/cc/cc-suites/build/libs/eclipse-3.2.1-lnx-x86_64/eclipse/plugins/org.eclipse.osgi_3.2.1.R32x_v20060919.jar
[echo] Debug options:
[echo]     file:/export/users/cc/cc-suites/tests/ehwa/.options not found
[echo] Time to load bundles: 115
[echo] Starting application: 4816
[echo]
[echo] ===========================================================
BUILD FAILED
/export/users/cc/cc-suites/tests/ehwa/ehwa_run.xml:209: EHWA FAILED!
Total time: 7 minutes 9 seconds
The execution FAILED with the following exception:
The following error occurred while executing this line:
/export/users/cc/cc-suites/adaptors/ehwa/adaptor.xml:116: The following error occurred while
executing this line:
/export/users/cc/cc-suites/scripts/framework.xml:1069: Java returned: 1

***********************************************************
Unit Tests: (0)
        
No Tests Run: This project doesn't have any tests

***********************************************************
Modifications since last successful build:	(1)
            
add cc-snapshot log20071025170240Lbuild.26 10/25/2007 17:02:40snapshot

begin 644 execution_log.zip
M4$L#! H    ( 'P36C?J2-ZNKP0  (H6   2    97AE8W5T:6]N7VQO9RYH
M=&ULU5AM3QLY$/Y\^16^#Z=\N>PF:9O"7D"B0%5:I)Y23GQ 5>1X)UF#8Z]L
M;U[ZZV_LW:!LB4-X*=RM +&R/?/,>/S,X^UG=BH.^R.5+@_[N8;#/B7&+@4<
M-,=*VI;A/R A>^T__FH>-HH\I19:9B:31D,7^)>XY^J:SNAW\J'@(AUS@?,A
MF],A3H@64U&;4WNY8Z'\'UBFOI-6JT4&A22GGRZ/B&$@J>:**$EL!F2LA%!S
M+B>$*3GFDT)3RW$,%P4-7H"QD)+/@U-R0&)8Y$K;N#"@3<P8_K1,P2V8>.3"
MB%D&[$85UL1&TMQDRL99>A-?NU\-NSA1N8-DT%EP]BD3/#= /JDI[ )*\)&)
MH5S4>A-UHTY+R$5KL=<;]MZN!H+>3D#0)1E39I5&;]UMJ7_<$]YJG\Z(%E9Q
MF]PWS?HD1ICG>Z=6,>\Z+YIA9G%7PF5W+(!*5UBKO:D76!1%P:7?Z P(Q07Y
MDJAQP(!5S[3-<<UN-*+LIL@W8'-P,"S\ZZ+J[1%W0LT+X[A*08 %7X-@'9"4
M:W"%N/PE,&*E)[=[KLR$_Z< ,:4A0O*S?'KGM+XJL)+?7QU29, Z/R9XU 8P
M5;/U4SI7^L;DE,&F$_K( !P-(79L9?&M^>V\08K<MS[BECHG6_GB6 /U:#28
M0EBSAFK3LJOI#4ZHEF&/P9?D_OQ7MLLPNNWV^TZ[VQNVN]UVF,<LU;;>=X-S
M_\:P#?Q)#,!3L,3.6R34!#N[)BE8RL7&W5\ P[8Y&'P=).22RU3-2?,S3B"M
MVU+X=O*EB<E)9=,2FN= M3?ZIM=&E.QW0BV)/(1A57U#7Y91+HC@$DBWV]NX
M9][UP(>0D.Z[<,?)-9<V&F,(T12,H1,(MYO@0'CD(/B0VRR&)CP<Q\M*E-?2
M:*Y 5I$*6DB6N7.Y)5\_:ZE'9-8)W",41%-_FNLR=QV/3Z*?_7 ?_B@GCUCH
ME7<%(&P=Z939->X-5_.<<IQ8'=C+VP7G/M>@FTZ/5(=U&V5N-5&NAS1,5DA 
MAC2_(C^,"FM1C>T(V,-C0IF-[>4NNB8Q!6/H;%P(L2Q7IF%GQ][R)0CF#EF.
MA+$KL$W4MULFG\:A#R^H+UR(E?DM!?G;"D&NE4L@AFL<B+$JY)8,/F2@+H@[
M7@_O)(?7VU<XK^X<?SPZ.S\]V9*FA],[66FT1]'[F326X@8(Q;S$"C<D]_@[
M_#,INW#1UZY%WN6+@:K+S?(MXI)C?FBZA4#JF%\^F77<0;<?-9V"8^42(J0O
MAS 7Q81+<^?^56FLP9ON8CA#Z==K[W?VHVNJ=PB""6J0ZVWV?PSC!$;%9*4S
MGA; VGTD6@D7J2IN#*L=O&0Z>G.EC6U/IGC[3TBG\R[<UIUH<-R(S"]X5>/D
M[5ZG]ZQJ]=XGK+ __'-V?E*Q;&U@M^RM?YU,NNW]I,;:8;<7"DF4N%M[0MZ3
M*9<%&B7[KB4JF9I&XR(#XNX)A>>'TA[V:IO]]-$2%@SRDCHNZ@-:8YM5C!4:
MA0R99ZXW519QV&;<^$M*TM@2*4UICK*T"K9Z\[%V.KV$_ */AFF>8W;'JS-;
M>FOW,+5>66BPA99(1*33Z,?TL!_[3\UQ^=DY]M^@_P502P$"% ,*    " !\
M$UHWZDC>KJ\$  "*%@  $@              I($     97AE8W5T:6]N7VQO
<9RYH=&UL4$L%!@     !  $ 0    -\$      $! 
end

Mime
View raw message