harmony-alerts mailing list archives

Site index · List index
Message view « Date » · « Thread »
Top « Date » · « Thread »
From nom...@intel.com
Subject [build-test alert] FAILED Linux x86_64: drlvm-test debug
Date Thu, 25 Oct 2007 11:49:16 GMT

BUILD FAILED:
	Ant Error Message:
/export/users/cc/cc-common/scripts/cc-exec-adaptor.xml:104: The following error occurred while executing this line: /export/users/cc/cc-common/adaptors/drlvm-test/adaptor.xml:76: There were drlvm-test failures

Date of build:	2007-10-25 17:11:26 +0700
Time to build:	97 minutes 39 seconds
Last changed:	10/25/2007 15:47:37
Last log entry:	hdk

***********************************************************
Errors/Warnings:	(82)
            
[java] Java Result: 1
[java] Java Result: 1
[java] Java Result: 130
[java] Java Result: 1
[java] Java Result: 1
[java] Java Result: 130
[java] Java Result: 1
[java] Java Result: 1
[java] Java Result: 130
[java] Java Result: 1
[java] Java Result: 1
[java] Java Result: 130
[java] Java Result: 1
[java] Java Result: 1
[java] Java Result: 130
[java] Timeout: killed the sub-process
[java] 	at org.apache.tools.ant.taskdefs.Java.fork(Java.java:754)
[java] 	at org.apache.tools.ant.taskdefs.Java.executeJava(Java.java:171)
[java] 	at org.apache.tools.ant.taskdefs.Java.execute(Java.java:84)
[java] 	at org.apache.tools.ant.UnknownElement.execute(UnknownElement.java:275)
[java] 	at org.apache.tools.ant.Task.perform(Task.java:364)
[java] 	at org.apache.tools.ant.taskdefs.Sequential.execute(Sequential.java:64)
[java] 	at net.sf.antcontrib.logic.IfTask.execute(IfTask.java:197)
[java] 	at sun.reflect.GeneratedMethodAccessor27.invoke(Unknown Source)
[java] 	at sun.reflect.DelegatingMethodAccessorImpl.invoke(DelegatingMethodAccessorImpl.java:25)
[java] 	at java.lang.reflect.Method.invoke(Method.java:585)
[java] 	at org.apache.tools.ant.TaskAdapter.execute(TaskAdapter.java:123)
[java] 	at org.apache.tools.ant.UnknownElement.execute(UnknownElement.java:275)
[java] 	at org.apache.tools.ant.Task.perform(Task.java:364)
[java] 	at org.apache.tools.ant.taskdefs.Sequential.execute(Sequential.java:64)
[java] 	at org.apache.tools.ant.UnknownElement.execute(UnknownElement.java:275)
[java] 	at org.apache.tools.ant.Task.perform(Task.java:364)
[java] 	at org.apache.tools.ant.taskdefs.MacroInstance.execute(MacroInstance.java:378)
[java] 	at net.sf.antcontrib.logic.ForDelegate.doSequentialIteration(ForDelegate.java:228)
[java] 	at net.sf.antcontrib.logic.ForDelegate.doTheTasks(ForDelegate.java:281)
[java] 	at net.sf.antcontrib.logic.ForDelegate.execute(ForDelegate.java:213)
[java] 	at net.sf.antcontrib.logic.For.execute(For.java:166)
[java] 	at org.apache.tools.ant.UnknownElement.execute(UnknownElement.java:275)
[java] 	at org.apache.tools.ant.Task.perform(Task.java:364)
[java] 	at org.apache.tools.ant.Target.execute(Target.java:341)
[java] 	at org.apache.tools.ant.Target.performTasks(Target.java:369)
[java] 	at org.apache.tools.ant.Project.executeSortedTargets(Project.java:1216)
[java] 	at org.apache.tools.ant.helper.SingleCheckExecutor.executeTargets(SingleCheckExecutor.java:37)
[java] 	at org.apache.tools.ant.Project.executeTargets(Project.java:1068)
[java] 	at org.apache.tools.ant.taskdefs.Ant.execute(Ant.java:382)
[java] 	at org.apache.tools.ant.taskdefs.CallTarget.execute(CallTarget.java:107)
[java] 	at org.apache.tools.ant.UnknownElement.execute(UnknownElement.java:275)
[java] 	at org.apache.tools.ant.Task.perform(Task.java:364)
[java] 	at org.apache.tools.ant.taskdefs.Sequential.execute(Sequential.java:64)
[java] 	at org.apache.tools.ant.UnknownElement.execute(UnknownElement.java:275)
[java] 	at org.apache.tools.ant.Task.perform(Task.java:364)
[java] 	at org.apache.tools.ant.taskdefs.MacroInstance.execute(MacroInstance.java:378)
[java] 	at net.sf.antcontrib.logic.ForDelegate.doSequentialIteration(ForDelegate.java:228)
[java] 	at net.sf.antcontrib.logic.ForDelegate.doTheTasks(ForDelegate.java:253)
[java] 	at net.sf.antcontrib.logic.ForDelegate.execute(ForDelegate.java:213)
[java] 	at net.sf.antcontrib.logic.For.execute(For.java:166)
[java] 	at org.apache.tools.ant.UnknownElement.execute(UnknownElement.java:275)
[java] 	at org.apache.tools.ant.Task.perform(Task.java:364)
[java] 	at org.apache.tools.ant.Target.execute(Target.java:341)
[java] 	at org.apache.tools.ant.Target.performTasks(Target.java:369)
[java] 	at org.apache.tools.ant.Project.executeSortedTargets(Project.java:1216)
[java] 	at org.apache.tools.ant.helper.SingleCheckExecutor.executeTargets(SingleCheckExecutor.java:37)
[java] 	at org.apache.tools.ant.Project.executeTargets(Project.java:1068)
[java] 	at org.apache.tools.ant.taskdefs.Ant.execute(Ant.java:382)
[java] 	at org.apache.tools.ant.UnknownElement.execute(UnknownElement.java:275)
[java] 	at org.apache.tools.ant.Task.perform(Task.java:364)
[java] 	at org.apache.tools.ant.Target.execute(Target.java:341)
[java] 	at org.apache.tools.ant.Target.performTasks(Target.java:369)
[java] 	at org.apache.tools.ant.Project.executeSortedTargets(Project.java:1216)
[java] 	at org.apache.tools.ant.Project.executeTarget(Project.java:1185)
[java] 	at org.apache.tools.ant.helper.DefaultExecutor.executeTargets(DefaultExecutor.java:40)
[java] 	at org.apache.tools.ant.Project.executeTargets(Project.java:1068)
[java] 	at org.apache.tools.ant.Main.runBuild(Main.java:668)
[java] 	at org.apache.tools.ant.Main.startAnt(Main.java:187)
[java] 	at org.apache.tools.ant.launch.Launcher.run(Launcher.java:246)
[java] 	at org.apache.tools.ant.launch.Launcher.main(Launcher.java:67)
[junit] Tests FAILED
BUILD FAILED
/export/users/cc/cc-common/build/checkouts/hdk/working_vm/build/make/build.xml:465: Some tests failed
Total time: 97 minutes 32 seconds
The execution FAILED with the following exception:
The following error occurred while executing this line:
/export/users/cc/cc-common/adaptors/drlvm-test/adaptor.xml:76: There were drlvm-test failures

***********************************************************
Unit Tests: (4072)
        
error: test_10 java.lang.ClassAnnotationsTest
error: test_11 java.lang.ClassAnnotationsTest
error: testGetAnnotation java.lang.Package5Test
error: testGetAnnotation2 java.lang.Package5Test
error: testGetAnnotation_Negative java.lang.Package5Test
error: testGetDeclaredAnnotations java.lang.Package5Test
error: testGetDeclaredAnnotations2 java.lang.Package5Test
error: testGetDeclaredAnnotationsImmutable java.lang.Package5Test
error: testGetAnnotations java.lang.Package5Test
error: testGetAnnotations2 java.lang.Package5Test
error: testGetAnnotations5 java.lang.Package5Test
error: testGetAnnotationsImmutable java.lang.Package5Test
error: testIsAnnotationPresent java.lang.Package5Test
error: testIsAnnotationPresent_Negative java.lang.Package5Test
error: testGetParameterAnnotations2 java.lang.reflect.Ctor5Test
error: testGetParameterAnnotations3 java.lang.reflect.Ctor5Test
error: testGetParameterAnnotationsImmutable java.lang.reflect.Ctor5Test
error: testGetAnnotation java.lang.reflect.Ctor5Test
error: testGetAnnotation2 java.lang.reflect.Ctor5Test
error: testGetAnnotation_Negative java.lang.reflect.Ctor5Test
error: testGetDeclaredAnnotations java.lang.reflect.Ctor5Test
error: testGetDeclaredAnnotations2 java.lang.reflect.Ctor5Test
error: testGetDeclaredAnnotationsImmutable java.lang.reflect.Ctor5Test
error: testGetAnnotations java.lang.reflect.Ctor5Test
error: testGetAnnotations2 java.lang.reflect.Ctor5Test
error: testGetAnnotations5 java.lang.reflect.Ctor5Test
error: testGetAnnotationsImmutable java.lang.reflect.Ctor5Test
error: testIsAnnotationPresent java.lang.reflect.Ctor5Test
error: testIsAnnotationPresent_Negative java.lang.reflect.Ctor5Test
error: testGetAnnotation java.lang.reflect.Field5Test
error: testGetAnnotation2 java.lang.reflect.Field5Test
error: testGetAnnotation_Negative java.lang.reflect.Field5Test
error: testGetDeclaredAnnotations java.lang.reflect.Field5Test
error: testGetDeclaredAnnotations2 java.lang.reflect.Field5Test
error: testGetDeclaredAnnotationsImmutable java.lang.reflect.Field5Test
error: testGetAnnotations java.lang.reflect.Field5Test
error: testGetAnnotations2 java.lang.reflect.Field5Test
error: testGetAnnotations5 java.lang.reflect.Field5Test
error: testGetAnnotationsImmutable java.lang.reflect.Field5Test
error: testIsAnnotationPresent java.lang.reflect.Field5Test
error: testIsAnnotationPresent_Negative java.lang.reflect.Field5Test
error: testGetParameterAnnotations2 java.lang.reflect.Method5Test
error: testGetParameterAnnotations3 java.lang.reflect.Method5Test
error: testGetParameterAnnotationsImmutable java.lang.reflect.Method5Test
error: testGetAnnotation java.lang.reflect.Method5Test
error: testGetAnnotation2 java.lang.reflect.Method5Test
error: testGetAnnotation_Negative java.lang.reflect.Method5Test
error: testGetDeclaredAnnotations java.lang.reflect.Method5Test
error: testGetDeclaredAnnotations2 java.lang.reflect.Method5Test
error: testGetDeclaredAnnotationsImmutable java.lang.reflect.Method5Test
error: testGetAnnotations java.lang.reflect.Method5Test
error: testGetAnnotations2 java.lang.reflect.Method5Test
error: testGetAnnotations5 java.lang.reflect.Method5Test
error: testGetAnnotationsImmutable java.lang.reflect.Method5Test
error: testIsAnnotationPresent java.lang.reflect.Method5Test
error: testIsAnnotationPresent_Negative java.lang.reflect.Method5Test
error: testGetAnnotation_ByDefault org.apache.harmony.lang.annotation.AllTypesTest
error: testGetAnnotation_NoDefault org.apache.harmony.lang.annotation.AllTypesTest
error: testEquals org.apache.harmony.lang.annotation.AllTypesTest
error: testEquals_ForeignImpl org.apache.harmony.lang.annotation.AllTypesTest
error: testToString org.apache.harmony.lang.annotation.AllTypesTest
error: testAnnotationType org.apache.harmony.lang.annotation.AllTypesTest
error: testAnnotation_ElementError org.apache.harmony.lang.annotation.AllTypesTest
error: testSerialization org.apache.harmony.lang.annotation.AllTypesTest
failure: Server mode JIT stress.Finalizer_srv
Unit Test Error Details:	(65)
                
Test: test_10Class: java.lang.ClassAnnotationsTestjava.lang.NullPointerException
	at java.lang.reflect.Proxy.newProxyInstance(Proxy.java:200)
	at org.apache.harmony.lang.annotation.AnnotationFactory.createAnnotation(AnnotationFactory.java:101)
	at org.apache.harmony.vm.VMGenericsAndAnnotations.getDefaultValue(VMGenericsAndAnnotations.java)
	at java.lang.reflect.Method.getDefaultValue(Method.java:195)
	at java.lang.ClassAnnotationsTest.test_10(ClassAnnotationsTest.java:2187)
	at java.lang.reflect.VMReflection.invokeMethod(VMReflection.java)
	at java.lang.reflect.Method.invoke(Method.java:317)
	at junit.framework.TestCase.runTest(TestCase.java:164)
	at junit.framework.TestCase.runBare(TestCase.java)
	at junit.framework.TestResult$1.protect(TestResult.java)
	at junit.framework.TestResult.runProtected(TestResult.java)
	at junit.framework.TestResult.run(TestResult.java:109)
	at junit.framework.TestCase.run(TestCase.java:120)
	at junit.framework.TestSuite.runTest(TestSuite.java:230)
	at junit.framework.TestSuite.run(TestSuite.java:225)
	at org.apache.tools.ant.taskdefs.optional.junit.JUnitTestRunner.run(JUnitTestRunner.java:297)
	at org.apache.tools.ant.taskdefs.optional.junit.JUnitTestRunner.launch(JUnitTestRunner.java:672)
	at org.apache.tools.ant.taskdefs.optional.junit.JUnitTestRunner.main(JUnitTestRunner.java:546)
Test: test_11Class: java.lang.ClassAnnotationsTestjava.lang.NullPointerException
	at java.lang.reflect.Proxy.newProxyInstance(Proxy.java:200)
	at org.apache.harmony.lang.annotation.AnnotationFactory.createAnnotation(AnnotationFactory.java:101)
	at org.apache.harmony.vm.VMGenericsAndAnnotations.getDeclaredAnnotations(VMGenericsAndAnnotations.java)
	at java.lang.reflect.Method$MethodData.getDeclaredAnnotations(Method.java:426)
	at java.lang.reflect.Method.getDeclaredAnnotations(Method.java:71)
	at java.lang.reflect.AccessibleObject.getAnnotations(AccessibleObject.java)
	at java.lang.ClassAnnotationsTest.test_11(ClassAnnotationsTest.java:2300)
	at java.lang.reflect.VMReflection.invokeMethod(VMReflection.java)
	at java.lang.reflect.Method.invoke(Method.java:317)
	at junit.framework.TestCase.runTest(TestCase.java:164)
	at junit.framework.TestCase.runBare(TestCase.java)
	at junit.framework.TestResult$1.protect(TestResult.java)
	at junit.framework.TestResult.runProtected(TestResult.java)
	at junit.framework.TestResult.run(TestResult.java:109)
	at junit.framework.TestCase.run(TestCase.java:120)
	at junit.framework.TestSuite.runTest(TestSuite.java:230)
	at junit.framework.TestSuite.run(TestSuite.java:225)
	at org.apache.tools.ant.taskdefs.optional.junit.JUnitTestRunner.run(JUnitTestRunner.java:297)
	at org.apache.tools.ant.taskdefs.optional.junit.JUnitTestRunner.launch(JUnitTestRunner.java:672)
	at org.apache.tools.ant.taskdefs.optional.junit.JUnitTestRunner.main(JUnitTestRunner.java:546)
Test: testGetAnnotationClass: java.lang.Package5Testjava.lang.NullPointerException
	at java.lang.reflect.Proxy.newProxyInstance(Proxy.java:200)
	at org.apache.harmony.lang.annotation.AnnotationFactory.createAnnotation(AnnotationFactory.java:101)
	at org.apache.harmony.vm.VMGenericsAndAnnotations.getDeclaredAnnotations(VMGenericsAndAnnotations.java)
	at java.lang.Package.getDeclaredAnnotations(Package.java:56)
	at java.lang.Package.getAnnotations(Package.java:65)
	at java.lang.Package.getAnnotation(Package.java:78)
	at org.apache.harmony.lang.AnnotatedElementTestFrame.testGetAnnotation(AnnotatedElementTestFrame.java)
	at java.lang.reflect.VMReflection.invokeMethod(VMReflection.java)
	at java.lang.reflect.Method.invoke(Method.java:317)
	at junit.framework.TestCase.runTest(TestCase.java:164)
	at junit.framework.TestCase.runBare(TestCase.java)
	at junit.framework.TestResult$1.protect(TestResult.java)
	at junit.framework.TestResult.runProtected(TestResult.java)
	at junit.framework.TestResult.run(TestResult.java:109)
	at junit.framework.TestCase.run(TestCase.java:120)
	at junit.framework.TestSuite.runTest(TestSuite.java:230)
	at junit.framework.TestSuite.run(TestSuite.java:225)
	at org.apache.tools.ant.taskdefs.optional.junit.JUnitTestRunner.run(JUnitTestRunner.java:297)
	at org.apache.tools.ant.taskdefs.optional.junit.JUnitTestRunner.launch(JUnitTestRunner.java:672)
	at org.apache.tools.ant.taskdefs.optional.junit.JUnitTestRunner.main(JUnitTestRunner.java:546)
Test: testGetAnnotation2Class: java.lang.Package5Testjava.lang.NullPointerException
	at java.lang.reflect.Proxy.newProxyInstance(Proxy.java:200)
	at org.apache.harmony.lang.annotation.AnnotationFactory.createAnnotation(AnnotationFactory.java:101)
	at org.apache.harmony.vm.VMGenericsAndAnnotations.getDeclaredAnnotations(VMGenericsAndAnnotations.java)
	at java.lang.Package.getDeclaredAnnotations(Package.java:56)
	at java.lang.Package.getAnnotations(Package.java:65)
	at java.lang.Package.getAnnotation(Package.java:78)
	at org.apache.harmony.lang.AnnotatedElementTestFrame.testGetAnnotation2(AnnotatedElementTestFrame.java)
	at java.lang.reflect.VMReflection.invokeMethod(VMReflection.java)
	at java.lang.reflect.Method.invoke(Method.java:317)
	at junit.framework.TestCase.runTest(TestCase.java:164)
	at junit.framework.TestCase.runBare(TestCase.java)
	at junit.framework.TestResult$1.protect(TestResult.java)
	at junit.framework.TestResult.runProtected(TestResult.java)
	at junit.framework.TestResult.run(TestResult.java:109)
	at junit.framework.TestCase.run(TestCase.java:120)
	at junit.framework.TestSuite.runTest(TestSuite.java:230)
	at junit.framework.TestSuite.run(TestSuite.java:225)
	at org.apache.tools.ant.taskdefs.optional.junit.JUnitTestRunner.run(JUnitTestRunner.java:297)
	at org.apache.tools.ant.taskdefs.optional.junit.JUnitTestRunner.launch(JUnitTestRunner.java:672)
	at org.apache.tools.ant.taskdefs.optional.junit.JUnitTestRunner.main(JUnitTestRunner.java:546)
Test: testGetAnnotation_NegativeClass: java.lang.Package5Testjava.lang.NullPointerException
	at java.lang.reflect.Proxy.newProxyInstance(Proxy.java:200)
	at org.apache.harmony.lang.annotation.AnnotationFactory.createAnnotation(AnnotationFactory.java:101)
	at org.apache.harmony.vm.VMGenericsAndAnnotations.getDeclaredAnnotations(VMGenericsAndAnnotations.java)
	at java.lang.Package.getDeclaredAnnotations(Package.java:56)
	at java.lang.Package.getAnnotations(Package.java:65)
	at java.lang.Package.getAnnotation(Package.java:78)
	at org.apache.harmony.lang.AnnotatedElementTestFrame.testGetAnnotation_Negative(AnnotatedElementTestFrame.java)
	at java.lang.reflect.VMReflection.invokeMethod(VMReflection.java)
	at java.lang.reflect.Method.invoke(Method.java:317)
	at junit.framework.TestCase.runTest(TestCase.java:164)
	at junit.framework.TestCase.runBare(TestCase.java)
	at junit.framework.TestResult$1.protect(TestResult.java)
	at junit.framework.TestResult.runProtected(TestResult.java)
	at junit.framework.TestResult.run(TestResult.java:109)
	at junit.framework.TestCase.run(TestCase.java:120)
	at junit.framework.TestSuite.runTest(TestSuite.java:230)
	at junit.framework.TestSuite.run(TestSuite.java:225)
	at org.apache.tools.ant.taskdefs.optional.junit.JUnitTestRunner.run(JUnitTestRunner.java:297)
	at org.apache.tools.ant.taskdefs.optional.junit.JUnitTestRunner.launch(JUnitTestRunner.java:672)
	at org.apache.tools.ant.taskdefs.optional.junit.JUnitTestRunner.main(JUnitTestRunner.java:546)
Test: testGetDeclaredAnnotationsClass: java.lang.Package5Testjava.lang.NullPointerException
	at java.lang.reflect.Proxy.newProxyInstance(Proxy.java:200)
	at org.apache.harmony.lang.annotation.AnnotationFactory.createAnnotation(AnnotationFactory.java:101)
	at org.apache.harmony.vm.VMGenericsAndAnnotations.getDeclaredAnnotations(VMGenericsAndAnnotations.java)
	at java.lang.Package.getDeclaredAnnotations(Package.java:56)
	at org.apache.harmony.lang.AnnotatedElementTestFrame.testGetDeclaredAnnotations(AnnotatedElementTestFrame.java:162)
	at java.lang.reflect.VMReflection.invokeMethod(VMReflection.java)
	at java.lang.reflect.Method.invoke(Method.java:317)
	at junit.framework.TestCase.runTest(TestCase.java:164)
	at junit.framework.TestCase.runBare(TestCase.java)
	at junit.framework.TestResult$1.protect(TestResult.java)
	at junit.framework.TestResult.runProtected(TestResult.java)
	at junit.framework.TestResult.run(TestResult.java:109)
	at junit.framework.TestCase.run(TestCase.java:120)
	at junit.framework.TestSuite.runTest(TestSuite.java:230)
	at junit.framework.TestSuite.run(TestSuite.java:225)
	at org.apache.tools.ant.taskdefs.optional.junit.JUnitTestRunner.run(JUnitTestRunner.java:297)
	at org.apache.tools.ant.taskdefs.optional.junit.JUnitTestRunner.launch(JUnitTestRunner.java:672)
	at org.apache.tools.ant.taskdefs.optional.junit.JUnitTestRunner.main(JUnitTestRunner.java:546)
Test: testGetDeclaredAnnotations2Class: java.lang.Package5Testjava.lang.NullPointerException
	at java.lang.reflect.Proxy.newProxyInstance(Proxy.java:200)
	at org.apache.harmony.lang.annotation.AnnotationFactory.createAnnotation(AnnotationFactory.java:101)
	at org.apache.harmony.vm.VMGenericsAndAnnotations.getDeclaredAnnotations(VMGenericsAndAnnotations.java)
	at java.lang.Package.getDeclaredAnnotations(Package.java:56)
	at org.apache.harmony.lang.AnnotatedElementTestFrame.testGetDeclaredAnnotations2(AnnotatedElementTestFrame.java:173)
	at java.lang.reflect.VMReflection.invokeMethod(VMReflection.java)
	at java.lang.reflect.Method.invoke(Method.java:317)
	at junit.framework.TestCase.runTest(TestCase.java:164)
	at junit.framework.TestCase.runBare(TestCase.java)
	at junit.framework.TestResult$1.protect(TestResult.java)
	at junit.framework.TestResult.runProtected(TestResult.java)
	at junit.framework.TestResult.run(TestResult.java:109)
	at junit.framework.TestCase.run(TestCase.java:120)
	at junit.framework.TestSuite.runTest(TestSuite.java:230)
	at junit.framework.TestSuite.run(TestSuite.java:225)
	at org.apache.tools.ant.taskdefs.optional.junit.JUnitTestRunner.run(JUnitTestRunner.java:297)
	at org.apache.tools.ant.taskdefs.optional.junit.JUnitTestRunner.launch(JUnitTestRunner.java:672)
	at org.apache.tools.ant.taskdefs.optional.junit.JUnitTestRunner.main(JUnitTestRunner.java:546)
Test: testGetDeclaredAnnotationsImmutableClass: java.lang.Package5Testjava.lang.NullPointerException
	at java.lang.reflect.Proxy.newProxyInstance(Proxy.java:200)
	at org.apache.harmony.lang.annotation.AnnotationFactory.createAnnotation(AnnotationFactory.java:101)
	at org.apache.harmony.vm.VMGenericsAndAnnotations.getDeclaredAnnotations(VMGenericsAndAnnotations.java)
	at java.lang.Package.getDeclaredAnnotations(Package.java:56)
	at org.apache.harmony.lang.AnnotatedElementTestFrame.testGetDeclaredAnnotationsImmutable(AnnotatedElementTestFrame.java:198)
	at java.lang.reflect.VMReflection.invokeMethod(VMReflection.java)
	at java.lang.reflect.Method.invoke(Method.java:317)
	at junit.framework.TestCase.runTest(TestCase.java:164)
	at junit.framework.TestCase.runBare(TestCase.java)
	at junit.framework.TestResult$1.protect(TestResult.java)
	at junit.framework.TestResult.runProtected(TestResult.java)
	at junit.framework.TestResult.run(TestResult.java:109)
	at junit.framework.TestCase.run(TestCase.java:120)
	at junit.framework.TestSuite.runTest(TestSuite.java:230)
	at junit.framework.TestSuite.run(TestSuite.java:225)
	at org.apache.tools.ant.taskdefs.optional.junit.JUnitTestRunner.run(JUnitTestRunner.java:297)
	at org.apache.tools.ant.taskdefs.optional.junit.JUnitTestRunner.launch(JUnitTestRunner.java:672)
	at org.apache.tools.ant.taskdefs.optional.junit.JUnitTestRunner.main(JUnitTestRunner.java:546)
Test: testGetAnnotationsClass: java.lang.Package5Testjava.lang.NullPointerException
	at java.lang.reflect.Proxy.newProxyInstance(Proxy.java:200)
	at org.apache.harmony.lang.annotation.AnnotationFactory.createAnnotation(AnnotationFactory.java:101)
	at org.apache.harmony.vm.VMGenericsAndAnnotations.getDeclaredAnnotations(VMGenericsAndAnnotations.java)
	at java.lang.Package.getDeclaredAnnotations(Package.java:56)
	at java.lang.Package.getAnnotations(Package.java:65)
	at org.apache.harmony.lang.AnnotatedElementTestFrame.testGetAnnotations(AnnotatedElementTestFrame.java:215)
	at java.lang.reflect.VMReflection.invokeMethod(VMReflection.java)
	at java.lang.reflect.Method.invoke(Method.java:317)
	at junit.framework.TestCase.runTest(TestCase.java:164)
	at junit.framework.TestCase.runBare(TestCase.java)
	at junit.framework.TestResult$1.protect(TestResult.java)
	at junit.framework.TestResult.runProtected(TestResult.java)
	at junit.framework.TestResult.run(TestResult.java:109)
	at junit.framework.TestCase.run(TestCase.java:120)
	at junit.framework.TestSuite.runTest(TestSuite.java:230)
	at junit.framework.TestSuite.run(TestSuite.java:225)
	at org.apache.tools.ant.taskdefs.optional.junit.JUnitTestRunner.run(JUnitTestRunner.java:297)
	at org.apache.tools.ant.taskdefs.optional.junit.JUnitTestRunner.launch(JUnitTestRunner.java:672)
	at org.apache.tools.ant.taskdefs.optional.junit.JUnitTestRunner.main(JUnitTestRunner.java:546)
Test: testGetAnnotations2Class: java.lang.Package5Testjava.lang.NullPointerException
	at java.lang.reflect.Proxy.newProxyInstance(Proxy.java:200)
	at org.apache.harmony.lang.annotation.AnnotationFactory.createAnnotation(AnnotationFactory.java:101)
	at org.apache.harmony.vm.VMGenericsAndAnnotations.getDeclaredAnnotations(VMGenericsAndAnnotations.java)
	at java.lang.Package.getDeclaredAnnotations(Package.java:56)
	at java.lang.Package.getAnnotations(Package.java:65)
	at org.apache.harmony.lang.AnnotatedElementTestFrame.testGetAnnotations2(AnnotatedElementTestFrame.java:226)
	at java.lang.reflect.VMReflection.invokeMethod(VMReflection.java)
	at java.lang.reflect.Method.invoke(Method.java:317)
	at junit.framework.TestCase.runTest(TestCase.java:164)
	at junit.framework.TestCase.runBare(TestCase.java)
	at junit.framework.TestResult$1.protect(TestResult.java)
	at junit.framework.TestResult.runProtected(TestResult.java)
	at junit.framework.TestResult.run(TestResult.java:109)
	at junit.framework.TestCase.run(TestCase.java:120)
	at junit.framework.TestSuite.runTest(TestSuite.java:230)
	at junit.framework.TestSuite.run(TestSuite.java:225)
	at org.apache.tools.ant.taskdefs.optional.junit.JUnitTestRunner.run(JUnitTestRunner.java:297)
	at org.apache.tools.ant.taskdefs.optional.junit.JUnitTestRunner.launch(JUnitTestRunner.java:672)
	at org.apache.tools.ant.taskdefs.optional.junit.JUnitTestRunner.main(JUnitTestRunner.java:546)
Test: testGetAnnotations5Class: java.lang.Package5Testjava.lang.NullPointerException
	at java.lang.reflect.Proxy.newProxyInstance(Proxy.java:200)
	at org.apache.harmony.lang.annotation.AnnotationFactory.createAnnotation(AnnotationFactory.java:101)
	at org.apache.harmony.vm.VMGenericsAndAnnotations.getDeclaredAnnotations(VMGenericsAndAnnotations.java)
	at java.lang.Package.getDeclaredAnnotations(Package.java:56)
	at java.lang.Package.getAnnotations(Package.java:65)
	at org.apache.harmony.lang.AnnotatedElementTestFrame.testGetAnnotations5(AnnotatedElementTestFrame.java:264)
	at java.lang.reflect.VMReflection.invokeMethod(VMReflection.java)
	at java.lang.reflect.Method.invoke(Method.java:317)
	at junit.framework.TestCase.runTest(TestCase.java:164)
	at junit.framework.TestCase.runBare(TestCase.java)
	at junit.framework.TestResult$1.protect(TestResult.java)
	at junit.framework.TestResult.runProtected(TestResult.java)
	at junit.framework.TestResult.run(TestResult.java:109)
	at junit.framework.TestCase.run(TestCase.java:120)
	at junit.framework.TestSuite.runTest(TestSuite.java:230)
	at junit.framework.TestSuite.run(TestSuite.java:225)
	at org.apache.tools.ant.taskdefs.optional.junit.JUnitTestRunner.run(JUnitTestRunner.java:297)
	at org.apache.tools.ant.taskdefs.optional.junit.JUnitTestRunner.launch(JUnitTestRunner.java:672)
	at org.apache.tools.ant.taskdefs.optional.junit.JUnitTestRunner.main(JUnitTestRunner.java:546)
Test: testGetAnnotationsImmutableClass: java.lang.Package5Testjava.lang.NullPointerException
	at java.lang.reflect.Proxy.newProxyInstance(Proxy.java:200)
	at org.apache.harmony.lang.annotation.AnnotationFactory.createAnnotation(AnnotationFactory.java:101)
	at org.apache.harmony.vm.VMGenericsAndAnnotations.getDeclaredAnnotations(VMGenericsAndAnnotations.java)
	at java.lang.Package.getDeclaredAnnotations(Package.java:56)
	at java.lang.Package.getAnnotations(Package.java:65)
	at org.apache.harmony.lang.AnnotatedElementTestFrame.testGetAnnotationsImmutable(AnnotatedElementTestFrame.java:293)
	at java.lang.reflect.VMReflection.invokeMethod(VMReflection.java)
	at java.lang.reflect.Method.invoke(Method.java:317)
	at junit.framework.TestCase.runTest(TestCase.java:164)
	at junit.framework.TestCase.runBare(TestCase.java)
	at junit.framework.TestResult$1.protect(TestResult.java)
	at junit.framework.TestResult.runProtected(TestResult.java)
	at junit.framework.TestResult.run(TestResult.java:109)
	at junit.framework.TestCase.run(TestCase.java:120)
	at junit.framework.TestSuite.runTest(TestSuite.java:230)
	at junit.framework.TestSuite.run(TestSuite.java:225)
	at org.apache.tools.ant.taskdefs.optional.junit.JUnitTestRunner.run(JUnitTestRunner.java:297)
	at org.apache.tools.ant.taskdefs.optional.junit.JUnitTestRunner.launch(JUnitTestRunner.java:672)
	at org.apache.tools.ant.taskdefs.optional.junit.JUnitTestRunner.main(JUnitTestRunner.java:546)
Test: testIsAnnotationPresentClass: java.lang.Package5Testjava.lang.NullPointerException
	at java.lang.reflect.Proxy.newProxyInstance(Proxy.java:200)
	at org.apache.harmony.lang.annotation.AnnotationFactory.createAnnotation(AnnotationFactory.java:101)
	at org.apache.harmony.vm.VMGenericsAndAnnotations.getDeclaredAnnotations(VMGenericsAndAnnotations.java)
	at java.lang.Package.getDeclaredAnnotations(Package.java:56)
	at java.lang.Package.getAnnotations(Package.java:65)
	at java.lang.Package.getAnnotation(Package.java:78)
	at java.lang.Package.isAnnotationPresent(Package.java:93)
	at org.apache.harmony.lang.AnnotatedElementTestFrame.testIsAnnotationPresent(AnnotatedElementTestFrame.java:310)
	at java.lang.reflect.VMReflection.invokeMethod(VMReflection.java)
	at java.lang.reflect.Method.invoke(Method.java:317)
	at junit.framework.TestCase.runTest(TestCase.java:164)
	at junit.framework.TestCase.runBare(TestCase.java)
	at junit.framework.TestResult$1.protect(TestResult.java)
	at junit.framework.TestResult.runProtected(TestResult.java)
	at junit.framework.TestResult.run(TestResult.java:109)
	at junit.framework.TestCase.run(TestCase.java:120)
	at junit.framework.TestSuite.runTest(TestSuite.java:230)
	at junit.framework.TestSuite.run(TestSuite.java:225)
	at org.apache.tools.ant.taskdefs.optional.junit.JUnitTestRunner.run(JUnitTestRunner.java:297)
	at org.apache.tools.ant.taskdefs.optional.junit.JUnitTestRunner.launch(JUnitTestRunner.java:672)
	at org.apache.tools.ant.taskdefs.optional.junit.JUnitTestRunner.main(JUnitTestRunner.java:546)
Test: testIsAnnotationPresent_NegativeClass: java.lang.Package5Testjava.lang.NullPointerException
	at java.lang.reflect.Proxy.newProxyInstance(Proxy.java:200)
	at org.apache.harmony.lang.annotation.AnnotationFactory.createAnnotation(AnnotationFactory.java:101)
	at org.apache.harmony.vm.VMGenericsAndAnnotations.getDeclaredAnnotations(VMGenericsAndAnnotations.java)
	at java.lang.Package.getDeclaredAnnotations(Package.java:56)
	at java.lang.Package.getAnnotations(Package.java:65)
	at java.lang.Package.getAnnotation(Package.java:78)
	at java.lang.Package.isAnnotationPresent(Package.java:93)
	at org.apache.harmony.lang.AnnotatedElementTestFrame.testIsAnnotationPresent_Negative(AnnotatedElementTestFrame.java:320)
	at java.lang.reflect.VMReflection.invokeMethod(VMReflection.java)
	at java.lang.reflect.Method.invoke(Method.java:317)
	at junit.framework.TestCase.runTest(TestCase.java:164)
	at junit.framework.TestCase.runBare(TestCase.java)
	at junit.framework.TestResult$1.protect(TestResult.java)
	at junit.framework.TestResult.runProtected(TestResult.java)
	at junit.framework.TestResult.run(TestResult.java:109)
	at junit.framework.TestCase.run(TestCase.java:120)
	at junit.framework.TestSuite.runTest(TestSuite.java:230)
	at junit.framework.TestSuite.run(TestSuite.java:225)
	at org.apache.tools.ant.taskdefs.optional.junit.JUnitTestRunner.run(JUnitTestRunner.java:297)
	at org.apache.tools.ant.taskdefs.optional.junit.JUnitTestRunner.launch(JUnitTestRunner.java:672)
	at org.apache.tools.ant.taskdefs.optional.junit.JUnitTestRunner.main(JUnitTestRunner.java:546)
Test: testGetParameterAnnotations2Class: java.lang.reflect.Ctor5Testjava.lang.reflect.InvocationTargetException
	at java.lang.reflect.VMReflection.invokeMethod(VMReflection.java)
	at java.lang.reflect.Method.invoke(Method.java:317)
	at java.lang.reflect.Method5Test.getParamAnnotations(Method5Test.java:81)
	at java.lang.reflect.Method5Test.testGetParameterAnnotations2(Method5Test.java:113)
	at java.lang.reflect.VMReflection.invokeMethod(VMReflection.java)
	at java.lang.reflect.Method.invoke(Method.java:317)
	at junit.framework.TestCase.runTest(TestCase.java:164)
	at junit.framework.TestCase.runBare(TestCase.java)
	at junit.framework.TestResult$1.protect(TestResult.java)
	at junit.framework.TestResult.runProtected(TestResult.java)
	at junit.framework.TestResult.run(TestResult.java:109)
	at junit.framework.TestCase.run(TestCase.java:120)
	at junit.framework.TestSuite.runTest(TestSuite.java:230)
	at junit.framework.TestSuite.run(TestSuite.java:225)
	at org.apache.tools.ant.taskdefs.optional.junit.JUnitTestRunner.run(JUnitTestRunner.java:297)
	at org.apache.tools.ant.taskdefs.optional.junit.JUnitTestRunner.launch(JUnitTestRunner.java:672)
	at org.apache.tools.ant.taskdefs.optional.junit.JUnitTestRunner.main(JUnitTestRunner.java:546)
Caused by: java.lang.NullPointerException
	at java.lang.reflect.Proxy.newProxyInstance(Proxy.java:200)
	at org.apache.harmony.lang.annotation.AnnotationFactory.createAnnotation(AnnotationFactory.java:101)
	at org.apache.harmony.vm.VMGenericsAndAnnotations.getParameterAnnotations(VMGenericsAndAnnotations.java)
	at java.lang.reflect.Constructor$ConstructorData.getParameterAnnotations(Constructor.java:395)
	at java.lang.reflect.Constructor.getParameterAnnotations(Constructor.java:50)
	at java.lang.reflect.VMReflection.invokeMethod(VMReflection.java)
	... 16 more
Test: testGetParameterAnnotations3Class: java.lang.reflect.Ctor5Testjava.lang.reflect.InvocationTargetException
	at java.lang.reflect.VMReflection.invokeMethod(VMReflection.java)
	at java.lang.reflect.Method.invoke(Method.java:317)
	at java.lang.reflect.Method5Test.getParamAnnotations(Method5Test.java:81)
	at java.lang.reflect.Method5Test.testGetParameterAnnotations3(Method5Test.java:140)
	at java.lang.reflect.VMReflection.invokeMethod(VMReflection.java)
	at java.lang.reflect.Method.invoke(Method.java:317)
	at junit.framework.TestCase.runTest(TestCase.java:164)
	at junit.framework.TestCase.runBare(TestCase.java)
	at junit.framework.TestResult$1.protect(TestResult.java)
	at junit.framework.TestResult.runProtected(TestResult.java)
	at junit.framework.TestResult.run(TestResult.java:109)
	at junit.framework.TestCase.run(TestCase.java:120)
	at junit.framework.TestSuite.runTest(TestSuite.java:230)
	at junit.framework.TestSuite.run(TestSuite.java:225)
	at org.apache.tools.ant.taskdefs.optional.junit.JUnitTestRunner.run(JUnitTestRunner.java:297)
	at org.apache.tools.ant.taskdefs.optional.junit.JUnitTestRunner.launch(JUnitTestRunner.java:672)
	at org.apache.tools.ant.taskdefs.optional.junit.JUnitTestRunner.main(JUnitTestRunner.java:546)
Caused by: java.lang.NullPointerException
	at java.lang.reflect.Proxy.newProxyInstance(Proxy.java:200)
	at org.apache.harmony.lang.annotation.AnnotationFactory.createAnnotation(AnnotationFactory.java:101)
	at org.apache.harmony.vm.VMGenericsAndAnnotations.getParameterAnnotations(VMGenericsAndAnnotations.java)
	at java.lang.reflect.Constructor$ConstructorData.getParameterAnnotations(Constructor.java:395)
	at java.lang.reflect.Constructor.getParameterAnnotations(Constructor.java:50)
	at java.lang.reflect.VMReflection.invokeMethod(VMReflection.java)
	... 16 more
Test: testGetParameterAnnotationsImmutableClass: java.lang.reflect.Ctor5Testjava.lang.reflect.InvocationTargetException
	at java.lang.reflect.VMReflection.invokeMethod(VMReflection.java)
	at java.lang.reflect.Method.invoke(Method.java:317)
	at java.lang.reflect.Method5Test.getParamAnnotations(Method5Test.java:81)
	at java.lang.reflect.Method5Test.testGetParameterAnnotationsImmutable(Method5Test.java:157)
	at java.lang.reflect.VMReflection.invokeMethod(VMReflection.java)
	at java.lang.reflect.Method.invoke(Method.java:317)
	at junit.framework.TestCase.runTest(TestCase.java:164)
	at junit.framework.TestCase.runBare(TestCase.java)
	at junit.framework.TestResult$1.protect(TestResult.java)
	at junit.framework.TestResult.runProtected(TestResult.java)
	at junit.framework.TestResult.run(TestResult.java:109)
	at junit.framework.TestCase.run(TestCase.java:120)
	at junit.framework.TestSuite.runTest(TestSuite.java:230)
	at junit.framework.TestSuite.run(TestSuite.java:225)
	at org.apache.tools.ant.taskdefs.optional.junit.JUnitTestRunner.run(JUnitTestRunner.java:297)
	at org.apache.tools.ant.taskdefs.optional.junit.JUnitTestRunner.launch(JUnitTestRunner.java:672)
	at org.apache.tools.ant.taskdefs.optional.junit.JUnitTestRunner.main(JUnitTestRunner.java:546)
Caused by: java.lang.NullPointerException
	at java.lang.reflect.Proxy.newProxyInstance(Proxy.java:200)
	at org.apache.harmony.lang.annotation.AnnotationFactory.createAnnotation(AnnotationFactory.java:101)
	at org.apache.harmony.vm.VMGenericsAndAnnotations.getParameterAnnotations(VMGenericsAndAnnotations.java)
	at java.lang.reflect.Constructor$ConstructorData.getParameterAnnotations(Constructor.java:395)
	at java.lang.reflect.Constructor.getParameterAnnotations(Constructor.java:50)
	at java.lang.reflect.VMReflection.invokeMethod(VMReflection.java)
	... 16 more
Test: testGetAnnotationClass: java.lang.reflect.Ctor5Testjava.lang.NullPointerException
	at java.lang.reflect.Proxy.newProxyInstance(Proxy.java:200)
	at org.apache.harmony.lang.annotation.AnnotationFactory.createAnnotation(AnnotationFactory.java:101)
	at org.apache.harmony.vm.VMGenericsAndAnnotations.getDeclaredAnnotations(VMGenericsAndAnnotations.java)
	at java.lang.reflect.Constructor$ConstructorData.getDeclaredAnnotations(Constructor.java:377)
	at java.lang.reflect.Constructor.getAnnotation(Constructor.java:77)
	at org.apache.harmony.lang.AnnotatedElementTestFrame.testGetAnnotation(AnnotatedElementTestFrame.java)
	at java.lang.reflect.VMReflection.invokeMethod(VMReflection.java)
	at java.lang.reflect.Method.invoke(Method.java:317)
	at junit.framework.TestCase.runTest(TestCase.java:164)
	at junit.framework.TestCase.runBare(TestCase.java)
	at junit.framework.TestResult$1.protect(TestResult.java)
	at junit.framework.TestResult.runProtected(TestResult.java)
	at junit.framework.TestResult.run(TestResult.java:109)
	at junit.framework.TestCase.run(TestCase.java:120)
	at junit.framework.TestSuite.runTest(TestSuite.java:230)
	at junit.framework.TestSuite.run(TestSuite.java:225)
	at org.apache.tools.ant.taskdefs.optional.junit.JUnitTestRunner.run(JUnitTestRunner.java:297)
	at org.apache.tools.ant.taskdefs.optional.junit.JUnitTestRunner.launch(JUnitTestRunner.java:672)
	at org.apache.tools.ant.taskdefs.optional.junit.JUnitTestRunner.main(JUnitTestRunner.java:546)
Test: testGetAnnotation2Class: java.lang.reflect.Ctor5Testjava.lang.NullPointerException
	at java.lang.reflect.Proxy.newProxyInstance(Proxy.java:200)
	at org.apache.harmony.lang.annotation.AnnotationFactory.createAnnotation(AnnotationFactory.java:101)
	at org.apache.harmony.vm.VMGenericsAndAnnotations.getDeclaredAnnotations(VMGenericsAndAnnotations.java)
	at java.lang.reflect.Constructor$ConstructorData.getDeclaredAnnotations(Constructor.java:377)
	at java.lang.reflect.Constructor.getAnnotation(Constructor.java:77)
	at org.apache.harmony.lang.AnnotatedElementTestFrame.testGetAnnotation2(AnnotatedElementTestFrame.java)
	at java.lang.reflect.VMReflection.invokeMethod(VMReflection.java)
	at java.lang.reflect.Method.invoke(Method.java:317)
	at junit.framework.TestCase.runTest(TestCase.java:164)
	at junit.framework.TestCase.runBare(TestCase.java)
	at junit.framework.TestResult$1.protect(TestResult.java)
	at junit.framework.TestResult.runProtected(TestResult.java)
	at junit.framework.TestResult.run(TestResult.java:109)
	at junit.framework.TestCase.run(TestCase.java:120)
	at junit.framework.TestSuite.runTest(TestSuite.java:230)
	at junit.framework.TestSuite.run(TestSuite.java:225)
	at org.apache.tools.ant.taskdefs.optional.junit.JUnitTestRunner.run(JUnitTestRunner.java:297)
	at org.apache.tools.ant.taskdefs.optional.junit.JUnitTestRunner.launch(JUnitTestRunner.java:672)
	at org.apache.tools.ant.taskdefs.optional.junit.JUnitTestRunner.main(JUnitTestRunner.java:546)
Test: testGetAnnotation_NegativeClass: java.lang.reflect.Ctor5Testjava.lang.NullPointerException
	at java.lang.reflect.Proxy.newProxyInstance(Proxy.java:200)
	at org.apache.harmony.lang.annotation.AnnotationFactory.createAnnotation(AnnotationFactory.java:101)
	at org.apache.harmony.vm.VMGenericsAndAnnotations.getDeclaredAnnotations(VMGenericsAndAnnotations.java)
	at java.lang.reflect.Constructor$ConstructorData.getDeclaredAnnotations(Constructor.java:377)
	at java.lang.reflect.Constructor.getAnnotation(Constructor.java:77)
	at org.apache.harmony.lang.AnnotatedElementTestFrame.testGetAnnotation_Negative(AnnotatedElementTestFrame.java)
	at java.lang.reflect.VMReflection.invokeMethod(VMReflection.java)
	at java.lang.reflect.Method.invoke(Method.java:317)
	at junit.framework.TestCase.runTest(TestCase.java:164)
	at junit.framework.TestCase.runBare(TestCase.java)
	at junit.framework.TestResult$1.protect(TestResult.java)
	at junit.framework.TestResult.runProtected(TestResult.java)
	at junit.framework.TestResult.run(TestResult.java:109)
	at junit.framework.TestCase.run(TestCase.java:120)
	at junit.framework.TestSuite.runTest(TestSuite.java:230)
	at junit.framework.TestSuite.run(TestSuite.java:225)
	at org.apache.tools.ant.taskdefs.optional.junit.JUnitTestRunner.run(JUnitTestRunner.java:297)
	at org.apache.tools.ant.taskdefs.optional.junit.JUnitTestRunner.launch(JUnitTestRunner.java:672)
	at org.apache.tools.ant.taskdefs.optional.junit.JUnitTestRunner.main(JUnitTestRunner.java:546)
Test: testGetDeclaredAnnotationsClass: java.lang.reflect.Ctor5Testjava.lang.NullPointerException
	at java.lang.reflect.Proxy.newProxyInstance(Proxy.java:200)
	at org.apache.harmony.lang.annotation.AnnotationFactory.createAnnotation(AnnotationFactory.java:101)
	at org.apache.harmony.vm.VMGenericsAndAnnotations.getDeclaredAnnotations(VMGenericsAndAnnotations.java)
	at java.lang.reflect.Constructor$ConstructorData.getDeclaredAnnotations(Constructor.java:377)
	at java.lang.reflect.Constructor.getDeclaredAnnotations(Constructor.java:63)
	at org.apache.harmony.lang.AnnotatedElementTestFrame.testGetDeclaredAnnotations(AnnotatedElementTestFrame.java:162)
	at java.lang.reflect.VMReflection.invokeMethod(VMReflection.java)
	at java.lang.reflect.Method.invoke(Method.java:317)
	at junit.framework.TestCase.runTest(TestCase.java:164)
	at junit.framework.TestCase.runBare(TestCase.java)
	at junit.framework.TestResult$1.protect(TestResult.java)
	at junit.framework.TestResult.runProtected(TestResult.java)
	at junit.framework.TestResult.run(TestResult.java:109)
	at junit.framework.TestCase.run(TestCase.java:120)
	at junit.framework.TestSuite.runTest(TestSuite.java:230)
	at junit.framework.TestSuite.run(TestSuite.java:225)
	at org.apache.tools.ant.taskdefs.optional.junit.JUnitTestRunner.run(JUnitTestRunner.java:297)
	at org.apache.tools.ant.taskdefs.optional.junit.JUnitTestRunner.launch(JUnitTestRunner.java:672)
	at org.apache.tools.ant.taskdefs.optional.junit.JUnitTestRunner.main(JUnitTestRunner.java:546)
Test: testGetDeclaredAnnotations2Class: java.lang.reflect.Ctor5Testjava.lang.NullPointerException
	at java.lang.reflect.Proxy.newProxyInstance(Proxy.java:200)
	at org.apache.harmony.lang.annotation.AnnotationFactory.createAnnotation(AnnotationFactory.java:101)
	at org.apache.harmony.vm.VMGenericsAndAnnotations.getDeclaredAnnotations(VMGenericsAndAnnotations.java)
	at java.lang.reflect.Constructor$ConstructorData.getDeclaredAnnotations(Constructor.java:377)
	at java.lang.reflect.Constructor.getDeclaredAnnotations(Constructor.java:63)
	at org.apache.harmony.lang.AnnotatedElementTestFrame.testGetDeclaredAnnotations2(AnnotatedElementTestFrame.java:173)
	at java.lang.reflect.VMReflection.invokeMethod(VMReflection.java)
	at java.lang.reflect.Method.invoke(Method.java:317)
	at junit.framework.TestCase.runTest(TestCase.java:164)
	at junit.framework.TestCase.runBare(TestCase.java)
	at junit.framework.TestResult$1.protect(TestResult.java)
	at junit.framework.TestResult.runProtected(TestResult.java)
	at junit.framework.TestResult.run(TestResult.java:109)
	at junit.framework.TestCase.run(TestCase.java:120)
	at junit.framework.TestSuite.runTest(TestSuite.java:230)
	at junit.framework.TestSuite.run(TestSuite.java:225)
	at org.apache.tools.ant.taskdefs.optional.junit.JUnitTestRunner.run(JUnitTestRunner.java:297)
	at org.apache.tools.ant.taskdefs.optional.junit.JUnitTestRunner.launch(JUnitTestRunner.java:672)
	at org.apache.tools.ant.taskdefs.optional.junit.JUnitTestRunner.main(JUnitTestRunner.java:546)
Test: testGetDeclaredAnnotationsImmutableClass: java.lang.reflect.Ctor5Testjava.lang.NullPointerException
	at java.lang.reflect.Proxy.newProxyInstance(Proxy.java:200)
	at org.apache.harmony.lang.annotation.AnnotationFactory.createAnnotation(AnnotationFactory.java:101)
	at org.apache.harmony.vm.VMGenericsAndAnnotations.getDeclaredAnnotations(VMGenericsAndAnnotations.java)
	at java.lang.reflect.Constructor$ConstructorData.getDeclaredAnnotations(Constructor.java:377)
	at java.lang.reflect.Constructor.getDeclaredAnnotations(Constructor.java:63)
	at org.apache.harmony.lang.AnnotatedElementTestFrame.testGetDeclaredAnnotationsImmutable(AnnotatedElementTestFrame.java:198)
	at java.lang.reflect.VMReflection.invokeMethod(VMReflection.java)
	at java.lang.reflect.Method.invoke(Method.java:317)
	at junit.framework.TestCase.runTest(TestCase.java:164)
	at junit.framework.TestCase.runBare(TestCase.java)
	at junit.framework.TestResult$1.protect(TestResult.java)
	at junit.framework.TestResult.runProtected(TestResult.java)
	at junit.framework.TestResult.run(TestResult.java:109)
	at junit.framework.TestCase.run(TestCase.java:120)
	at junit.framework.TestSuite.runTest(TestSuite.java:230)
	at junit.framework.TestSuite.run(TestSuite.java:225)
	at org.apache.tools.ant.taskdefs.optional.junit.JUnitTestRunner.run(JUnitTestRunner.java:297)
	at org.apache.tools.ant.taskdefs.optional.junit.JUnitTestRunner.launch(JUnitTestRunner.java:672)
	at org.apache.tools.ant.taskdefs.optional.junit.JUnitTestRunner.main(JUnitTestRunner.java:546)
Test: testGetAnnotationsClass: java.lang.reflect.Ctor5Testjava.lang.NullPointerException
	at java.lang.reflect.Proxy.newProxyInstance(Proxy.java:200)
	at org.apache.harmony.lang.annotation.AnnotationFactory.createAnnotation(AnnotationFactory.java:101)
	at org.apache.harmony.vm.VMGenericsAndAnnotations.getDeclaredAnnotations(VMGenericsAndAnnotations.java)
	at java.lang.reflect.Constructor$ConstructorData.getDeclaredAnnotations(Constructor.java:377)
	at java.lang.reflect.Constructor.getDeclaredAnnotations(Constructor.java:63)
	at java.lang.reflect.AccessibleObject.getAnnotations(AccessibleObject.java)
	at org.apache.harmony.lang.AnnotatedElementTestFrame.testGetAnnotations(AnnotatedElementTestFrame.java:215)
	at java.lang.reflect.VMReflection.invokeMethod(VMReflection.java)
	at java.lang.reflect.Method.invoke(Method.java:317)
	at junit.framework.TestCase.runTest(TestCase.java:164)
	at junit.framework.TestCase.runBare(TestCase.java)
	at junit.framework.TestResult$1.protect(TestResult.java)
	at junit.framework.TestResult.runProtected(TestResult.java)
	at junit.framework.TestResult.run(TestResult.java:109)
	at junit.framework.TestCase.run(TestCase.java:120)
	at junit.framework.TestSuite.runTest(TestSuite.java:230)
	at junit.framework.TestSuite.run(TestSuite.java:225)
	at org.apache.tools.ant.taskdefs.optional.junit.JUnitTestRunner.run(JUnitTestRunner.java:297)
	at org.apache.tools.ant.taskdefs.optional.junit.JUnitTestRunner.launch(JUnitTestRunner.java:672)
	at org.apache.tools.ant.taskdefs.optional.junit.JUnitTestRunner.main(JUnitTestRunner.java:546)
Test: testGetAnnotations2Class: java.lang.reflect.Ctor5Testjava.lang.NullPointerException
	at java.lang.reflect.Proxy.newProxyInstance(Proxy.java:200)
	at org.apache.harmony.lang.annotation.AnnotationFactory.createAnnotation(AnnotationFactory.java:101)
	at org.apache.harmony.vm.VMGenericsAndAnnotations.getDeclaredAnnotations(VMGenericsAndAnnotations.java)
	at java.lang.reflect.Constructor$ConstructorData.getDeclaredAnnotations(Constructor.java:377)
	at java.lang.reflect.Constructor.getDeclaredAnnotations(Constructor.java:63)
	at java.lang.reflect.AccessibleObject.getAnnotations(AccessibleObject.java)
	at org.apache.harmony.lang.AnnotatedElementTestFrame.testGetAnnotations2(AnnotatedElementTestFrame.java:226)
	at java.lang.reflect.VMReflection.invokeMethod(VMReflection.java)
	at java.lang.reflect.Method.invoke(Method.java:317)
	at junit.framework.TestCase.runTest(TestCase.java:164)
	at junit.framework.TestCase.runBare(TestCase.java)
	at junit.framework.TestResult$1.protect(TestResult.java)
	at junit.framework.TestResult.runProtected(TestResult.java)
	at junit.framework.TestResult.run(TestResult.java:109)
	at junit.framework.TestCase.run(TestCase.java:120)
	at junit.framework.TestSuite.runTest(TestSuite.java:230)
	at junit.framework.TestSuite.run(TestSuite.java:225)
	at org.apache.tools.ant.taskdefs.optional.junit.JUnitTestRunner.run(JUnitTestRunner.java:297)
	at org.apache.tools.ant.taskdefs.optional.junit.JUnitTestRunner.launch(JUnitTestRunner.java:672)
	at org.apache.tools.ant.taskdefs.optional.junit.JUnitTestRunner.main(JUnitTestRunner.java:546)
Test: testGetAnnotations5Class: java.lang.reflect.Ctor5Testjava.lang.NullPointerException
	at java.lang.reflect.Proxy.newProxyInstance(Proxy.java:200)
	at org.apache.harmony.lang.annotation.AnnotationFactory.createAnnotation(AnnotationFactory.java:101)
	at org.apache.harmony.vm.VMGenericsAndAnnotations.getDeclaredAnnotations(VMGenericsAndAnnotations.java)
	at java.lang.reflect.Constructor$ConstructorData.getDeclaredAnnotations(Constructor.java:377)
	at java.lang.reflect.Constructor.getDeclaredAnnotations(Constructor.java:63)
	at java.lang.reflect.AccessibleObject.getAnnotations(AccessibleObject.java)
	at org.apache.harmony.lang.AnnotatedElementTestFrame.testGetAnnotations5(AnnotatedElementTestFrame.java:264)
	at java.lang.reflect.VMReflection.invokeMethod(VMReflection.java)
	at java.lang.reflect.Method.invoke(Method.java:317)
	at junit.framework.TestCase.runTest(TestCase.java:164)
	at junit.framework.TestCase.runBare(TestCase.java)
	at junit.framework.TestResult$1.protect(TestResult.java)
	at junit.framework.TestResult.runProtected(TestResult.java)
	at junit.framework.TestResult.run(TestResult.java:109)
	at junit.framework.TestCase.run(TestCase.java:120)
	at junit.framework.TestSuite.runTest(TestSuite.java:230)
	at junit.framework.TestSuite.run(TestSuite.java:225)
	at org.apache.tools.ant.taskdefs.optional.junit.JUnitTestRunner.run(JUnitTestRunner.java:297)
	at org.apache.tools.ant.taskdefs.optional.junit.JUnitTestRunner.launch(JUnitTestRunner.java:672)
	at org.apache.tools.ant.taskdefs.optional.junit.JUnitTestRunner.main(JUnitTestRunner.java:546)
Test: testGetAnnotationsImmutableClass: java.lang.reflect.Ctor5Testjava.lang.NullPointerException
	at java.lang.reflect.Proxy.newProxyInstance(Proxy.java:200)
	at org.apache.harmony.lang.annotation.AnnotationFactory.createAnnotation(AnnotationFactory.java:101)
	at org.apache.harmony.vm.VMGenericsAndAnnotations.getDeclaredAnnotations(VMGenericsAndAnnotations.java)
	at java.lang.reflect.Constructor$ConstructorData.getDeclaredAnnotations(Constructor.java:377)
	at java.lang.reflect.Constructor.getDeclaredAnnotations(Constructor.java:63)
	at java.lang.reflect.AccessibleObject.getAnnotations(AccessibleObject.java)
	at org.apache.harmony.lang.AnnotatedElementTestFrame.testGetAnnotationsImmutable(AnnotatedElementTestFrame.java:293)
	at java.lang.reflect.VMReflection.invokeMethod(VMReflection.java)
	at java.lang.reflect.Method.invoke(Method.java:317)
	at junit.framework.TestCase.runTest(TestCase.java:164)
	at junit.framework.TestCase.runBare(TestCase.java)
	at junit.framework.TestResult$1.protect(TestResult.java)
	at junit.framework.TestResult.runProtected(TestResult.java)
	at junit.framework.TestResult.run(TestResult.java:109)
	at junit.framework.TestCase.run(TestCase.java:120)
	at junit.framework.TestSuite.runTest(TestSuite.java:230)
	at junit.framework.TestSuite.run(TestSuite.java:225)
	at org.apache.tools.ant.taskdefs.optional.junit.JUnitTestRunner.run(JUnitTestRunner.java:297)
	at org.apache.tools.ant.taskdefs.optional.junit.JUnitTestRunner.launch(JUnitTestRunner.java:672)
	at org.apache.tools.ant.taskdefs.optional.junit.JUnitTestRunner.main(JUnitTestRunner.java:546)
Test: testIsAnnotationPresentClass: java.lang.reflect.Ctor5Testjava.lang.NullPointerException
	at java.lang.reflect.Proxy.newProxyInstance(Proxy.java:200)
	at org.apache.harmony.lang.annotation.AnnotationFactory.createAnnotation(AnnotationFactory.java:101)
	at org.apache.harmony.vm.VMGenericsAndAnnotations.getDeclaredAnnotations(VMGenericsAndAnnotations.java)
	at java.lang.reflect.Constructor$ConstructorData.getDeclaredAnnotations(Constructor.java:377)
	at java.lang.reflect.Constructor.getAnnotation(Constructor.java:77)
	at java.lang.reflect.AccessibleObject.isAnnotationPresent(AccessibleObject.java)
	at org.apache.harmony.lang.AnnotatedElementTestFrame.testIsAnnotationPresent(AnnotatedElementTestFrame.java:310)
	at java.lang.reflect.VMReflection.invokeMethod(VMReflection.java)
	at java.lang.reflect.Method.invoke(Method.java:317)
	at junit.framework.TestCase.runTest(TestCase.java:164)
	at junit.framework.TestCase.runBare(TestCase.java)
	at junit.framework.TestResult$1.protect(TestResult.java)
	at junit.framework.TestResult.runProtected(TestResult.java)
	at junit.framework.TestResult.run(TestResult.java:109)
	at junit.framework.TestCase.run(TestCase.java:120)
	at junit.framework.TestSuite.runTest(TestSuite.java:230)
	at junit.framework.TestSuite.run(TestSuite.java:225)
	at org.apache.tools.ant.taskdefs.optional.junit.JUnitTestRunner.run(JUnitTestRunner.java:297)
	at org.apache.tools.ant.taskdefs.optional.junit.JUnitTestRunner.launch(JUnitTestRunner.java:672)
	at org.apache.tools.ant.taskdefs.optional.junit.JUnitTestRunner.main(JUnitTestRunner.java:546)
Test: testIsAnnotationPresent_NegativeClass: java.lang.reflect.Ctor5Testjava.lang.NullPointerException
	at java.lang.reflect.Proxy.newProxyInstance(Proxy.java:200)
	at org.apache.harmony.lang.annotation.AnnotationFactory.createAnnotation(AnnotationFactory.java:101)
	at org.apache.harmony.vm.VMGenericsAndAnnotations.getDeclaredAnnotations(VMGenericsAndAnnotations.java)
	at java.lang.reflect.Constructor$ConstructorData.getDeclaredAnnotations(Constructor.java:377)
	at java.lang.reflect.Constructor.getAnnotation(Constructor.java:77)
	at java.lang.reflect.AccessibleObject.isAnnotationPresent(AccessibleObject.java)
	at org.apache.harmony.lang.AnnotatedElementTestFrame.testIsAnnotationPresent_Negative(AnnotatedElementTestFrame.java:320)
	at java.lang.reflect.VMReflection.invokeMethod(VMReflection.java)
	at java.lang.reflect.Method.invoke(Method.java:317)
	at junit.framework.TestCase.runTest(TestCase.java:164)
	at junit.framework.TestCase.runBare(TestCase.java)
	at junit.framework.TestResult$1.protect(TestResult.java)
	at junit.framework.TestResult.runProtected(TestResult.java)
	at junit.framework.TestResult.run(TestResult.java:109)
	at junit.framework.TestCase.run(TestCase.java:120)
	at junit.framework.TestSuite.runTest(TestSuite.java:230)
	at junit.framework.TestSuite.run(TestSuite.java:225)
	at org.apache.tools.ant.taskdefs.optional.junit.JUnitTestRunner.run(JUnitTestRunner.java:297)
	at org.apache.tools.ant.taskdefs.optional.junit.JUnitTestRunner.launch(JUnitTestRunner.java:672)
	at org.apache.tools.ant.taskdefs.optional.junit.JUnitTestRunner.main(JUnitTestRunner.java:546)
Test: testGetAnnotationClass: java.lang.reflect.Field5Testjava.lang.NullPointerException
	at java.lang.reflect.Proxy.newProxyInstance(Proxy.java:200)
	at org.apache.harmony.lang.annotation.AnnotationFactory.createAnnotation(AnnotationFactory.java:101)
	at org.apache.harmony.vm.VMGenericsAndAnnotations.getDeclaredAnnotations(VMGenericsAndAnnotations.java)
	at java.lang.reflect.Field$FieldData.getAnnotations(Field.java:458)
	at java.lang.reflect.Field.getAnnotation(Field.java:56)
	at org.apache.harmony.lang.AnnotatedElementTestFrame.testGetAnnotation(AnnotatedElementTestFrame.java)
	at java.lang.reflect.VMReflection.invokeMethod(VMReflection.java)
	at java.lang.reflect.Method.invoke(Method.java:317)
	at junit.framework.TestCase.runTest(TestCase.java:164)
	at junit.framework.TestCase.runBare(TestCase.java)
	at junit.framework.TestResult$1.protect(TestResult.java)
	at junit.framework.TestResult.runProtected(TestResult.java)
	at junit.framework.TestResult.run(TestResult.java:109)
	at junit.framework.TestCase.run(TestCase.java:120)
	at junit.framework.TestSuite.runTest(TestSuite.java:230)
	at junit.framework.TestSuite.run(TestSuite.java:225)
	at org.apache.tools.ant.taskdefs.optional.junit.JUnitTestRunner.run(JUnitTestRunner.java:297)
	at org.apache.tools.ant.taskdefs.optional.junit.JUnitTestRunner.launch(JUnitTestRunner.java:672)
	at org.apache.tools.ant.taskdefs.optional.junit.JUnitTestRunner.main(JUnitTestRunner.java:546)
Test: testGetAnnotation2Class: java.lang.reflect.Field5Testjava.lang.NullPointerException
	at java.lang.reflect.Proxy.newProxyInstance(Proxy.java:200)
	at org.apache.harmony.lang.annotation.AnnotationFactory.createAnnotation(AnnotationFactory.java:101)
	at org.apache.harmony.vm.VMGenericsAndAnnotations.getDeclaredAnnotations(VMGenericsAndAnnotations.java)
	at java.lang.reflect.Field$FieldData.getAnnotations(Field.java:458)
	at java.lang.reflect.Field.getAnnotation(Field.java:56)
	at org.apache.harmony.lang.AnnotatedElementTestFrame.testGetAnnotation2(AnnotatedElementTestFrame.java)
	at java.lang.reflect.VMReflection.invokeMethod(VMReflection.java)
	at java.lang.reflect.Method.invoke(Method.java:317)
	at junit.framework.TestCase.runTest(TestCase.java:164)
	at junit.framework.TestCase.runBare(TestCase.java)
	at junit.framework.TestResult$1.protect(TestResult.java)
	at junit.framework.TestResult.runProtected(TestResult.java)
	at junit.framework.TestResult.run(TestResult.java:109)
	at junit.framework.TestCase.run(TestCase.java:120)
	at junit.framework.TestSuite.runTest(TestSuite.java:230)
	at junit.framework.TestSuite.run(TestSuite.java:225)
	at org.apache.tools.ant.taskdefs.optional.junit.JUnitTestRunner.run(JUnitTestRunner.java:297)
	at org.apache.tools.ant.taskdefs.optional.junit.JUnitTestRunner.launch(JUnitTestRunner.java:672)
	at org.apache.tools.ant.taskdefs.optional.junit.JUnitTestRunner.main(JUnitTestRunner.java:546)
Test: testGetAnnotation_NegativeClass: java.lang.reflect.Field5Testjava.lang.NullPointerException
	at java.lang.reflect.Proxy.newProxyInstance(Proxy.java:200)
	at org.apache.harmony.lang.annotation.AnnotationFactory.createAnnotation(AnnotationFactory.java:101)
	at org.apache.harmony.vm.VMGenericsAndAnnotations.getDeclaredAnnotations(VMGenericsAndAnnotations.java)
	at java.lang.reflect.Field$FieldData.getAnnotations(Field.java:458)
	at java.lang.reflect.Field.getAnnotation(Field.java:56)
	at org.apache.harmony.lang.AnnotatedElementTestFrame.testGetAnnotation_Negative(AnnotatedElementTestFrame.java)
	at java.lang.reflect.VMReflection.invokeMethod(VMReflection.java)
	at java.lang.reflect.Method.invoke(Method.java:317)
	at junit.framework.TestCase.runTest(TestCase.java:164)
	at junit.framework.TestCase.runBare(TestCase.java)
	at junit.framework.TestResult$1.protect(TestResult.java)
	at junit.framework.TestResult.runProtected(TestResult.java)
	at junit.framework.TestResult.run(TestResult.java:109)
	at junit.framework.TestCase.run(TestCase.java:120)
	at junit.framework.TestSuite.runTest(TestSuite.java:230)
	at junit.framework.TestSuite.run(TestSuite.java:225)
	at org.apache.tools.ant.taskdefs.optional.junit.JUnitTestRunner.run(JUnitTestRunner.java:297)
	at org.apache.tools.ant.taskdefs.optional.junit.JUnitTestRunner.launch(JUnitTestRunner.java:672)
	at org.apache.tools.ant.taskdefs.optional.junit.JUnitTestRunner.main(JUnitTestRunner.java:546)
Test: testGetDeclaredAnnotationsClass: java.lang.reflect.Field5Testjava.lang.NullPointerException
	at java.lang.reflect.Proxy.newProxyInstance(Proxy.java:200)
	at org.apache.harmony.lang.annotation.AnnotationFactory.createAnnotation(AnnotationFactory.java:101)
	at org.apache.harmony.vm.VMGenericsAndAnnotations.getDeclaredAnnotations(VMGenericsAndAnnotations.java)
	at java.lang.reflect.Field$FieldData.getAnnotations(Field.java:458)
	at java.lang.reflect.Field.getDeclaredAnnotations(Field.java:42)
	at org.apache.harmony.lang.AnnotatedElementTestFrame.testGetDeclaredAnnotations(AnnotatedElementTestFrame.java:162)
	at java.lang.reflect.VMReflection.invokeMethod(VMReflection.java)
	at java.lang.reflect.Method.invoke(Method.java:317)
	at junit.framework.TestCase.runTest(TestCase.java:164)
	at junit.framework.TestCase.runBare(TestCase.java)
	at junit.framework.TestResult$1.protect(TestResult.java)
	at junit.framework.TestResult.runProtected(TestResult.java)
	at junit.framework.TestResult.run(TestResult.java:109)
	at junit.framework.TestCase.run(TestCase.java:120)
	at junit.framework.TestSuite.runTest(TestSuite.java:230)
	at junit.framework.TestSuite.run(TestSuite.java:225)
	at org.apache.tools.ant.taskdefs.optional.junit.JUnitTestRunner.run(JUnitTestRunner.java:297)
	at org.apache.tools.ant.taskdefs.optional.junit.JUnitTestRunner.launch(JUnitTestRunner.java:672)
	at org.apache.tools.ant.taskdefs.optional.junit.JUnitTestRunner.main(JUnitTestRunner.java:546)
Test: testGetDeclaredAnnotations2Class: java.lang.reflect.Field5Testjava.lang.NullPointerException
	at java.lang.reflect.Proxy.newProxyInstance(Proxy.java:200)
	at org.apache.harmony.lang.annotation.AnnotationFactory.createAnnotation(AnnotationFactory.java:101)
	at org.apache.harmony.vm.VMGenericsAndAnnotations.getDeclaredAnnotations(VMGenericsAndAnnotations.java)
	at java.lang.reflect.Field$FieldData.getAnnotations(Field.java:458)
	at java.lang.reflect.Field.getDeclaredAnnotations(Field.java:42)
	at org.apache.harmony.lang.AnnotatedElementTestFrame.testGetDeclaredAnnotations2(AnnotatedElementTestFrame.java:173)
	at java.lang.reflect.VMReflection.invokeMethod(VMReflection.java)
	at java.lang.reflect.Method.invoke(Method.java:317)
	at junit.framework.TestCase.runTest(TestCase.java:164)
	at junit.framework.TestCase.runBare(TestCase.java)
	at junit.framework.TestResult$1.protect(TestResult.java)
	at junit.framework.TestResult.runProtected(TestResult.java)
	at junit.framework.TestResult.run(TestResult.java:109)
	at junit.framework.TestCase.run(TestCase.java:120)
	at junit.framework.TestSuite.runTest(TestSuite.java:230)
	at junit.framework.TestSuite.run(TestSuite.java:225)
	at org.apache.tools.ant.taskdefs.optional.junit.JUnitTestRunner.run(JUnitTestRunner.java:297)
	at org.apache.tools.ant.taskdefs.optional.junit.JUnitTestRunner.launch(JUnitTestRunner.java:672)
	at org.apache.tools.ant.taskdefs.optional.junit.JUnitTestRunner.main(JUnitTestRunner.java:546)
Test: testGetDeclaredAnnotationsImmutableClass: java.lang.reflect.Field5Testjava.lang.NullPointerException
	at java.lang.reflect.Proxy.newProxyInstance(Proxy.java:200)
	at org.apache.harmony.lang.annotation.AnnotationFactory.createAnnotation(AnnotationFactory.java:101)
	at org.apache.harmony.vm.VMGenericsAndAnnotations.getDeclaredAnnotations(VMGenericsAndAnnotations.java)
	at java.lang.reflect.Field$FieldData.getAnnotations(Field.java:458)
	at java.lang.reflect.Field.getDeclaredAnnotations(Field.java:42)
	at org.apache.harmony.lang.AnnotatedElementTestFrame.testGetDeclaredAnnotationsImmutable(AnnotatedElementTestFrame.java:198)
	at java.lang.reflect.VMReflection.invokeMethod(VMReflection.java)
	at java.lang.reflect.Method.invoke(Method.java:317)
	at junit.framework.TestCase.runTest(TestCase.java:164)
	at junit.framework.TestCase.runBare(TestCase.java)
	at junit.framework.TestResult$1.protect(TestResult.java)
	at junit.framework.TestResult.runProtected(TestResult.java)
	at junit.framework.TestResult.run(TestResult.java:109)
	at junit.framework.TestCase.run(TestCase.java:120)
	at junit.framework.TestSuite.runTest(TestSuite.java:230)
	at junit.framework.TestSuite.run(TestSuite.java:225)
	at org.apache.tools.ant.taskdefs.optional.junit.JUnitTestRunner.run(JUnitTestRunner.java:297)
	at org.apache.tools.ant.taskdefs.optional.junit.JUnitTestRunner.launch(JUnitTestRunner.java:672)
	at org.apache.tools.ant.taskdefs.optional.junit.JUnitTestRunner.main(JUnitTestRunner.java:546)
Test: testGetAnnotationsClass: java.lang.reflect.Field5Testjava.lang.NullPointerException
	at java.lang.reflect.Proxy.newProxyInstance(Proxy.java:200)
	at org.apache.harmony.lang.annotation.AnnotationFactory.createAnnotation(AnnotationFactory.java:101)
	at org.apache.harmony.vm.VMGenericsAndAnnotations.getDeclaredAnnotations(VMGenericsAndAnnotations.java)
	at java.lang.reflect.Field$FieldData.getAnnotations(Field.java:458)
	at java.lang.reflect.Field.getDeclaredAnnotations(Field.java:42)
	at java.lang.reflect.AccessibleObject.getAnnotations(AccessibleObject.java)
	at org.apache.harmony.lang.AnnotatedElementTestFrame.testGetAnnotations(AnnotatedElementTestFrame.java:215)
	at java.lang.reflect.VMReflection.invokeMethod(VMReflection.java)
	at java.lang.reflect.Method.invoke(Method.java:317)
	at junit.framework.TestCase.runTest(TestCase.java:164)
	at junit.framework.TestCase.runBare(TestCase.java)
	at junit.framework.TestResult$1.protect(TestResult.java)
	at junit.framework.TestResult.runProtected(TestResult.java)
	at junit.framework.TestResult.run(TestResult.java:109)
	at junit.framework.TestCase.run(TestCase.java:120)
	at junit.framework.TestSuite.runTest(TestSuite.java:230)
	at junit.framework.TestSuite.run(TestSuite.java:225)
	at org.apache.tools.ant.taskdefs.optional.junit.JUnitTestRunner.run(JUnitTestRunner.java:297)
	at org.apache.tools.ant.taskdefs.optional.junit.JUnitTestRunner.launch(JUnitTestRunner.java:672)
	at org.apache.tools.ant.taskdefs.optional.junit.JUnitTestRunner.main(JUnitTestRunner.java:546)
Test: testGetAnnotations2Class: java.lang.reflect.Field5Testjava.lang.NullPointerException
	at java.lang.reflect.Proxy.newProxyInstance(Proxy.java:200)
	at org.apache.harmony.lang.annotation.AnnotationFactory.createAnnotation(AnnotationFactory.java:101)
	at org.apache.harmony.vm.VMGenericsAndAnnotations.getDeclaredAnnotations(VMGenericsAndAnnotations.java)
	at java.lang.reflect.Field$FieldData.getAnnotations(Field.java:458)
	at java.lang.reflect.Field.getDeclaredAnnotations(Field.java:42)
	at java.lang.reflect.AccessibleObject.getAnnotations(AccessibleObject.java)
	at org.apache.harmony.lang.AnnotatedElementTestFrame.testGetAnnotations2(AnnotatedElementTestFrame.java:226)
	at java.lang.reflect.VMReflection.invokeMethod(VMReflection.java)
	at java.lang.reflect.Method.invoke(Method.java:317)
	at junit.framework.TestCase.runTest(TestCase.java:164)
	at junit.framework.TestCase.runBare(TestCase.java)
	at junit.framework.TestResult$1.protect(TestResult.java)
	at junit.framework.TestResult.runProtected(TestResult.java)
	at junit.framework.TestResult.run(TestResult.java:109)
	at junit.framework.TestCase.run(TestCase.java:120)
	at junit.framework.TestSuite.runTest(TestSuite.java:230)
	at junit.framework.TestSuite.run(TestSuite.java:225)
	at org.apache.tools.ant.taskdefs.optional.junit.JUnitTestRunner.run(JUnitTestRunner.java:297)
	at org.apache.tools.ant.taskdefs.optional.junit.JUnitTestRunner.launch(JUnitTestRunner.java:672)
	at org.apache.tools.ant.taskdefs.optional.junit.JUnitTestRunner.main(JUnitTestRunner.java:546)
Test: testGetAnnotations5Class: java.lang.reflect.Field5Testjava.lang.NullPointerException
	at java.lang.reflect.Proxy.newProxyInstance(Proxy.java:200)
	at org.apache.harmony.lang.annotation.AnnotationFactory.createAnnotation(AnnotationFactory.java:101)
	at org.apache.harmony.vm.VMGenericsAndAnnotations.getDeclaredAnnotations(VMGenericsAndAnnotations.java)
	at java.lang.reflect.Field$FieldData.getAnnotations(Field.java:458)
	at java.lang.reflect.Field.getDeclaredAnnotations(Field.java:42)
	at java.lang.reflect.AccessibleObject.getAnnotations(AccessibleObject.java)
	at org.apache.harmony.lang.AnnotatedElementTestFrame.testGetAnnotations5(AnnotatedElementTestFrame.java:264)
	at java.lang.reflect.VMReflection.invokeMethod(VMReflection.java)
	at java.lang.reflect.Method.invoke(Method.java:317)
	at junit.framework.TestCase.runTest(TestCase.java:164)
	at junit.framework.TestCase.runBare(TestCase.java)
	at junit.framework.TestResult$1.protect(TestResult.java)
	at junit.framework.TestResult.runProtected(TestResult.java)
	at junit.framework.TestResult.run(TestResult.java:109)
	at junit.framework.TestCase.run(TestCase.java:120)
	at junit.framework.TestSuite.runTest(TestSuite.java:230)
	at junit.framework.TestSuite.run(TestSuite.java:225)
	at org.apache.tools.ant.taskdefs.optional.junit.JUnitTestRunner.run(JUnitTestRunner.java:297)
	at org.apache.tools.ant.taskdefs.optional.junit.JUnitTestRunner.launch(JUnitTestRunner.java:672)
	at org.apache.tools.ant.taskdefs.optional.junit.JUnitTestRunner.main(JUnitTestRunner.java:546)
Test: testGetAnnotationsImmutableClass: java.lang.reflect.Field5Testjava.lang.NullPointerException
	at java.lang.reflect.Proxy.newProxyInstance(Proxy.java:200)
	at org.apache.harmony.lang.annotation.AnnotationFactory.createAnnotation(AnnotationFactory.java:101)
	at org.apache.harmony.vm.VMGenericsAndAnnotations.getDeclaredAnnotations(VMGenericsAndAnnotations.java)
	at java.lang.reflect.Field$FieldData.getAnnotations(Field.java:458)
	at java.lang.reflect.Field.getDeclaredAnnotations(Field.java:42)
	at java.lang.reflect.AccessibleObject.getAnnotations(AccessibleObject.java)
	at org.apache.harmony.lang.AnnotatedElementTestFrame.testGetAnnotationsImmutable(AnnotatedElementTestFrame.java:293)
	at java.lang.reflect.VMReflection.invokeMethod(VMReflection.java)
	at java.lang.reflect.Method.invoke(Method.java:317)
	at junit.framework.TestCase.runTest(TestCase.java:164)
	at junit.framework.TestCase.runBare(TestCase.java)
	at junit.framework.TestResult$1.protect(TestResult.java)
	at junit.framework.TestResult.runProtected(TestResult.java)
	at junit.framework.TestResult.run(TestResult.java:109)
	at junit.framework.TestCase.run(TestCase.java:120)
	at junit.framework.TestSuite.runTest(TestSuite.java:230)
	at junit.framework.TestSuite.run(TestSuite.java:225)
	at org.apache.tools.ant.taskdefs.optional.junit.JUnitTestRunner.run(JUnitTestRunner.java:297)
	at org.apache.tools.ant.taskdefs.optional.junit.JUnitTestRunner.launch(JUnitTestRunner.java:672)
	at org.apache.tools.ant.taskdefs.optional.junit.JUnitTestRunner.main(JUnitTestRunner.java:546)
Test: testIsAnnotationPresentClass: java.lang.reflect.Field5Testjava.lang.NullPointerException
	at java.lang.reflect.Proxy.newProxyInstance(Proxy.java:200)
	at org.apache.harmony.lang.annotation.AnnotationFactory.createAnnotation(AnnotationFactory.java:101)
	at org.apache.harmony.vm.VMGenericsAndAnnotations.getDeclaredAnnotations(VMGenericsAndAnnotations.java)
	at java.lang.reflect.Field$FieldData.getAnnotations(Field.java:458)
	at java.lang.reflect.Field.getAnnotation(Field.java:56)
	at java.lang.reflect.AccessibleObject.isAnnotationPresent(AccessibleObject.java)
	at org.apache.harmony.lang.AnnotatedElementTestFrame.testIsAnnotationPresent(AnnotatedElementTestFrame.java:310)
	at java.lang.reflect.VMReflection.invokeMethod(VMReflection.java)
	at java.lang.reflect.Method.invoke(Method.java:317)
	at junit.framework.TestCase.runTest(TestCase.java:164)
	at junit.framework.TestCase.runBare(TestCase.java)
	at junit.framework.TestResult$1.protect(TestResult.java)
	at junit.framework.TestResult.runProtected(TestResult.java)
	at junit.framework.TestResult.run(TestResult.java:109)
	at junit.framework.TestCase.run(TestCase.java:120)
	at junit.framework.TestSuite.runTest(TestSuite.java:230)
	at junit.framework.TestSuite.run(TestSuite.java:225)
	at org.apache.tools.ant.taskdefs.optional.junit.JUnitTestRunner.run(JUnitTestRunner.java:297)
	at org.apache.tools.ant.taskdefs.optional.junit.JUnitTestRunner.launch(JUnitTestRunner.java:672)
	at org.apache.tools.ant.taskdefs.optional.junit.JUnitTestRunner.main(JUnitTestRunner.java:546)
Test: testIsAnnotationPresent_NegativeClass: java.lang.reflect.Field5Testjava.lang.NullPointerException
	at java.lang.reflect.Proxy.newProxyInstance(Proxy.java:200)
	at org.apache.harmony.lang.annotation.AnnotationFactory.createAnnotation(AnnotationFactory.java:101)
	at org.apache.harmony.vm.VMGenericsAndAnnotations.getDeclaredAnnotations(VMGenericsAndAnnotations.java)
	at java.lang.reflect.Field$FieldData.getAnnotations(Field.java:458)
	at java.lang.reflect.Field.getAnnotation(Field.java:56)
	at java.lang.reflect.AccessibleObject.isAnnotationPresent(AccessibleObject.java)
	at org.apache.harmony.lang.AnnotatedElementTestFrame.testIsAnnotationPresent_Negative(AnnotatedElementTestFrame.java:320)
	at java.lang.reflect.VMReflection.invokeMethod(VMReflection.java)
	at java.lang.reflect.Method.invoke(Method.java:317)
	at junit.framework.TestCase.runTest(TestCase.java:164)
	at junit.framework.TestCase.runBare(TestCase.java)
	at junit.framework.TestResult$1.protect(TestResult.java)
	at junit.framework.TestResult.runProtected(TestResult.java)
	at junit.framework.TestResult.run(TestResult.java:109)
	at junit.framework.TestCase.run(TestCase.java:120)
	at junit.framework.TestSuite.runTest(TestSuite.java:230)
	at junit.framework.TestSuite.run(TestSuite.java:225)
	at org.apache.tools.ant.taskdefs.optional.junit.JUnitTestRunner.run(JUnitTestRunner.java:297)
	at org.apache.tools.ant.taskdefs.optional.junit.JUnitTestRunner.launch(JUnitTestRunner.java:672)
	at org.apache.tools.ant.taskdefs.optional.junit.JUnitTestRunner.main(JUnitTestRunner.java:546)
Test: testGetParameterAnnotations2Class: java.lang.reflect.Method5Testjava.lang.reflect.InvocationTargetException
	at java.lang.reflect.VMReflection.invokeMethod(VMReflection.java)
	at java.lang.reflect.Method.invoke(Method.java:317)
	at java.lang.reflect.Method5Test.getParamAnnotations(Method5Test.java:81)
	at java.lang.reflect.Method5Test.testGetParameterAnnotations2(Method5Test.java:113)
	at java.lang.reflect.VMReflection.invokeMethod(VMReflection.java)
	at java.lang.reflect.Method.invoke(Method.java:317)
	at junit.framework.TestCase.runTest(TestCase.java:164)
	at junit.framework.TestCase.runBare(TestCase.java)
	at junit.framework.TestResult$1.protect(TestResult.java)
	at junit.framework.TestResult.runProtected(TestResult.java)
	at junit.framework.TestResult.run(TestResult.java:109)
	at junit.framework.TestCase.run(TestCase.java:120)
	at junit.framework.TestSuite.runTest(TestSuite.java:230)
	at junit.framework.TestSuite.run(TestSuite.java:225)
	at org.apache.tools.ant.taskdefs.optional.junit.JUnitTestRunner.run(JUnitTestRunner.java:297)
	at org.apache.tools.ant.taskdefs.optional.junit.JUnitTestRunner.launch(JUnitTestRunner.java:672)
	at org.apache.tools.ant.taskdefs.optional.junit.JUnitTestRunner.main(JUnitTestRunner.java:546)
Caused by: java.lang.NullPointerException
	at java.lang.reflect.Proxy.newProxyInstance(Proxy.java:200)
	at org.apache.harmony.lang.annotation.AnnotationFactory.createAnnotation(AnnotationFactory.java:101)
	at org.apache.harmony.vm.VMGenericsAndAnnotations.getParameterAnnotations(VMGenericsAndAnnotations.java)
	at java.lang.reflect.Method$MethodData.getParameterAnnotations(Method.java:444)
	at java.lang.reflect.Method.getParameterAnnotations(Method.java:58)
	at java.lang.reflect.VMReflection.invokeMethod(VMReflection.java)
	... 16 more
Test: testGetParameterAnnotations3Class: java.lang.reflect.Method5Testjava.lang.reflect.InvocationTargetException
	at java.lang.reflect.VMReflection.invokeMethod(VMReflection.java)
	at java.lang.reflect.Method.invoke(Method.java:317)
	at java.lang.reflect.Method5Test.getParamAnnotations(Method5Test.java:81)
	at java.lang.reflect.Method5Test.testGetParameterAnnotations3(Method5Test.java:140)
	at java.lang.reflect.VMReflection.invokeMethod(VMReflection.java)
	at java.lang.reflect.Method.invoke(Method.java:317)
	at junit.framework.TestCase.runTest(TestCase.java:164)
	at junit.framework.TestCase.runBare(TestCase.java)
	at junit.framework.TestResult$1.protect(TestResult.java)
	at junit.framework.TestResult.runProtected(TestResult.java)
	at junit.framework.TestResult.run(TestResult.java:109)
	at junit.framework.TestCase.run(TestCase.java:120)
	at junit.framework.TestSuite.runTest(TestSuite.java:230)
	at junit.framework.TestSuite.run(TestSuite.java:225)
	at org.apache.tools.ant.taskdefs.optional.junit.JUnitTestRunner.run(JUnitTestRunner.java:297)
	at org.apache.tools.ant.taskdefs.optional.junit.JUnitTestRunner.launch(JUnitTestRunner.java:672)
	at org.apache.tools.ant.taskdefs.optional.junit.JUnitTestRunner.main(JUnitTestRunner.java:546)
Caused by: java.lang.NullPointerException
	at java.lang.reflect.Proxy.newProxyInstance(Proxy.java:200)
	at org.apache.harmony.lang.annotation.AnnotationFactory.createAnnotation(AnnotationFactory.java:101)
	at org.apache.harmony.vm.VMGenericsAndAnnotations.getParameterAnnotations(VMGenericsAndAnnotations.java)
	at java.lang.reflect.Method$MethodData.getParameterAnnotations(Method.java:444)
	at java.lang.reflect.Method.getParameterAnnotations(Method.java:58)
	at java.lang.reflect.VMReflection.invokeMethod(VMReflection.java)
	... 16 more
Test: testGetParameterAnnotationsImmutableClass: java.lang.reflect.Method5Testjava.lang.reflect.InvocationTargetException
	at java.lang.reflect.VMReflection.invokeMethod(VMReflection.java)
	at java.lang.reflect.Method.invoke(Method.java:317)
	at java.lang.reflect.Method5Test.getParamAnnotations(Method5Test.java:81)
	at java.lang.reflect.Method5Test.testGetParameterAnnotationsImmutable(Method5Test.java:157)
	at java.lang.reflect.VMReflection.invokeMethod(VMReflection.java)
	at java.lang.reflect.Method.invoke(Method.java:317)
	at junit.framework.TestCase.runTest(TestCase.java:164)
	at junit.framework.TestCase.runBare(TestCase.java)
	at junit.framework.TestResult$1.protect(TestResult.java)
	at junit.framework.TestResult.runProtected(TestResult.java)
	at junit.framework.TestResult.run(TestResult.java:109)
	at junit.framework.TestCase.run(TestCase.java:120)
	at junit.framework.TestSuite.runTest(TestSuite.java:230)
	at junit.framework.TestSuite.run(TestSuite.java:225)
	at org.apache.tools.ant.taskdefs.optional.junit.JUnitTestRunner.run(JUnitTestRunner.java:297)
	at org.apache.tools.ant.taskdefs.optional.junit.JUnitTestRunner.launch(JUnitTestRunner.java:672)
	at org.apache.tools.ant.taskdefs.optional.junit.JUnitTestRunner.main(JUnitTestRunner.java:546)
Caused by: java.lang.NullPointerException
	at java.lang.reflect.Proxy.newProxyInstance(Proxy.java:200)
	at org.apache.harmony.lang.annotation.AnnotationFactory.createAnnotation(AnnotationFactory.java:101)
	at org.apache.harmony.vm.VMGenericsAndAnnotations.getParameterAnnotations(VMGenericsAndAnnotations.java)
	at java.lang.reflect.Method$MethodData.getParameterAnnotations(Method.java:444)
	at java.lang.reflect.Method.getParameterAnnotations(Method.java:58)
	at java.lang.reflect.VMReflection.invokeMethod(VMReflection.java)
	... 16 more
Test: testGetAnnotationClass: java.lang.reflect.Method5Testjava.lang.NullPointerException
	at java.lang.reflect.Proxy.newProxyInstance(Proxy.java:200)
	at org.apache.harmony.lang.annotation.AnnotationFactory.createAnnotation(AnnotationFactory.java:101)
	at org.apache.harmony.vm.VMGenericsAndAnnotations.getDeclaredAnnotations(VMGenericsAndAnnotations.java)
	at java.lang.reflect.Method$MethodData.getDeclaredAnnotations(Method.java:426)
	at java.lang.reflect.Method.getAnnotation(Method.java:85)
	at org.apache.harmony.lang.AnnotatedElementTestFrame.testGetAnnotation(AnnotatedElementTestFrame.java)
	at java.lang.reflect.VMReflection.invokeMethod(VMReflection.java)
	at java.lang.reflect.Method.invoke(Method.java:317)
	at junit.framework.TestCase.runTest(TestCase.java:164)
	at junit.framework.TestCase.runBare(TestCase.java)
	at junit.framework.TestResult$1.protect(TestResult.java)
	at junit.framework.TestResult.runProtected(TestResult.java)
	at junit.framework.TestResult.run(TestResult.java:109)
	at junit.framework.TestCase.run(TestCase.java:120)
	at junit.framework.TestSuite.runTest(TestSuite.java:230)
	at junit.framework.TestSuite.run(TestSuite.java:225)
	at org.apache.tools.ant.taskdefs.optional.junit.JUnitTestRunner.run(JUnitTestRunner.java:297)
	at org.apache.tools.ant.taskdefs.optional.junit.JUnitTestRunner.launch(JUnitTestRunner.java:672)
	at org.apache.tools.ant.taskdefs.optional.junit.JUnitTestRunner.main(JUnitTestRunner.java:546)
Test: testGetAnnotation2Class: java.lang.reflect.Method5Testjava.lang.NullPointerException
	at java.lang.reflect.Proxy.newProxyInstance(Proxy.java:200)
	at org.apache.harmony.lang.annotation.AnnotationFactory.createAnnotation(AnnotationFactory.java:101)
	at org.apache.harmony.vm.VMGenericsAndAnnotations.getDeclaredAnnotations(VMGenericsAndAnnotations.java)
	at java.lang.reflect.Method$MethodData.getDeclaredAnnotations(Method.java:426)
	at java.lang.reflect.Method.getAnnotation(Method.java:85)
	at org.apache.harmony.lang.AnnotatedElementTestFrame.testGetAnnotation2(AnnotatedElementTestFrame.java)
	at java.lang.reflect.VMReflection.invokeMethod(VMReflection.java)
	at java.lang.reflect.Method.invoke(Method.java:317)
	at junit.framework.TestCase.runTest(TestCase.java:164)
	at junit.framework.TestCase.runBare(TestCase.java)
	at junit.framework.TestResult$1.protect(TestResult.java)
	at junit.framework.TestResult.runProtected(TestResult.java)
	at junit.framework.TestResult.run(TestResult.java:109)
	at junit.framework.TestCase.run(TestCase.java:120)
	at junit.framework.TestSuite.runTest(TestSuite.java:230)
	at junit.framework.TestSuite.run(TestSuite.java:225)
	at org.apache.tools.ant.taskdefs.optional.junit.JUnitTestRunner.run(JUnitTestRunner.java:297)
	at org.apache.tools.ant.taskdefs.optional.junit.JUnitTestRunner.launch(JUnitTestRunner.java:672)
	at org.apache.tools.ant.taskdefs.optional.junit.JUnitTestRunner.main(JUnitTestRunner.java:546)
Test: testGetAnnotation_NegativeClass: java.lang.reflect.Method5Testjava.lang.NullPointerException
	at java.lang.reflect.Proxy.newProxyInstance(Proxy.java:200)
	at org.apache.harmony.lang.annotation.AnnotationFactory.createAnnotation(AnnotationFactory.java:101)
	at org.apache.harmony.vm.VMGenericsAndAnnotations.getDeclaredAnnotations(VMGenericsAndAnnotations.java)
	at java.lang.reflect.Method$MethodData.getDeclaredAnnotations(Method.java:426)
	at java.lang.reflect.Method.getAnnotation(Method.java:85)
	at org.apache.harmony.lang.AnnotatedElementTestFrame.testGetAnnotation_Negative(AnnotatedElementTestFrame.java)
	at java.lang.reflect.VMReflection.invokeMethod(VMReflection.java)
	at java.lang.reflect.Method.invoke(Method.java:317)
	at junit.framework.TestCase.runTest(TestCase.java:164)
	at junit.framework.TestCase.runBare(TestCase.java)
	at junit.framework.TestResult$1.protect(TestResult.java)
	at junit.framework.TestResult.runProtected(TestResult.java)
	at junit.framework.TestResult.run(TestResult.java:109)
	at junit.framework.TestCase.run(TestCase.java:120)
	at junit.framework.TestSuite.runTest(TestSuite.java:230)
	at junit.framework.TestSuite.run(TestSuite.java:225)
	at org.apache.tools.ant.taskdefs.optional.junit.JUnitTestRunner.run(JUnitTestRunner.java:297)
	at org.apache.tools.ant.taskdefs.optional.junit.JUnitTestRunner.launch(JUnitTestRunner.java:672)
	at org.apache.tools.ant.taskdefs.optional.junit.JUnitTestRunner.main(JUnitTestRunner.java:546)
Test: testGetDeclaredAnnotationsClass: java.lang.reflect.Method5Testjava.lang.NullPointerException
	at java.lang.reflect.Proxy.newProxyInstance(Proxy.java:200)
	at org.apache.harmony.lang.annotation.AnnotationFactory.createAnnotation(AnnotationFactory.java:101)
	at org.apache.harmony.vm.VMGenericsAndAnnotations.getDeclaredAnnotations(VMGenericsAndAnnotations.java)
	at java.lang.reflect.Method$MethodData.getDeclaredAnnotations(Method.java:426)
	at java.lang.reflect.Method.getDeclaredAnnotations(Method.java:71)
	at org.apache.harmony.lang.AnnotatedElementTestFrame.testGetDeclaredAnnotations(AnnotatedElementTestFrame.java:162)
	at java.lang.reflect.VMReflection.invokeMethod(VMReflection.java)
	at java.lang.reflect.Method.invoke(Method.java:317)
	at junit.framework.TestCase.runTest(TestCase.java:164)
	at junit.framework.TestCase.runBare(TestCase.java)
	at junit.framework.TestResult$1.protect(TestResult.java)
	at junit.framework.TestResult.runProtected(TestResult.java)
	at junit.framework.TestResult.run(TestResult.java:109)
	at junit.framework.TestCase.run(TestCase.java:120)
	at junit.framework.TestSuite.runTest(TestSuite.java:230)
	at junit.framework.TestSuite.run(TestSuite.java:225)
	at org.apache.tools.ant.taskdefs.optional.junit.JUnitTestRunner.run(JUnitTestRunner.java:297)
	at org.apache.tools.ant.taskdefs.optional.junit.JUnitTestRunner.launch(JUnitTestRunner.java:672)
	at org.apache.tools.ant.taskdefs.optional.junit.JUnitTestRunner.main(JUnitTestRunner.java:546)
Test: testGetDeclaredAnnotations2Class: java.lang.reflect.Method5Testjava.lang.NullPointerException
	at java.lang.reflect.Proxy.newProxyInstance(Proxy.java:200)
	at org.apache.harmony.lang.annotation.AnnotationFactory.createAnnotation(AnnotationFactory.java:101)
	at org.apache.harmony.vm.VMGenericsAndAnnotations.getDeclaredAnnotations(VMGenericsAndAnnotations.java)
	at java.lang.reflect.Method$MethodData.getDeclaredAnnotations(Method.java:426)
	at java.lang.reflect.Method.getDeclaredAnnotations(Method.java:71)
	at org.apache.harmony.lang.AnnotatedElementTestFrame.testGetDeclaredAnnotations2(AnnotatedElementTestFrame.java:173)
	at java.lang.reflect.VMReflection.invokeMethod(VMReflection.java)
	at java.lang.reflect.Method.invoke(Method.java:317)
	at junit.framework.TestCase.runTest(TestCase.java:164)
	at junit.framework.TestCase.runBare(TestCase.java)
	at junit.framework.TestResult$1.protect(TestResult.java)
	at junit.framework.TestResult.runProtected(TestResult.java)
	at junit.framework.TestResult.run(TestResult.java:109)
	at junit.framework.TestCase.run(TestCase.java:120)
	at junit.framework.TestSuite.runTest(TestSuite.java:230)
	at junit.framework.TestSuite.run(TestSuite.java:225)
	at org.apache.tools.ant.taskdefs.optional.junit.JUnitTestRunner.run(JUnitTestRunner.java:297)
	at org.apache.tools.ant.taskdefs.optional.junit.JUnitTestRunner.launch(JUnitTestRunner.java:672)
	at org.apache.tools.ant.taskdefs.optional.junit.JUnitTestRunner.main(JUnitTestRunner.java:546)
Test: testGetDeclaredAnnotationsImmutableClass: java.lang.reflect.Method5Testjava.lang.NullPointerException
	at java.lang.reflect.Proxy.newProxyInstance(Proxy.java:200)
	at org.apache.harmony.lang.annotation.AnnotationFactory.createAnnotation(AnnotationFactory.java:101)
	at org.apache.harmony.vm.VMGenericsAndAnnotations.getDeclaredAnnotations(VMGenericsAndAnnotations.java)
	at java.lang.reflect.Method$MethodData.getDeclaredAnnotations(Method.java:426)
	at java.lang.reflect.Method.getDeclaredAnnotations(Method.java:71)
	at org.apache.harmony.lang.AnnotatedElementTestFrame.testGetDeclaredAnnotationsImmutable(AnnotatedElementTestFrame.java:198)
	at java.lang.reflect.VMReflection.invokeMethod(VMReflection.java)
	at java.lang.reflect.Method.invoke(Method.java:317)
	at junit.framework.TestCase.runTest(TestCase.java:164)
	at junit.framework.TestCase.runBare(TestCase.java)
	at junit.framework.TestResult$1.protect(TestResult.java)
	at junit.framework.TestResult.runProtected(TestResult.java)
	at junit.framework.TestResult.run(TestResult.java:109)
	at junit.framework.TestCase.run(TestCase.java:120)
	at junit.framework.TestSuite.runTest(TestSuite.java:230)
	at junit.framework.TestSuite.run(TestSuite.java:225)
	at org.apache.tools.ant.taskdefs.optional.junit.JUnitTestRunner.run(JUnitTestRunner.java:297)
	at org.apache.tools.ant.taskdefs.optional.junit.JUnitTestRunner.launch(JUnitTestRunner.java:672)
	at org.apache.tools.ant.taskdefs.optional.junit.JUnitTestRunner.main(JUnitTestRunner.java:546)
Test: testGetAnnotationsClass: java.lang.reflect.Method5Testjava.lang.NullPointerException
	at java.lang.reflect.Proxy.newProxyInstance(Proxy.java:200)
	at org.apache.harmony.lang.annotation.AnnotationFactory.createAnnotation(AnnotationFactory.java:101)
	at org.apache.harmony.vm.VMGenericsAndAnnotations.getDeclaredAnnotations(VMGenericsAndAnnotations.java)
	at java.lang.reflect.Method$MethodData.getDeclaredAnnotations(Method.java:426)
	at java.lang.reflect.Method.getDeclaredAnnotations(Method.java:71)
	at java.lang.reflect.AccessibleObject.getAnnotations(AccessibleObject.java)
	at org.apache.harmony.lang.AnnotatedElementTestFrame.testGetAnnotations(AnnotatedElementTestFrame.java:215)
	at java.lang.reflect.VMReflection.invokeMethod(VMReflection.java)
	at java.lang.reflect.Method.invoke(Method.java:317)
	at junit.framework.TestCase.runTest(TestCase.java:164)
	at junit.framework.TestCase.runBare(TestCase.java)
	at junit.framework.TestResult$1.protect(TestResult.java)
	at junit.framework.TestResult.runProtected(TestResult.java)
	at junit.framework.TestResult.run(TestResult.java:109)
	at junit.framework.TestCase.run(TestCase.java:120)
	at junit.framework.TestSuite.runTest(TestSuite.java:230)
	at junit.framework.TestSuite.run(TestSuite.java:225)
	at org.apache.tools.ant.taskdefs.optional.junit.JUnitTestRunner.run(JUnitTestRunner.java:297)
	at org.apache.tools.ant.taskdefs.optional.junit.JUnitTestRunner.launch(JUnitTestRunner.java:672)
	at org.apache.tools.ant.taskdefs.optional.junit.JUnitTestRunner.main(JUnitTestRunner.java:546)
Test: testGetAnnotations2Class: java.lang.reflect.Method5Testjava.lang.NullPointerException
	at java.lang.reflect.Proxy.newProxyInstance(Proxy.java:200)
	at org.apache.harmony.lang.annotation.AnnotationFactory.createAnnotation(AnnotationFactory.java:101)
	at org.apache.harmony.vm.VMGenericsAndAnnotations.getDeclaredAnnotations(VMGenericsAndAnnotations.java)
	at java.lang.reflect.Method$MethodData.getDeclaredAnnotations(Method.java:426)
	at java.lang.reflect.Method.getDeclaredAnnotations(Method.java:71)
	at java.lang.reflect.AccessibleObject.getAnnotations(AccessibleObject.java)
	at org.apache.harmony.lang.AnnotatedElementTestFrame.testGetAnnotations2(AnnotatedElementTestFrame.java:226)
	at java.lang.reflect.VMReflection.invokeMethod(VMReflection.java)
	at java.lang.reflect.Method.invoke(Method.java:317)
	at junit.framework.TestCase.runTest(TestCase.java:164)
	at junit.framework.TestCase.runBare(TestCase.java)
	at junit.framework.TestResult$1.protect(TestResult.java)
	at junit.framework.TestResult.runProtected(TestResult.java)
	at junit.framework.TestResult.run(TestResult.java:109)
	at junit.framework.TestCase.run(TestCase.java:120)
	at junit.framework.TestSuite.runTest(TestSuite.java:230)
	at junit.framework.TestSuite.run(TestSuite.java:225)
	at org.apache.tools.ant.taskdefs.optional.junit.JUnitTestRunner.run(JUnitTestRunner.java:297)
	at org.apache.tools.ant.taskdefs.optional.junit.JUnitTestRunner.launch(JUnitTestRunner.java:672)
	at org.apache.tools.ant.taskdefs.optional.junit.JUnitTestRunner.main(JUnitTestRunner.java:546)
Test: testGetAnnotations5Class: java.lang.reflect.Method5Testjava.lang.NullPointerException
	at java.lang.reflect.Proxy.newProxyInstance(Proxy.java:200)
	at org.apache.harmony.lang.annotation.AnnotationFactory.createAnnotation(AnnotationFactory.java:101)
	at org.apache.harmony.vm.VMGenericsAndAnnotations.getDeclaredAnnotations(VMGenericsAndAnnotations.java)
	at java.lang.reflect.Method$MethodData.getDeclaredAnnotations(Method.java:426)
	at java.lang.reflect.Method.getDeclaredAnnotations(Method.java:71)
	at java.lang.reflect.AccessibleObject.getAnnotations(AccessibleObject.java)
	at org.apache.harmony.lang.AnnotatedElementTestFrame.testGetAnnotations5(AnnotatedElementTestFrame.java:264)
	at java.lang.reflect.VMReflection.invokeMethod(VMReflection.java)
	at java.lang.reflect.Method.invoke(Method.java:317)
	at junit.framework.TestCase.runTest(TestCase.java:164)
	at junit.framework.TestCase.runBare(TestCase.java)
	at junit.framework.TestResult$1.protect(TestResult.java)
	at junit.framework.TestResult.runProtected(TestResult.java)
	at junit.framework.TestResult.run(TestResult.java:109)
	at junit.framework.TestCase.run(TestCase.java:120)
	at junit.framework.TestSuite.runTest(TestSuite.java:230)
	at junit.framework.TestSuite.run(TestSuite.java:225)
	at org.apache.tools.ant.taskdefs.optional.junit.JUnitTestRunner.run(JUnitTestRunner.java:297)
	at org.apache.tools.ant.taskdefs.optional.junit.JUnitTestRunner.launch(JUnitTestRunner.java:672)
	at org.apache.tools.ant.taskdefs.optional.junit.JUnitTestRunner.main(JUnitTestRunner.java:546)
Test: testGetAnnotationsImmutableClass: java.lang.reflect.Method5Testjava.lang.NullPointerException
	at java.lang.reflect.Proxy.newProxyInstance(Proxy.java:200)
	at org.apache.harmony.lang.annotation.AnnotationFactory.createAnnotation(AnnotationFactory.java:101)
	at org.apache.harmony.vm.VMGenericsAndAnnotations.getDeclaredAnnotations(VMGenericsAndAnnotations.java)
	at java.lang.reflect.Method$MethodData.getDeclaredAnnotations(Method.java:426)
	at java.lang.reflect.Method.getDeclaredAnnotations(Method.java:71)
	at java.lang.reflect.AccessibleObject.getAnnotations(AccessibleObject.java)
	at org.apache.harmony.lang.AnnotatedElementTestFrame.testGetAnnotationsImmutable(AnnotatedElementTestFrame.java:293)
	at java.lang.reflect.VMReflection.invokeMethod(VMReflection.java)
	at java.lang.reflect.Method.invoke(Method.java:317)
	at junit.framework.TestCase.runTest(TestCase.java:164)
	at junit.framework.TestCase.runBare(TestCase.java)
	at junit.framework.TestResult$1.protect(TestResult.java)
	at junit.framework.TestResult.runProtected(TestResult.java)
	at junit.framework.TestResult.run(TestResult.java:109)
	at junit.framework.TestCase.run(TestCase.java:120)
	at junit.framework.TestSuite.runTest(TestSuite.java:230)
	at junit.framework.TestSuite.run(TestSuite.java:225)
	at org.apache.tools.ant.taskdefs.optional.junit.JUnitTestRunner.run(JUnitTestRunner.java:297)
	at org.apache.tools.ant.taskdefs.optional.junit.JUnitTestRunner.launch(JUnitTestRunner.java:672)
	at org.apache.tools.ant.taskdefs.optional.junit.JUnitTestRunner.main(JUnitTestRunner.java:546)
Test: testIsAnnotationPresentClass: java.lang.reflect.Method5Testjava.lang.NullPointerException
	at java.lang.reflect.Proxy.newProxyInstance(Proxy.java:200)
	at org.apache.harmony.lang.annotation.AnnotationFactory.createAnnotation(AnnotationFactory.java:101)
	at org.apache.harmony.vm.VMGenericsAndAnnotations.getDeclaredAnnotations(VMGenericsAndAnnotations.java)
	at java.lang.reflect.Method$MethodData.getDeclaredAnnotations(Method.java:426)
	at java.lang.reflect.Method.getAnnotation(Method.java:85)
	at java.lang.reflect.AccessibleObject.isAnnotationPresent(AccessibleObject.java)
	at org.apache.harmony.lang.AnnotatedElementTestFrame.testIsAnnotationPresent(AnnotatedElementTestFrame.java:310)
	at java.lang.reflect.VMReflection.invokeMethod(VMReflection.java)
	at java.lang.reflect.Method.invoke(Method.java:317)
	at junit.framework.TestCase.runTest(TestCase.java:164)
	at junit.framework.TestCase.runBare(TestCase.java)
	at junit.framework.TestResult$1.protect(TestResult.java)
	at junit.framework.TestResult.runProtected(TestResult.java)
	at junit.framework.TestResult.run(TestResult.java:109)
	at junit.framework.TestCase.run(TestCase.java:120)
	at junit.framework.TestSuite.runTest(TestSuite.java:230)
	at junit.framework.TestSuite.run(TestSuite.java:225)
	at org.apache.tools.ant.taskdefs.optional.junit.JUnitTestRunner.run(JUnitTestRunner.java:297)
	at org.apache.tools.ant.taskdefs.optional.junit.JUnitTestRunner.launch(JUnitTestRunner.java:672)
	at org.apache.tools.ant.taskdefs.optional.junit.JUnitTestRunner.main(JUnitTestRunner.java:546)
Test: testIsAnnotationPresent_NegativeClass: java.lang.reflect.Method5Testjava.lang.NullPointerException
	at java.lang.reflect.Proxy.newProxyInstance(Proxy.java:200)
	at org.apache.harmony.lang.annotation.AnnotationFactory.createAnnotation(AnnotationFactory.java:101)
	at org.apache.harmony.vm.VMGenericsAndAnnotations.getDeclaredAnnotations(VMGenericsAndAnnotations.java)
	at java.lang.reflect.Method$MethodData.getDeclaredAnnotations(Method.java:426)
	at java.lang.reflect.Method.getAnnotation(Method.java:85)
	at java.lang.reflect.AccessibleObject.isAnnotationPresent(AccessibleObject.java)
	at org.apache.harmony.lang.AnnotatedElementTestFrame.testIsAnnotationPresent_Negative(AnnotatedElementTestFrame.java:320)
	at java.lang.reflect.VMReflection.invokeMethod(VMReflection.java)
	at java.lang.reflect.Method.invoke(Method.java:317)
	at junit.framework.TestCase.runTest(TestCase.java:164)
	at junit.framework.TestCase.runBare(TestCase.java)
	at junit.framework.TestResult$1.protect(TestResult.java)
	at junit.framework.TestResult.runProtected(TestResult.java)
	at junit.framework.TestResult.run(TestResult.java:109)
	at junit.framework.TestCase.run(TestCase.java:120)
	at junit.framework.TestSuite.runTest(TestSuite.java:230)
	at junit.framework.TestSuite.run(TestSuite.java:225)
	at org.apache.tools.ant.taskdefs.optional.junit.JUnitTestRunner.run(JUnitTestRunner.java:297)
	at org.apache.tools.ant.taskdefs.optional.junit.JUnitTestRunner.launch(JUnitTestRunner.java:672)
	at org.apache.tools.ant.taskdefs.optional.junit.JUnitTestRunner.main(JUnitTestRunner.java:546)
Test: testGetAnnotation_ByDefaultClass: org.apache.harmony.lang.annotation.AllTypesTestjava.lang.NullPointerException
	at java.lang.reflect.Proxy.newProxyInstance(Proxy.java:200)
	at org.apache.harmony.lang.annotation.AnnotationFactory.createAnnotation(AnnotationFactory.java:101)
	at org.apache.harmony.vm.VMGenericsAndAnnotations.getDeclaredAnnotations(VMGenericsAndAnnotations.java)
	at java.lang.Class$GACache.getAllAnnotations(Class.java:1338)
	at java.lang.Class.getAnnotation(Class.java:890)
	at org.apache.harmony.lang.annotation.AllTypesTest.testGetAnnotation_ByDefault(AllTypesTest.java:51)
	at java.lang.reflect.VMReflection.invokeMethod(VMReflection.java)
	at java.lang.reflect.Method.invoke(Method.java:317)
	at junit.framework.TestCase.runTest(TestCase.java:164)
	at junit.framework.TestCase.runBare(TestCase.java)
	at junit.framework.TestResult$1.protect(TestResult.java)
	at junit.framework.TestResult.runProtected(TestResult.java)
	at junit.framework.TestResult.run(TestResult.java:109)
	at junit.framework.TestCase.run(TestCase.java:120)
	at junit.framework.TestSuite.runTest(TestSuite.java:230)
	at junit.framework.TestSuite.run(TestSuite.java:225)
	at org.apache.tools.ant.taskdefs.optional.junit.JUnitTestRunner.run(JUnitTestRunner.java:297)
	at org.apache.tools.ant.taskdefs.optional.junit.JUnitTestRunner.launch(JUnitTestRunner.java:672)
	at org.apache.tools.ant.taskdefs.optional.junit.JUnitTestRunner.main(JUnitTestRunner.java:546)
Test: testGetAnnotation_NoDefaultClass: org.apache.harmony.lang.annotation.AllTypesTestjava.lang.NullPointerException
	at java.lang.reflect.Proxy.newProxyInstance(Proxy.java:200)
	at org.apache.harmony.lang.annotation.AnnotationFactory.createAnnotation(AnnotationFactory.java:101)
	at org.apache.harmony.vm.VMGenericsAndAnnotations.getDeclaredAnnotations(VMGenericsAndAnnotations.java)
	at java.lang.Class$GACache.getAllAnnotations(Class.java:1338)
	at java.lang.Class.getAnnotation(Class.java:890)
	at org.apache.harmony.lang.annotation.AllTypesTest.testGetAnnotation_NoDefault(AllTypesTest.java:87)
	at java.lang.reflect.VMReflection.invokeMethod(VMReflection.java)
	at java.lang.reflect.Method.invoke(Method.java:317)
	at junit.framework.TestCase.runTest(TestCase.java:164)
	at junit.framework.TestCase.runBare(TestCase.java)
	at junit.framework.TestResult$1.protect(TestResult.java)
	at junit.framework.TestResult.runProtected(TestResult.java)
	at junit.framework.TestResult.run(TestResult.java:109)
	at junit.framework.TestCase.run(TestCase.java:120)
	at junit.framework.TestSuite.runTest(TestSuite.java:230)
	at junit.framework.TestSuite.run(TestSuite.java:225)
	at org.apache.tools.ant.taskdefs.optional.junit.JUnitTestRunner.run(JUnitTestRunner.java:297)
	at org.apache.tools.ant.taskdefs.optional.junit.JUnitTestRunner.launch(JUnitTestRunner.java:672)
	at org.apache.tools.ant.taskdefs.optional.junit.JUnitTestRunner.main(JUnitTestRunner.java:546)
Test: testEqualsClass: org.apache.harmony.lang.annotation.AllTypesTestjava.lang.NullPointerException
	at java.lang.reflect.Proxy.newProxyInstance(Proxy.java:200)
	at org.apache.harmony.lang.annotation.AnnotationFactory.createAnnotation(AnnotationFactory.java:101)
	at org.apache.harmony.vm.VMGenericsAndAnnotations.getDeclaredAnnotations(VMGenericsAndAnnotations.java)
	at java.lang.Class$GACache.getAllAnnotations(Class.java:1338)
	at java.lang.Class.getAnnotation(Class.java:890)
	at org.apache.harmony.lang.annotation.AllTypesTest.testEquals(AllTypesTest.java:114)
	at java.lang.reflect.VMReflection.invokeMethod(VMReflection.java)
	at java.lang.reflect.Method.invoke(Method.java:317)
	at junit.framework.TestCase.runTest(TestCase.java:164)
	at junit.framework.TestCase.runBare(TestCase.java)
	at junit.framework.TestResult$1.protect(TestResult.java)
	at junit.framework.TestResult.runProtected(TestResult.java)
	at junit.framework.TestResult.run(TestResult.java:109)
	at junit.framework.TestCase.run(TestCase.java:120)
	at junit.framework.TestSuite.runTest(TestSuite.java:230)
	at junit.framework.TestSuite.run(TestSuite.java:225)
	at org.apache.tools.ant.taskdefs.optional.junit.JUnitTestRunner.run(JUnitTestRunner.java:297)
	at org.apache.tools.ant.taskdefs.optional.junit.JUnitTestRunner.launch(JUnitTestRunner.java:672)
	at org.apache.tools.ant.taskdefs.optional.junit.JUnitTestRunner.main(JUnitTestRunner.java:546)
Test: testEquals_ForeignImplClass: org.apache.harmony.lang.annotation.AllTypesTestjava.lang.NullPointerException
	at java.lang.reflect.Proxy.newProxyInstance(Proxy.java:200)
	at org.apache.harmony.lang.annotation.AnnotationFactory.createAnnotation(AnnotationFactory.java:101)
	at org.apache.harmony.vm.VMGenericsAndAnnotations.getDeclaredAnnotations(VMGenericsAndAnnotations.java)
	at java.lang.Class$GACache.getAllAnnotations(Class.java:1338)
	at java.lang.Class.getAnnotation(Class.java:890)
	at org.apache.harmony.lang.annotation.AllTypesTest.testEquals_ForeignImpl(AllTypesTest.java:131)
	at java.lang.reflect.VMReflection.invokeMethod(VMReflection.java)
	at java.lang.reflect.Method.invoke(Method.java:317)
	at junit.framework.TestCase.runTest(TestCase.java:164)
	at junit.framework.TestCase.runBare(TestCase.java)
	at junit.framework.TestResult$1.protect(TestResult.java)
	at junit.framework.TestResult.runProtected(TestResult.java)
	at junit.framework.TestResult.run(TestResult.java:109)
	at junit.framework.TestCase.run(TestCase.java:120)
	at junit.framework.TestSuite.runTest(TestSuite.java:230)
	at junit.framework.TestSuite.run(TestSuite.java:225)
	at org.apache.tools.ant.taskdefs.optional.junit.JUnitTestRunner.run(JUnitTestRunner.java:297)
	at org.apache.tools.ant.taskdefs.optional.junit.JUnitTestRunner.launch(JUnitTestRunner.java:672)
	at org.apache.tools.ant.taskdefs.optional.junit.JUnitTestRunner.main(JUnitTestRunner.java:546)
Test: testToStringClass: org.apache.harmony.lang.annotation.AllTypesTestjava.lang.NullPointerException
	at java.lang.reflect.Proxy.newProxyInstance(Proxy.java:200)
	at org.apache.harmony.lang.annotation.AnnotationFactory.createAnnotation(AnnotationFactory.java:101)
	at org.apache.harmony.vm.VMGenericsAndAnnotations.getDeclaredAnnotations(VMGenericsAndAnnotations.java)
	at java.lang.Class$GACache.getAllAnnotations(Class.java:1338)
	at java.lang.Class.getAnnotation(Class.java:890)
	at org.apache.harmony.lang.annotation.AllTypesTest.testToString(AllTypesTest.java:140)
	at java.lang.reflect.VMReflection.invokeMethod(VMReflection.java)
	at java.lang.reflect.Method.invoke(Method.java:317)
	at junit.framework.TestCase.runTest(TestCase.java:164)
	at junit.framework.TestCase.runBare(TestCase.java)
	at junit.framework.TestResult$1.protect(TestResult.java)
	at junit.framework.TestResult.runProtected(TestResult.java)
	at junit.framework.TestResult.run(TestResult.java:109)
	at junit.framework.TestCase.run(TestCase.java:120)
	at junit.framework.TestSuite.runTest(TestSuite.java:230)
	at junit.framework.TestSuite.run(TestSuite.java:225)
	at org.apache.tools.ant.taskdefs.optional.junit.JUnitTestRunner.run(JUnitTestRunner.java:297)
	at org.apache.tools.ant.taskdefs.optional.junit.JUnitTestRunner.launch(JUnitTestRunner.java:672)
	at org.apache.tools.ant.taskdefs.optional.junit.JUnitTestRunner.main(JUnitTestRunner.java:546)
Test: testAnnotationTypeClass: org.apache.harmony.lang.annotation.AllTypesTestjava.lang.NullPointerException
	at java.lang.reflect.Proxy.newProxyInstance(Proxy.java:200)
	at org.apache.harmony.lang.annotation.AnnotationFactory.createAnnotation(AnnotationFactory.java:101)
	at org.apache.harmony.vm.VMGenericsAndAnnotations.getDeclaredAnnotations(VMGenericsAndAnnotations.java)
	at java.lang.Class$GACache.getAllAnnotations(Class.java:1338)
	at java.lang.Class.getAnnotation(Class.java:890)
	at org.apache.harmony.lang.annotation.AllTypesTest.testAnnotationType(AllTypesTest.java:152)
	at java.lang.reflect.VMReflection.invokeMethod(VMReflection.java)
	at java.lang.reflect.Method.invoke(Method.java:317)
	at junit.framework.TestCase.runTest(TestCase.java:164)
	at junit.framework.TestCase.runBare(TestCase.java)
	at junit.framework.TestResult$1.protect(TestResult.java)
	at junit.framework.TestResult.runProtected(TestResult.java)
	at junit.framework.TestResult.run(TestResult.java:109)
	at junit.framework.TestCase.run(TestCase.java:120)
	at junit.framework.TestSuite.runTest(TestSuite.java:230)
	at junit.framework.TestSuite.run(TestSuite.java:225)
	at org.apache.tools.ant.taskdefs.optional.junit.JUnitTestRunner.run(JUnitTestRunner.java:297)
	at org.apache.tools.ant.taskdefs.optional.junit.JUnitTestRunner.launch(JUnitTestRunner.java:672)
	at org.apache.tools.ant.taskdefs.optional.junit.JUnitTestRunner.main(JUnitTestRunner.java:546)
Test: testAnnotation_ElementErrorClass: org.apache.harmony.lang.annotation.AllTypesTestjava.lang.NullPointerException
	at java.lang.reflect.Proxy.newProxyInstance(Proxy.java:200)
	at org.apache.harmony.lang.annotation.AnnotationFactory.createAnnotation(AnnotationFactory.java:101)
	at org.apache.harmony.vm.VMGenericsAndAnnotations.getDeclaredAnnotations(VMGenericsAndAnnotations.java)
	at java.lang.reflect.Method$MethodData.getDeclaredAnnotations(Method.java:426)
	at java.lang.reflect.Method.getAnnotation(Method.java:85)
	at org.apache.harmony.lang.annotation.AllTypesTest.testAnnotation_ElementError(AllTypesTest.java:162)
	at java.lang.reflect.VMReflection.invokeMethod(VMReflection.java)
	at java.lang.reflect.Method.invoke(Method.java:317)
	at junit.framework.TestCase.runTest(TestCase.java:164)
	at junit.framework.TestCase.runBare(TestCase.java)
	at junit.framework.TestResult$1.protect(TestResult.java)
	at junit.framework.TestResult.runProtected(TestResult.java)
	at junit.framework.TestResult.run(TestResult.java:109)
	at junit.framework.TestCase.run(TestCase.java:120)
	at junit.framework.TestSuite.runTest(TestSuite.java:230)
	at junit.framework.TestSuite.run(TestSuite.java:225)
	at org.apache.tools.ant.taskdefs.optional.junit.JUnitTestRunner.run(JUnitTestRunner.java:297)
	at org.apache.tools.ant.taskdefs.optional.junit.JUnitTestRunner.launch(JUnitTestRunner.java:672)
	at org.apache.tools.ant.taskdefs.optional.junit.JUnitTestRunner.main(JUnitTestRunner.java:546)
Test: testSerializationClass: org.apache.harmony.lang.annotation.AllTypesTestjava.lang.NullPointerException
	at java.lang.reflect.Proxy.newProxyInstance(Proxy.java:200)
	at org.apache.harmony.lang.annotation.AnnotationFactory.createAnnotation(AnnotationFactory.java:101)
	at org.apache.harmony.vm.VMGenericsAndAnnotations.getDeclaredAnnotations(VMGenericsAndAnnotations.java)
	at java.lang.Class$GACache.getAllAnnotations(Class.java:1338)
	at java.lang.Class.getAnnotation(Class.java:890)
	at org.apache.harmony.lang.annotation.AllTypesTest.testSerialization(AllTypesTest.java:189)
	at java.lang.reflect.VMReflection.invokeMethod(VMReflection.java)
	at java.lang.reflect.Method.invoke(Method.java:317)
	at junit.framework.TestCase.runTest(TestCase.java:164)
	at junit.framework.TestCase.runBare(TestCase.java)
	at junit.framework.TestResult$1.protect(TestResult.java)
	at junit.framework.TestResult.runProtected(TestResult.java)
	at junit.framework.TestResult.run(TestResult.java:109)
	at junit.framework.TestCase.run(TestCase.java:120)
	at junit.framework.TestSuite.runTest(TestSuite.java:230)
	at junit.framework.TestSuite.run(TestSuite.java:225)
	at org.apache.tools.ant.taskdefs.optional.junit.JUnitTestRunner.run(JUnitTestRunner.java:297)
	at org.apache.tools.ant.taskdefs.optional.junit.JUnitTestRunner.launch(JUnitTestRunner.java:672)
	at org.apache.tools.ant.taskdefs.optional.junit.JUnitTestRunner.main(JUnitTestRunner.java:546)
Test: Server mode JITClass: stress.Finalizer_srvExit code: 0 Err: SIGABRT in VM code.
Stack trace:

***********************************************************
Modifications since last successful build:	(2)
            
add cc-hdk log20071025154737Lbuild.286 10/25/2007 15:47:37hdk
add cc-hdk log20071025154737Lbuild.286 10/25/2007 15:47:37hdk

begin 644 execution_log.zip
M4$L#! H    ( ".663?*\;T'GAT  !*_ 0 2    97AE8W5T:6]N7VQO9RYH
M=&UL[5UY<^.VDO][YU-P*[OUG*F8$BGJ\DM2Y9GQ))ZU8^_(F5=;J2D734(6
M;8K0X^&Q\^FW05*R#A[=DF#)"5Q3'M)"'V@T&@W@!^C'43SV?_[QAKM//_\X
M"=G//]I:%#_Y[*=_#'D0'T;>G^Q(ZS7_^Y__^/E-,G'MF!U&#\'1FS>'V1L\
MA0F\:YKVA\M\%K.OV@?QOQ?<:IU^3QMZ/HNT8<C'6H,]3G@8-Y*(A5'#<>#?
MH</'8QXT;A+/=QLABQ(_CAINZ#^,#V,6Q8(O<+ZS'^ROVCM12/ [TL;V/<N(
M],>QOU!JX05T/71!*2<^JBXT"?FDH@A[C%D87+MLJ5#VS)P1A^??(U'I]V?'
M@\'9Z3OMI_H*.R/FW/,$JCQR[QO?>'@/'*X=WXXBW[LI5R>KDLXCW0Z=D>X\
M/NK.\+9"?R_P8CT)O,>Z,M^\H*X(U  \)8J8JX^YRZH,RV(]8F,OTETOC&H*
M9B:V_:IR$S^Y]0+=#F('O#/T;NK+.I-);$?W55Q%K<J;]3T/AMYM$MJQQX.*
MUA<_O_(H=?Q/\#&TOZ&W]>9ULZ\=#)) ._><D$=/4<S&D78:./KWE<RF7J"%
MG,=;=J85Q9]_> 2RSKP@><11" <$"C;N6#%2!K@K4-PZ#K;\\!;*N^PFN:VF
M@(ZLA>S!BZ"E@*+=ZQF==IT0X<X\8$$<I4(F/G^JU6OTI =<CSRAUQ!<EE52
M0&F?.[:O_RF:LXABX>7N81Q[NHA^%3XKM(9(>)@63D-E="@^6770/\;WT/O 
MCT,&\=K5X.5H76=Z&.<?^\'C==KDU]",UVG3-%(E&L_: U_A>RQ:5.D/,(=X
M=$37$I40'<;2(IZ$#LN'BYCO4,-:.P<0"A[87EDZ4ZG4"[_[;L[6G[Z<7YUJ
M&46D'6GO0-W["?>"V-B_*C6JM!-O#OB1"0X3V_ZS\]RP:<.Y>BG5(+;#-%J#
M5>[KNB,;WXCQS@Z\X4K'1%OZDD\^AO:8[:.=RW5[;58>P!]]-HC99!_M7*7=
M:[/TE_-32)WVT<IEFDUM9>S6PHN):C@_O.S5L!(R(:1B>$3E*C!!G!\_][&&
M#1A?2OM ;3KX4^U/+8O/,$'(NE>JEY:D<TG0BH7@'_#[)90H+0#:!4*?RE3A
M#N:7,<S^3][]_LN1]@N+X^>8P8('+^1CR+)U75^5LT3K0C[^GW6%!KD QY[8
M-Q"?8H]%6V?.'L3$8&MLSUD\XNX)3%V?0&_?O[&=>\V+TF?P^R$/YTVLSS\+
MMSA8G3$N"?C@1?9-&JOG1:6UP%8"V[ @A6E! E$NU&(0RD# -OA/37\SJSS*
M_JMD&DP"4R7;36FJ/<MHRZT^AO0# S>"B69I\VRE_=_-5=YQDHD'CNL%VC )
M'+%"LJ$#R_:N]V+06+4OI=(SKZJ5Y3,[%++BD9C8AE$\)W5+]5%M_J)MOKJ:
M5!J Y\BW&G^G 2)*'(=%$8S[6APF6VMJ20ZUG$E43(6WET>LFR+01_\K<'3H
M$_$(&MT5(WHDI@K,K<T(TI17R#J^!5E7*3W"-Z=6$05TWPYN]8Q4VX0V75-/
MG)B'!"X!-"+45L0Y!-6LNK:H;FXO"MVMSV]@WA:R(0M9(!8,(6<280;/:ZKY
MS 7UV=-_&10#%C+0XY$7NM?@#I.#[[5QFH41>*X3 Q=3!MS8(N8;Q#9(BV_F
M>C4L]">/^2[%;#G#682?\P0(D-&$!:[HBC'&C.DLMG:H*VCTA2;'29FE!J2$
M(*.=-O?S2M)L@$$RR RS9"^\M:_FC"Q"7<8.$>QR^D/QHQDS4Z;3G^RO2 Z@
M:S[\865^9E$"DN;JNU/7FI_\H6:.V^(PYS1%[GVD10R&@:DS?_DAVX8\TLYF
MWMZ8"W;_?$T.9RJ'V\1=9#E<F 1_,4=K;>!H,\H,"R.T2#/?ZY//GR\^7_]V
M<7U^\?GD^N/GX_.3 =X7Q_QAS2%C.MJD]LS[ -Z@:_>"YT;857BLY[ \IZG<
M>%*KH]M8'9TSL3[_O#>KHR>!Y.G_ZUM^M5KREU^MKEI^S>8GF_60U[,49[70
M7;%@U-OGI;)ECRP>DK*@N#?M.:=E9A(>8)*+52I1-WP;JR:0W006?E!]W?U,
M!=;I4*KV.+:SQU$$0EIX<01/!-)WS(/KAW%5&<'H, <P[1Q?\URMJ,%O[O9)
MG1LO*&VV9YQ;!L&Q YASB+FXD%74E\1;"M=KT=!DN;PS+[C/IYWB][4H<6W'
M<1B52FIN&;96J\Z-'7D%,/U=J>.Y$&2\80% ?V<:"816F$P*T&.[4@FZC!?S
M??*BB1T64.Q,FSB\=GCPL#\:Y>N,>Z%0!J#=HXZ?*S2TXZEG[Y-:>]AT\<@+
M]LI4L0=A,H($;KPOZJ3'L:XC,)!]6Y#'[4:IO,G 5D.^+SI-(+^'8)D4H:-W
MHU%H?]NO$0YT2G?E]D69V!L#V8MI4S /F1X(WY>DO^@4P[P1I_.UM'1AHK]8
M$)&O3X'UE\>#P<D'#4]1(*)D**X044U1(*(\KZZ04DM4)*@\7:Z25$M5(*H\
M2%1(JB4J$%2<W58(J20H$E":L%8)J2,J$%2:S%3(J:-9%%.=71:+0=$4BJG,
M&2N%82@+11)-B*0J%%6=YU7*0Y$N"JU*XHIE(2A61-0D9J6"<'0KXJI3KE)I
M*+(5856Y5*DH!-&*H.H4J504BFQ%6$GN4RJENOP*^[)LII1_ 4%1BI*F!(M9
M2K;$FWWR5;L*[2 :\G"L 4=VI!EFLSTNM\NES^Q(G/((W+GEP_Q"&\V.7R;5
MV7"I.1KS>U:['@TUK;HC)D\F]6=F^IY<F/"LT?2<\&I[[EZE1C1*8I=_PRQ4
M[T:QAH#)?; 9B+D(_F5[Y7-#J<>L,Q6Q!]GWPF@?;;#&21A6+,PHDRV:[+1V
M@7W'%JL)?GL5]? 7\O2:+W@C3YV*"R_IK",=[5.RO;)OW4I#>1Z3_VSA$+_H
M-%#K3U_.Y=0ZNR*K<0?E[T(F=E0;0IF7J!K:*:Z_>?'H^LZ+K],L?7:)0GFL
M>PGU!T*U/#OD@?;>]\3Y*W&'GO;I]$H[<-G0AG2Q^EHX&:9$&R*[X9 ].G[B
M9I%A_8OI9DZ6WN68\XRF#WIZ!V36FKHOKJ/3'WN=ZXZE0ZMJ-=?PU=4Q Y<W
M!F/;]V$<<.ZSXV>BY^B5O@R5X,,Q)#[A4^-M==$4D%-=Y)*%0T2QT@^^TWX]
M_GQ^\=O_';9:K5YIL5NG<78QJ)8!9<[!];S,$%%UX0GHO5!\X(TG,.BM6XNA
M[?EIC_C]!N:Y24?+6KI263O<W&IFMVOFPM,8,?;B&'JD_U1.',7BYLO&N?>X
M>9LUC>;LQ3+[9IW0U%,W%VOUV]K(#FZ7*UUE[M\N3S87W#=6D65S,BY!J9B/
M/T]/]M;W1B#Z%[/O"108-3NM?EW@.+>#I]SUMR/3[/<76J/6%9X"9TVI13^H
MG1'M2/O50RS$5!1:8I>%7A9AUL/JRRXQS^X]Y;;+0OV]>!;$O[#X X-/Q-';
M](\(R1LRJE#KY-%A$X$M/0T$4-"S?>]/%B(-LB&C"K7.^.U9^D34HIZN0NAO
M//[($]3".8FL0N0@[4MK515%NB2:31OIN;DH'6 M\E(5/GI!ZB3K:8"G+E4 
M1A22R*KR2T)N':'@L4#X(D1@2A<*R#H96D)-\0(1'&;?2/:510M8A_;MN&J8
M6>1>5[I( ,.J7E5RE?&9AW+5NI*KC)>SC_]-6,*0'6,M\E45@#@]J(NT7'WQ
M A%),'/%Z"(X>?1B?!VIQ*OBL[ )BN,$UA<O$ &9T2CD 2CI/FN+K^0:]*M*
M9+EA=AA=W$6.$XVF6A*87LJ?+BHO#/\%Y-GS)_B='LSVXR.MX(K4%=WP LKU
MNXA'J&")*+S,GNO'86@_(4,#JOBJ"+$,?<M0^ZF8TDL"[@)/%]G$F7<3VB$&
MAH.E6!(DINYZMC J)C&S5 )3+SHM5KCX7HUXM(D*-1R*%!FP!Q;:?CZ/PPI'
M4A4*3,/9>QX&+!Q !T*+Q-)AA%Y7+-16BZV@+!(,%N+?1"-AY=435(JANS*%
M%"F:YLAT!I5JK"F<)C)D0U]\]0Q,@+,[%!#R\#1+PJ8;@7K]AO.*4#IME?"J
MC=MUAU6\@'K]*G9)"]5KK5Y>6J-@E81Z_<ZX@\%(XFF6A:7!2G_GW0[2JPC?
M)<,A*M\@$A:+I<P&T23%HM)FP"24N/+%0O!C(I*@6,P7YN"@B[CRQ4+$"O&O
M=C0:VQ/D+(!(N"0VOW)*S(X&N3?_RCD*($RD+!9\&@Q%#LTH/DDF+1.=APAD
MB":1%8L<^(Q-\**JBQ>+R'R[/ORM",,25HF]N#BG"JPB61*5Q)ZO?\#A-^O+
M%C+GEZ'WP'R8#6$R!3Q-D;#+D&-\H;YL$?-L>$"'7SS-,G)4RQ$P+P<@K4.P
M++R(WZ\-:0'J04-P_=/)U4M(7Z_J>X&M8!MC*Q1$0A16$ D%D5A#L()(E,I4
M$(DZK@HB4:&6@DBL(U)!)!1$0D$D$-P51*)6FH)(8,0KB$25: 614! )!9%8
M3P4%D4 *51 )!9%0$ FR< 614!")<K$*(J$@$@HB\1>%2!0=I"9(I% KC$:%
M#(714!@-\2)^OU:,QL6EPFA48C3X1-U_D7V@P!U; '>4EOL+X#A>$#.@T"-H
M-5\,/5+T@\TG%(Y#X3C*M5 XCDK1"L>A<!P*Q['*7.$X%(ZC6*#"<: $*AR'
MPG%@!2D<A\)QK"E6X3@4CD/A.!2.8RW]%(Y#X3@4CJ-:KL)Q["6.0\$H%(Q"
MP2AF+^+W:X-1S.GU$M+7J_H^P"C 4)O"*+[[R^ H(I]_*_UX:W"#?K=\?]KC
MC>E*TFN_M*+=,S0GA'0* MN_$T@R-#X$^76RMP,^4!B 99E7(R_*;9P-.O#Z
MP,*GU.FQ(3-OHVQ\4W"$2N8*CJ#@"-4B%1Q!P1$4' '!?9_@"!<#'-^J@B^(
M<IC'Y^($H"A6!>'Z4TU!A=)0*(T2F0JEL:+;WQZEH4 4+P^B6#WP@56 0*G0
M&PJ]42Y0H3<4>J-&N$)O*/1&N=@71&^D*Q1X,=7%%7:C5)K";BCLAKJ#0X%'
M",(4>$2!1[*?)?#(@(4P:=3&W&7:IU-U#T<E@"0*']0]'.D'ZAX.=0]'I5AU
M#\>\C+\=!J?H!YM3*."+ KZ4:Z& +Y6B%?!% 5\4\&65N;J'0R$\B@4JA =*
MH$)XJ'LXL((4A$0A.=84JY <"LFAD!P*R;&6?G]?)$?V?.6-&4_ \O>>[S-7
M@P1'BY*;PTG('5:X>I0]_X<=:SR\U>V)[8R8'G/N1SI,-?38CNY=-HQTT:[Z
MD(?W!^F3(#OJMJWO-V7)'IF3Q$P\SW$VNL:V.,]Q[:VC[N_!?0"N<N(S,3F=
M<5WZ<\K?[+;7$' %6NLB5O)P?)"^I,Q:G8V,.V#_3D QR*%G*L_]*950)R!@
ML1X-!5N'!^"U-[K/;SU'/QVF6D[9YJ]9N_6[U3RC)-"?XS0,^9!BN5FT/G:$
MB_+0[.I>\,#O9S;6!CP)'89G_$'LC]LQ=*!%SJ?CB3_E75DF:\V:QA1/NF\'
MMS.Y&:>IA/PMY=7NK>L9QZX]@8@XL_;\WS*3FRWEU02O_BN9X]QV0GX:1+$=
M.&RF]>)?,SG=WGI]_2,/\Y["=)<_V_HT%ET74LF#^1*9@<RMR+H:,6&GJ$! 
MKV9PP B8&FN5NU'3GRJXSW/->V>G\Y=WQRL[O&7Q7(1*7S.&UCKC>,XAUR_S
M@@6NG?X:7"]#?B>B=*[G@(<P]&1LHX/IAWE(-=9IM1'S)V+3!L84GZ78BI-4
MU+-?3*45%<G[Z>85*ZY2LU/3*ZLCS?&<&QY/?:_5,S?A^=[V_27?F?M3KO8Z
M!GE=W4<-;FIPFQ/07G_X48.;&MS4X+;3P4TY]VMT[D(G6^)LK#6%S[O-!S:T
M$S\NZS++'Z<2K>9^=9=SVPOT, G>">#T0?J6Y23K<X-1/(RAQ\UQ,WKK1 G?
M3@)GI)^E_X&]0<V#V4O6VZQU'&.9[QCT7&+<*=0W6\9]^_:M]O'X].SD@WA\
M6["2JQTTQ3D&S>%NX0)7U7*PNBN9*$2=MT-+5N?MU'&W4AGJN)LZ[B9>4F;7
M6;'%4U%_W"40/;)/OFI7H1U$(B'48F_,CC3#,/K=<?D0 ;/CK/H9 W%YIQ?L
M2Z6?"Q^5%[J'5F9^72G0?N+Y[# K?;A:.GT<W[M>^%7+X$BN!B]'$FTQI[DP
M1I1NO2TUU1^CIS3W<4"KM JB@[2TK&QZ,B_28KYC)7=LNKSG(@QG=-J[,EVA
MDO#D0L2-V5=-+!Z)+5)AN33A>GIAS1H!CX<K!R\67B#5W^<.M!I-YB-=^>B1
M_VSAM*W(6*':G[Z<RZFVRR8^?VK<0?F[D#5NO* AE'F)JI5[Q>&26QS>V+$S
MVDOG:-QYL2Z.7^_42R#/R4>M_&AXDAZW?N][+(AGI\.U S=;JOC^191:SR(O
M?E \;]6%D^+0J!M_U8"XQYQ%T[/Z=@A/G%??VR_^TA"@E 8TJ,BVCEW7$UL9
MMB_B0,VY\4I5%C5)Q!;,#9A6I*;BQ&W-A?<UBAE&M68UY"UK,_+^1N16<S/R
MS>INF6L?"S[)W-C5;IAC0\^ -GP^*M[NEQ_K7U&I_J3P,\G@"0:D\<ECG)T_
MD7W(.)N+/,_DYA;Z1G8( > I0W'="CB:YT39Z=OLT&7A:L^4X57:&6"@.=),
MXP?MH^WY"22C1UKS!RV%V&:/ I.I,=^>1,R%N8]NM"TM8JNG (O8=K!LF[K1
M[&#9&FT\VWZ[CV7;PW(U];[9QG)MX75MM7M8K@0+=-IHPQ)T[9H&NKGP7$TT
MSS[!K 9:U9:%[P=6!^T#! LT#3E<T7V68-BFV=JMKJ84NU*XFN@>B_8LH2NZ
MQZ)CEM 5W0T(8;MIR+$ FBM)5[1=Y7#M2O$L0M1N&N@>2[* C-&P::!' Y)G
M[5A72GPUT+F+''^E1&T3S?4U68#$%3UND;BB+4 :#='^2N(J);I8:%TI7%M2
M>H&<(19M ,H @^=J-*7T+5(<0/<M2M1N2LE=3#G-A1ZW2*.AC$Y Z%KH_-70
M3?R<VZ0XK QM82;;QL^-T+8U]9:4:;?1P=N E!.@E46O9QBZT<+W6L*2CM63
ML4Q"F'?CE^!,O8]?+"-EL6C+&I3Q:\>ZXA<W@2U^"8XR?$G)#/&]RR0$+L/"
M+[]0V@N?Q;4(*:<A*9'%YT8R!EN2JOCY 66QJ(MF2QD1C+:<7![-E6""CB5E
MEFA)63,MB 6O%T_ ]A=/<.<)'"37/YU<*01!#8* *00!03&%(% (@K\+@@"_
M5KP/"(+>]K.+CM[KX_-ARMP8G;RC+6#J)GY-CZ!KKR]C*:--2-TI&((6?ML(
MO?YFZBU+R@*<B?8"$E=TYDJ9&N-S=SFZDG;[I2 3S*Z456BTPU*FA2TI&QPF
M>K))L8"4S:C=,J5L&*"94E9Q\".WG/:7HRNI7Z%[*TE7=&^5$UNE>*N<(8NT
M[KIC=R5Q13N6'*ZD(0N?P._< ETIG0 /@I;3"^3X  F@AN9*P@](23()FP]2
M6HLTP*"YDK(!=.(F)\DD[<%)@0]8<N #A$! @0_T)>R_P'Q3"O;/Z,J!#[30
M-J# !_ '0BCP@0[AD $%F"$'/]## SY(>[SXOD 9OWI24F[\1AP)0("'D5 &
M,'Q[D?8B\<DA)7;A 3HD! %^O9"$()"RIM/")T<4KE+.L!  'Q0<"3[OI@P*
M9E/*Y$O"*<&FWNG+F=!(F7H4Q()7BR#@D_U'$%Q<*@1!#8( FE$A"/"**02!
M0A#\/1 $AM[OX[-WPMAJ$?:D\1OH';W?0JN+7]+HZ5W"KC1AAHQ/, @@@AY^
M60>M:U_O6OAU$L)N?Q?O!NA97$OO=/ 36?0J7(L$VY>RQD_ABD_?*=/CKI3I
M%GY)9_='+_&K&:3U72D7$?2D@ C:4F 4^%A(TE7.05DI%Q%(N3Y&TJ%>2\JE
M"?@#G13/PA^%(.DJ9?],RFT<<DY"R+F) 3_ D) 4<H*+E+5B? :[>T0=?D63
M,C? K^D2N+;P:X2DY$V*"Z#';<KX0M@T:DHYP$;:AY&"5#-VC  EI0-2!D-\
M=*'L%> /\U*0!!9A[8'@L0;A-C6"MCW\X(W?AVGI!G[I@7 RI(,_%4$Z=HH/
MW00D08L ,,4W& PT^&MT"$'&Q.?&!"A!6S<[4O+8'GY=AS*&=V68UL"?[Z= 
M"3HR4OF6E!/8!C[(4/:0V_A9(@5)(.$F D,GW$=!&1?E+.W)4!7?8TE@$AG#
MEUCHES%%,/$G$-$F@ @K!6]NR+F^MK?:7*\61N %^PLC\,0W,4U"!K\5C* :
M1@"F4C "O&(*1O#R,()GONG&^2_Y-CH%$;!"6-,."M*P5Y &W2* .PG#?+>+
MSY_0<U]+[TFXGMILPY0'G9JBE6V+6\*VCQ(PQ&U6VT<)&'JO)^&J 4L G64D
M?!9^DYS"5<+,UY)R6*F%/ZA#F$Q94NZ*L_ 0',+:K=5$+ZX1YGV6E*.0EI1;
M= D+=B1=9>PW6?C))&%70,KY2H)CR3&K'%TICH7?$B#I*N.R 0N?$9#<5<;H
M@F\LB@&D!"P9J[66E&\JL*0 VPAN11H)9=BU(P/7UI&2MA 2##F.11E<"(>6
MFQ3/DG%2T\+?RBPG9,O)W$BY@ R$@$78!Z"XEHPM]S;^## %(( _HXA7%J;<
M,KZHH*6;A'4'0C DP/TI;B#AVD1#[\K ![3UMI3;L@C'UO%+));>Q(<8BK*$
M;5'"\-5ORXC=/7P\I* #^OC[=PC#5U]*7M##8T_P>\.6;N!C#!X> /T6#W@G
MX ,(L%Q"(DMP+H)O]0A?+4'IM1(N&FA1MO+Q8X*A&U*R>4*((9B@)^%:1D-O
M]64,X?T"+WBU"($H?-A;A," A0\LU(1ZVJ=3==E #4H FE*A!/"**92 NFS@
M[[$SW]2[^$LI29<-X$_^E,TZS95<H*^;=5.ND\%5VKB9%5/C'0<!CVWAHBET
M1/MX?'IV\F&K68K9TKOX&A/2=<)Q8L)U!5T)W\_0HQQ0I>Q!X]?(2=<5X ]H
M4K[SH(<_J"T%TTPZ3"ICCMV4@[S%;VV3;BN0<G\T?EMK]U]Y@'=7.?='D\Z4
M2SE0C ]:<KB23I-*^=H#*6;%7V\KYYL$Y)S/E'.!-B6\RNFP<F[TE#/ [/H&
M !)7.;K*&+7D?)="&]UA*=<*X$]ERN$JY\N:2-]Z(.4V'/P="*3;"O SH]U_
M[0$>CD$98? 0;5)S[?:;I4@7&TLY_D] O)9B$8R5909QXK?&LHNK#)>V<V_?
MLC9Q=0%?4U-O$[Z0A'31P?;OP3/T=A\_!Z1<=(#/)PA !K.#3M7Q0(8.Y<(+
MRN%N?" A(!E:>A\/]*<$TPZ^UU,&:OQ9#]*E##* #!:^@Q'&/K/@('()5]+=
MZQOO8(NU7#)N<C&8AFSH,R?6W\<\I$;44B!$89"OP]D4Z_718[Y+58SRG0U=
M_ H:Z;*%W<[P**KB(S+)$8VZ<%3<X.<L'G%RBY,0>GBD)N4.A(T7#'L%L;=N
M !(V+-O3LF<;,?JQ[U\]31AU0X92?3E7_&)<LZ ^"R\9P&(>!K*X-Y]QRTH!
MS] .HB$/QYK8VA2NW31[XXA"875:%I7"Z! IK'Z;1M$VK66M%EY2#$2YE;+G
MZ=;KV_*?:BKM?^;1)1'X9Q)IM50H634[Q>]]CP7Q,X;EP&5#._'C[[7+X\&@
MH$,LDD^_:^/3R16-0'PY!XI@_AH.%,$R*J>N(\QSN/29'0F 3.!J+HNA/S(7
M>DH$!HFT)'"![\OBGP3F"N(_#Y_T\AK$/'%&A\,\>AP*>$^1ESI\\O15>P^_
MQ9Z_D<& 8BZO1N4:SU7UJ*)>U1^_^_WT[$-1\VX%V)0^ZH]C_\CJM(^T 1]/
ML3[#U"W*];J"\<7/XTN_JXV]( %"+3MXSP-WT2Z?X+?V.74Q"$=OBIJJT^^D
MC16A6BMWUT8*Q$I#UIO< ?[T)F U44APA3<$FF^5V[79;':-IMF^-KJ&H0.;
M-V^N1C! /3(G$>-JWB3:-R\>:3%\,N2^S[_E"#0V$66.4I*Y#\1HIW''2<(0
MNMRWD?#-G"-\'(^\2/.] /RZ0F/;M2?05>:5G?XM;<ANYTC QT*F?1._GDMI
MT[[SYL>&_?./#0@W\/N&NT_PWR@>^S__/U!+ 0(4 PH    ( ".663?*\;T'
MGAT  !*_ 0 2              "D@0    !E>&5C=71I;VY?;&]G+FAT;6Q0
52P4&      $  0!     SAT      
end

Mime
View raw message